{"text_format":"1","workbook":"xlsx","n_sheets":8,"sheets":["Hide from Carriers>>","Urban & Non-Urban Counties","Counties and Regions","Check Tab Number & County","Region_Map","Region, by Zip","Show to Carriers>>>","Table"],"not_rendered":{"charts":0,"images":0,"macros":1,"external_links":1,"defined_names":1,"comments":0,"pivot_tables":3},"unopened":[],"bounds":{"document_bytes":16777216,"sheet_cells":100000,"rows_first":2000,"rows_last":500,"rows_between":2000,"halvings":0,"cell_chars":16384,"cell_head_chars":4096},"cells_cut":0,"cells_raw":0,"read":"whole","date_system":"1900"}

{"sheet":"Hide from Carriers>>","index":0,"n_rows":0,"n_cols":0,"rows_kept":0,"cut":false,"hidden":true,"merged":[]}

{"sheet":"Urban & Non-Urban Counties","index":1,"n_rows":76,"n_cols":8,"rows_kept":76,"cut":false,"hidden":true,"merged":[]}
["Classification (Urban/Non-Urban)","Urban",null,"Classification (Urban/Non-Urban)","Non-Urban",null,"Classification (Urban/Non-Urban)","(All)"]
[]
["Row Labels",null,null,"Row Labels",null,null,"Row Labels"]
["Brown County",null,null,"Adams County",null,null,"Adams County"]
["Dane County",null,null,"Ashland County",null,null,"Ashland County"]
["Kenosha County",null,null,"Barron County",null,null,"Barron County"]
["Milwaukee County",null,null,"Bayfield County",null,null,"Bayfield County"]
["Ozaukee County",null,null,"Buffalo County",null,null,"Brown County"]
["Racine County",null,null,"Burnett County",null,null,"Buffalo County"]
["Washington County",null,null,"Calumet County",null,null,"Burnett County"]
["Waukesha County",null,null,"Chippewa County",null,null,"Calumet County"]
["Grand Total",null,null,"Clark County",null,null,"Chippewa County"]
[null,null,null,"Columbia County",null,null,"Clark County"]
[null,null,null,"Crawford County",null,null,"Columbia County"]
[null,null,null,"Dodge County",null,null,"Crawford County"]
[null,null,null,"Door County",null,null,"Dane County"]
[null,null,null,"Douglas County",null,null,"Dodge County"]
[null,null,null,"Dunn County",null,null,"Door County"]
[null,null,null,"Eau Claire County",null,null,"Douglas County"]
[null,null,null,"Florence County",null,null,"Dunn County"]
[null,null,null,"Fond Du Lac County",null,null,"Eau Claire County"]
[null,null,null,"Forest County",null,null,"Florence County"]
[null,null,null,"Grant County",null,null,"Fond Du Lac County"]
[null,null,null,"Green County",null,null,"Forest County"]
[null,null,null,"Green Lake County",null,null,"Grant County"]
[null,null,null,"Iowa County",null,null,"Green County"]
[null,null,null,"Iron County",null,null,"Green Lake County"]
[null,null,null,"Jackson County",null,null,"Iowa County"]
[null,null,null,"Jefferson County",null,null,"Iron County"]
[null,null,null,"Juneau County",null,null,"Jackson County"]
[null,null,null,"Kewaunee County",null,null,"Jefferson County"]
[null,null,null,"La Crosse County",null,null,"Juneau County"]
[null,null,null,"Lafayette County",null,null,"Kenosha County"]
[null,null,null,"Langlade County",null,null,"Kewaunee County"]
[null,null,null,"Lincoln County",null,null,"La Crosse County"]
[null,null,null,"Manitowoc County",null,null,"Lafayette County"]
[null,null,null,"Marathon County",null,null,"Langlade County"]
[null,null,null,"Marinette County",null,null,"Lincoln County"]
[null,null,null,"Marquette County",null,null,"Manitowoc County"]
[null,null,null,"Menominee County",null,null,"Marathon County"]
[null,null,null,"Monroe County",null,null,"Marinette County"]
[null,null,null,"Oconto County",null,null,"Marquette County"]
[null,null,null,"Oneida County",null,null,"Menominee County"]
[null,null,null,"Outagamie County",null,null,"Milwaukee County"]
[null,null,null,"Pepin County",null,null,"Monroe County"]
[null,null,null,"Pierce County",null,null,"Oconto County"]
[null,null,null,"Polk County",null,null,"Oneida County"]
[null,null,null,"Portage County",null,null,"Outagamie County"]
[null,null,null,"Price County",null,null,"Ozaukee County"]
[null,null,null,"Richland County",null,null,"Pepin County"]
[null,null,null,"Rock County",null,null,"Pierce County"]
[null,null,null,"Rusk County",null,null,"Polk County"]
[null,null,null,"Sauk County",null,null,"Portage County"]
[null,null,null,"Sawyer County",null,null,"Price County"]
[null,null,null,"Shawano County",null,null,"Racine County"]
[null,null,null,"Sheboygan County",null,null,"Richland County"]
[null,null,null,"St. Croix County",null,null,"Rock County"]
[null,null,null,"Taylor County",null,null,"Rusk County"]
[null,null,null,"Trempealeau County",null,null,"Sauk County"]
[null,null,null,"Vernon County",null,null,"Sawyer County"]
[null,null,null,"Vilas County",null,null,"Shawano County"]
[null,null,null,"Walworth County",null,null,"Sheboygan County"]
[null,null,null,"Washburn County",null,null,"St. Croix County"]
[null,null,null,"Waupaca County",null,null,"Taylor County"]
[null,null,null,"Waushara County",null,null,"Trempealeau County"]
[null,null,null,"Winnebago County",null,null,"Vernon County"]
[null,null,null,"Wood County",null,null,"Vilas County"]
[null,null,null,"Grand Total",null,null,"Walworth County"]
[null,null,null,null,null,null,"Washburn County"]
[null,null,null,null,null,null,"Washington County"]
[null,null,null,null,null,null,"Waukesha County"]
[null,null,null,null,null,null,"Waupaca County"]
[null,null,null,null,null,null,"Waushara County"]
[null,null,null,null,null,null,"Winnebago County"]
[null,null,null,null,null,null,"Wood County"]
[null,null,null,null,null,null,"Grand Total"]

{"sheet":"Counties and Regions","index":2,"n_rows":74,"n_cols":13,"rows_kept":74,"cut":false,"hidden":true,"merged":[]}
[]
[null,"Southern","Eastern","Western","Northern",null,"Number","Text","County","Region","Urban/Non-Urban",null,"Check"]
[null,"Adams County","Kenosha County","Barron County","Ashland County",null,1,{"$f":"TEXT(G3,\"##\")","v":"1"},{"$f":"B3","v":"Adams County"},{"$f":"$B$2","v":"Southern"},{"$f":"IF(ISNA(VLOOKUP(I3,'[1]Urban & Non-Urban Counties'!$A$4:$A$11,1,FALSE)),\"Non-Urban\",\"Urban\")","v":"Non-Urban"},{"$f":"VLOOKUP(I3,[1]Region_Map!$A$4:$C$75,3,FALSE)","v":"Southern"},{"$f":"IF(L3=J3,\"OK\",\"error\")","v":"OK"}]
[null,"Columbia County","Milwaukee County","Buffalo County","Bayfield County",null,{"$f":"G3+1","v":2},{"$f":"TEXT(G4,\"##\")","v":"2"},{"$f":"B4","v":"Columbia County"},{"$f":"$B$2","v":"Southern"},{"$f":"IF(ISNA(VLOOKUP(I4,'[1]Urban & Non-Urban Counties'!$A$4:$A$11,1,FALSE)),\"Non-Urban\",\"Urban\")","v":"Non-Urban"},{"$f":"VLOOKUP(I4,[1]Region_Map!$A$4:$C$75,3,FALSE)","v":"Southern"},{"$f":"IF(L4=J4,\"OK\",\"error\")","v":"OK"}]
[null,"Crawford County","Ozaukee County","Burnett County","Florence County",null,{"$f":"G4+1","v":3},"3","Crawford County","Southern",{"$f":"IF(ISNA(VLOOKUP(I5,'[1]Urban & Non-Urban Counties'!$A$4:$A$11,1,FALSE)),\"Non-Urban\",\"Urban\")","v":"Non-Urban"},{"$f":"VLOOKUP(I5,[1]Region_Map!$A$4:$C$75,3,FALSE)","v":"Southern"},"OK"]
[null,"Dane County","Racine County","Chippewa County","Forest County",null,4,"4","Dane County","Southern",{"$f":"IF(ISNA(VLOOKUP(I6,'[1]Urban & Non-Urban Counties'!$A$4:$A$11,1,FALSE)),\"Non-Urban\",\"Urban\")","v":"Urban"},{"$f":"VLOOKUP(I6,[1]Region_Map!$A$4:$C$75,3,FALSE)","v":"Southern"},"OK"]
[null,"Dodge County","Washington County","Clark County","Iron County",null,5,"5","Dodge County","Southern",{"$f":"IF(ISNA(VLOOKUP(I7,'[1]Urban & Non-Urban Counties'!$A$4:$A$11,1,FALSE)),\"Non-Urban\",\"Urban\")","v":"Non-Urban"},{"$f":"VLOOKUP(I7,[1]Region_Map!$A$4:$C$75,3,FALSE)","v":"Southern"},"OK"]
[null,"Grant County","Waukesha County","Douglas County","Langlade County",null,6,"6","Grant County","Southern",{"$f":"IF(ISNA(VLOOKUP(I8,'[1]Urban & Non-Urban Counties'!$A$4:$A$11,1,FALSE)),\"Non-Urban\",\"Urban\")","v":"Non-Urban"},{"$f":"VLOOKUP(I8,[1]Region_Map!$A$4:$C$75,3,FALSE)","v":"Southern"},"OK"]
[null,"Green County","Brown County","Dunn County","Lincoln County",null,7,"7","Green County","Southern",{"$f":"IF(ISNA(VLOOKUP(I9,'[1]Urban & Non-Urban Counties'!$A$4:$A$11,1,FALSE)),\"Non-Urban\",\"Urban\")","v":"Non-Urban"},{"$f":"VLOOKUP(I9,[1]Region_Map!$A$4:$C$75,3,FALSE)","v":"Southern"},"OK"]
[null,"Iowa County","Calumet County","Eau Claire County","Marathon County",null,8,"8","Iowa County","Southern",{"$f":"IF(ISNA(VLOOKUP(I10,'[1]Urban & Non-Urban Counties'!$A$4:$A$11,1,FALSE)),\"Non-Urban\",\"Urban\")","v":"Non-Urban"},{"$f":"VLOOKUP(I10,[1]Region_Map!$A$4:$C$75,3,FALSE)","v":"Southern"},"OK"]
[null,"Jefferson County","Door County","Jackson County","Oneida County",null,9,"9","Jefferson County","Southern",{"$f":"IF(ISNA(VLOOKUP(I11,'[1]Urban & Non-Urban Counties'!$A$4:$A$11,1,FALSE)),\"Non-Urban\",\"Urban\")","v":"Non-Urban"},{"$f":"VLOOKUP(I11,[1]Region_Map!$A$4:$C$75,3,FALSE)","v":"Southern"},"OK"]
[null,"Juneau County","Fond du Lac County","Pepin County","Portage County",null,10,"10","Juneau County","Southern",{"$f":"IF(ISNA(VLOOKUP(I12,'[1]Urban & Non-Urban Counties'!$A$4:$A$11,1,FALSE)),\"Non-Urban\",\"Urban\")","v":"Non-Urban"},{"$f":"VLOOKUP(I12,[1]Region_Map!$A$4:$C$75,3,FALSE)","v":"Southern"},"OK"]
[null,"Lafayette County","Green Lake County","Pierce County","Price County",null,11,"11","Lafayette County","Southern",{"$f":"IF(ISNA(VLOOKUP(I13,'[1]Urban & Non-Urban Counties'!$A$4:$A$11,1,FALSE)),\"Non-Urban\",\"Urban\")","v":"Non-Urban"},{"$f":"VLOOKUP(I13,[1]Region_Map!$A$4:$C$75,3,FALSE)","v":"Southern"},"OK"]
[null,"La Crosse County","Kewaunee County","Polk County","Sawyer County",null,12,"12","La Crosse County","Southern",{"$f":"IF(ISNA(VLOOKUP(I14,'[1]Urban & Non-Urban Counties'!$A$4:$A$11,1,FALSE)),\"Non-Urban\",\"Urban\")","v":"Non-Urban"},{"$f":"VLOOKUP(I14,[1]Region_Map!$A$4:$C$75,3,FALSE)","v":"Southern"},"OK"]
[null,"Monroe County","Manitowoc County","Rusk County","Taylor County",null,13,"13","Monroe County","Southern",{"$f":"IF(ISNA(VLOOKUP(I15,'[1]Urban & Non-Urban Counties'!$A$4:$A$11,1,FALSE)),\"Non-Urban\",\"Urban\")","v":"Non-Urban"},{"$f":"VLOOKUP(I15,[1]Region_Map!$A$4:$C$75,3,FALSE)","v":"Southern"},"OK"]
[null,"Richland County","Marinette County","St. Croix County","Vilas County",null,14,"14","Richland County","Southern",{"$f":"IF(ISNA(VLOOKUP(I16,'[1]Urban & Non-Urban Counties'!$A$4:$A$11,1,FALSE)),\"Non-Urban\",\"Urban\")","v":"Non-Urban"},{"$f":"VLOOKUP(I16,[1]Region_Map!$A$4:$C$75,3,FALSE)","v":"Southern"},"OK"]
[null,"Rock County","Marquette County","Trempealeau County","Wood County",null,15,"15","Rock County","Southern",{"$f":"IF(ISNA(VLOOKUP(I17,'[1]Urban & Non-Urban Counties'!$A$4:$A$11,1,FALSE)),\"Non-Urban\",\"Urban\")","v":"Non-Urban"},{"$f":"VLOOKUP(I17,[1]Region_Map!$A$4:$C$75,3,FALSE)","v":"Southern"},"OK"]
[null,"Sauk County","Menominee County","Washburn County",null,null,16,"16","Sauk County","Southern",{"$f":"IF(ISNA(VLOOKUP(I18,'[1]Urban & Non-Urban Counties'!$A$4:$A$11,1,FALSE)),\"Non-Urban\",\"Urban\")","v":"Non-Urban"},{"$f":"VLOOKUP(I18,[1]Region_Map!$A$4:$C$75,3,FALSE)","v":"Southern"},"OK"]
[null,"Vernon County","Oconto County",null,null,null,17,"17","Vernon County","Southern",{"$f":"IF(ISNA(VLOOKUP(I19,'[1]Urban & Non-Urban Counties'!$A$4:$A$11,1,FALSE)),\"Non-Urban\",\"Urban\")","v":"Non-Urban"},{"$f":"VLOOKUP(I19,[1]Region_Map!$A$4:$C$75,3,FALSE)","v":"Southern"},"OK"]
[null,"Walworth County","Outagamie County",null,null,null,18,"18","Walworth County","Southern",{"$f":"IF(ISNA(VLOOKUP(I20,'[1]Urban & Non-Urban Counties'!$A$4:$A$11,1,FALSE)),\"Non-Urban\",\"Urban\")","v":"Non-Urban"},{"$f":"VLOOKUP(I20,[1]Region_Map!$A$4:$C$75,3,FALSE)","v":"Southern"},"OK"]
[null,null,"Shawano County",null,null,null,19,"19",{"$f":"C3","v":"Kenosha County"},{"$f":"$C$2","v":"Eastern"},{"$f":"IF(ISNA(VLOOKUP(I21,'[1]Urban & Non-Urban Counties'!$A$4:$A$11,1,FALSE)),\"Non-Urban\",\"Urban\")","v":"Urban"},{"$f":"VLOOKUP(I21,[1]Region_Map!$A$4:$C$75,3,FALSE)","v":"Eastern"},"OK"]
[null,null,"Sheboygan County",null,null,null,20,"20",{"$f":"C4","v":"Milwaukee County"},"Eastern",{"$f":"IF(ISNA(VLOOKUP(I22,'[1]Urban & Non-Urban Counties'!$A$4:$A$11,1,FALSE)),\"Non-Urban\",\"Urban\")","v":"Urban"},{"$f":"VLOOKUP(I22,[1]Region_Map!$A$4:$C$75,3,FALSE)","v":"Eastern"},"OK"]
[null,null,"Waupaca County",null,null,null,21,"21","Ozaukee County","Eastern",{"$f":"IF(ISNA(VLOOKUP(I23,'[1]Urban & Non-Urban Counties'!$A$4:$A$11,1,FALSE)),\"Non-Urban\",\"Urban\")","v":"Urban"},{"$f":"VLOOKUP(I23,[1]Region_Map!$A$4:$C$75,3,FALSE)","v":"Eastern"},"OK"]
[null,null,"Waushara County",null,null,null,22,"22","Racine County","Eastern",{"$f":"IF(ISNA(VLOOKUP(I24,'[1]Urban & Non-Urban Counties'!$A$4:$A$11,1,FALSE)),\"Non-Urban\",\"Urban\")","v":"Urban"},{"$f":"VLOOKUP(I24,[1]Region_Map!$A$4:$C$75,3,FALSE)","v":"Eastern"},"OK"]
[null,null,"Winnebago County",null,null,null,23,"23","Washington County","Eastern",{"$f":"IF(ISNA(VLOOKUP(I25,'[1]Urban & Non-Urban Counties'!$A$4:$A$11,1,FALSE)),\"Non-Urban\",\"Urban\")","v":"Urban"},{"$f":"VLOOKUP(I25,[1]Region_Map!$A$4:$C$75,3,FALSE)","v":"Eastern"},"OK"]
[null,null,null,null,null,null,24,"24","Waukesha County","Eastern",{"$f":"IF(ISNA(VLOOKUP(I26,'[1]Urban & Non-Urban Counties'!$A$4:$A$11,1,FALSE)),\"Non-Urban\",\"Urban\")","v":"Urban"},{"$f":"VLOOKUP(I26,[1]Region_Map!$A$4:$C$75,3,FALSE)","v":"Eastern"},"OK"]
[null,null,null,null,null,null,25,"25","Brown County","Eastern",{"$f":"IF(ISNA(VLOOKUP(I27,'[1]Urban & Non-Urban Counties'!$A$4:$A$11,1,FALSE)),\"Non-Urban\",\"Urban\")","v":"Urban"},{"$f":"VLOOKUP(I27,[1]Region_Map!$A$4:$C$75,3,FALSE)","v":"Eastern"},"OK"]
[null,null,null,null,null,null,26,"26","Calumet County","Eastern",{"$f":"IF(ISNA(VLOOKUP(I28,'[1]Urban & Non-Urban Counties'!$A$4:$A$11,1,FALSE)),\"Non-Urban\",\"Urban\")","v":"Non-Urban"},{"$f":"VLOOKUP(I28,[1]Region_Map!$A$4:$C$75,3,FALSE)","v":"Eastern"},"OK"]
[null,null,null,null,null,null,27,"27","Door County","Eastern",{"$f":"IF(ISNA(VLOOKUP(I29,'[1]Urban & Non-Urban Counties'!$A$4:$A$11,1,FALSE)),\"Non-Urban\",\"Urban\")","v":"Non-Urban"},{"$f":"VLOOKUP(I29,[1]Region_Map!$A$4:$C$75,3,FALSE)","v":"Eastern"},"OK"]
[null,null,null,null,null,null,28,"28","Fond du Lac County","Eastern",{"$f":"IF(ISNA(VLOOKUP(I30,'[1]Urban & Non-Urban Counties'!$A$4:$A$11,1,FALSE)),\"Non-Urban\",\"Urban\")","v":"Non-Urban"},{"$f":"VLOOKUP(I30,[1]Region_Map!$A$4:$C$75,3,FALSE)","v":"Eastern"},"OK"]
[null,null,null,null,null,null,29,"29","Green Lake County","Eastern",{"$f":"IF(ISNA(VLOOKUP(I31,'[1]Urban & Non-Urban Counties'!$A$4:$A$11,1,FALSE)),\"Non-Urban\",\"Urban\")","v":"Non-Urban"},{"$f":"VLOOKUP(I31,[1]Region_Map!$A$4:$C$75,3,FALSE)","v":"Eastern"},"OK"]
[null,null,null,null,null,null,30,"30","Kewaunee County","Eastern",{"$f":"IF(ISNA(VLOOKUP(I32,'[1]Urban & Non-Urban Counties'!$A$4:$A$11,1,FALSE)),\"Non-Urban\",\"Urban\")","v":"Non-Urban"},{"$f":"VLOOKUP(I32,[1]Region_Map!$A$4:$C$75,3,FALSE)","v":"Eastern"},"OK"]
[null,null,null,null,null,null,31,"31","Manitowoc County","Eastern",{"$f":"IF(ISNA(VLOOKUP(I33,'[1]Urban & Non-Urban Counties'!$A$4:$A$11,1,FALSE)),\"Non-Urban\",\"Urban\")","v":"Non-Urban"},{"$f":"VLOOKUP(I33,[1]Region_Map!$A$4:$C$75,3,FALSE)","v":"Eastern"},"OK"]
[null,null,null,null,null,null,32,"32","Marinette County","Eastern",{"$f":"IF(ISNA(VLOOKUP(I34,'[1]Urban & Non-Urban Counties'!$A$4:$A$11,1,FALSE)),\"Non-Urban\",\"Urban\")","v":"Non-Urban"},{"$f":"VLOOKUP(I34,[1]Region_Map!$A$4:$C$75,3,FALSE)","v":"Eastern"},"OK"]
[null,null,null,null,null,null,33,"33","Marquette County","Eastern",{"$f":"IF(ISNA(VLOOKUP(I35,'[1]Urban & Non-Urban Counties'!$A$4:$A$11,1,FALSE)),\"Non-Urban\",\"Urban\")","v":"Non-Urban"},{"$f":"VLOOKUP(I35,[1]Region_Map!$A$4:$C$75,3,FALSE)","v":"Eastern"},"OK"]
[null,null,null,null,null,null,34,"34","Menominee County","Eastern",{"$f":"IF(ISNA(VLOOKUP(I36,'[1]Urban & Non-Urban Counties'!$A$4:$A$11,1,FALSE)),\"Non-Urban\",\"Urban\")","v":"Non-Urban"},{"$f":"VLOOKUP(I36,[1]Region_Map!$A$4:$C$75,3,FALSE)","v":"Eastern"},"OK"]
[null,null,null,null,null,null,35,"35","Oconto County","Eastern",{"$f":"IF(ISNA(VLOOKUP(I37,'[1]Urban & Non-Urban Counties'!$A$4:$A$11,1,FALSE)),\"Non-Urban\",\"Urban\")","v":"Non-Urban"},{"$f":"VLOOKUP(I37,[1]Region_Map!$A$4:$C$75,3,FALSE)","v":"Eastern"},"OK"]
[null,null,null,null,null,null,36,"36","Outagamie County","Eastern",{"$f":"IF(ISNA(VLOOKUP(I38,'[1]Urban & Non-Urban Counties'!$A$4:$A$11,1,FALSE)),\"Non-Urban\",\"Urban\")","v":"Non-Urban"},{"$f":"VLOOKUP(I38,[1]Region_Map!$A$4:$C$75,3,FALSE)","v":"Eastern"},"OK"]
[null,null,null,null,null,null,37,"37","Shawano County","Eastern",{"$f":"IF(ISNA(VLOOKUP(I39,'[1]Urban & Non-Urban Counties'!$A$4:$A$11,1,FALSE)),\"Non-Urban\",\"Urban\")","v":"Non-Urban"},{"$f":"VLOOKUP(I39,[1]Region_Map!$A$4:$C$75,3,FALSE)","v":"Eastern"},"OK"]
[null,null,null,null,null,null,38,"38","Sheboygan County","Eastern",{"$f":"IF(ISNA(VLOOKUP(I40,'[1]Urban & Non-Urban Counties'!$A$4:$A$11,1,FALSE)),\"Non-Urban\",\"Urban\")","v":"Non-Urban"},{"$f":"VLOOKUP(I40,[1]Region_Map!$A$4:$C$75,3,FALSE)","v":"Eastern"},"OK"]
[null,null,null,null,null,null,39,"39","Waupaca County","Eastern",{"$f":"IF(ISNA(VLOOKUP(I41,'[1]Urban & Non-Urban Counties'!$A$4:$A$11,1,FALSE)),\"Non-Urban\",\"Urban\")","v":"Non-Urban"},{"$f":"VLOOKUP(I41,[1]Region_Map!$A$4:$C$75,3,FALSE)","v":"Eastern"},"OK"]
[null,null,null,null,null,null,40,"40","Waushara County","Eastern",{"$f":"IF(ISNA(VLOOKUP(I42,'[1]Urban & Non-Urban Counties'!$A$4:$A$11,1,FALSE)),\"Non-Urban\",\"Urban\")","v":"Non-Urban"},{"$f":"VLOOKUP(I42,[1]Region_Map!$A$4:$C$75,3,FALSE)","v":"Eastern"},"OK"]
[null,null,null,null,null,null,41,"41","Winnebago County","Eastern",{"$f":"IF(ISNA(VLOOKUP(I43,'[1]Urban & Non-Urban Counties'!$A$4:$A$11,1,FALSE)),\"Non-Urban\",\"Urban\")","v":"Non-Urban"},{"$f":"VLOOKUP(I43,[1]Region_Map!$A$4:$C$75,3,FALSE)","v":"Eastern"},"OK"]
[null,null,null,null,null,null,42,"42",{"$f":"D3","v":"Barron County"},{"$f":"$D$2","v":"Western"},{"$f":"IF(ISNA(VLOOKUP(I44,'[1]Urban & Non-Urban Counties'!$A$4:$A$11,1,FALSE)),\"Non-Urban\",\"Urban\")","v":"Non-Urban"},{"$f":"VLOOKUP(I44,[1]Region_Map!$A$4:$C$75,3,FALSE)","v":"Western"},"OK"]
[null,null,null,null,null,null,43,"43",{"$f":"D4","v":"Buffalo County"},"Western",{"$f":"IF(ISNA(VLOOKUP(I45,'[1]Urban & Non-Urban Counties'!$A$4:$A$11,1,FALSE)),\"Non-Urban\",\"Urban\")","v":"Non-Urban"},{"$f":"VLOOKUP(I45,[1]Region_Map!$A$4:$C$75,3,FALSE)","v":"Western"},"OK"]
[null,null,null,null,null,null,44,"44","Burnett County","Western",{"$f":"IF(ISNA(VLOOKUP(I46,'[1]Urban & Non-Urban Counties'!$A$4:$A$11,1,FALSE)),\"Non-Urban\",\"Urban\")","v":"Non-Urban"},{"$f":"VLOOKUP(I46,[1]Region_Map!$A$4:$C$75,3,FALSE)","v":"Western"},"OK"]
[null,null,null,null,null,null,45,"45","Chippewa County","Western",{"$f":"IF(ISNA(VLOOKUP(I47,'[1]Urban & Non-Urban Counties'!$A$4:$A$11,1,FALSE)),\"Non-Urban\",\"Urban\")","v":"Non-Urban"},{"$f":"VLOOKUP(I47,[1]Region_Map!$A$4:$C$75,3,FALSE)","v":"Western"},"OK"]
[null,null,null,null,null,null,46,"46","Clark County","Western",{"$f":"IF(ISNA(VLOOKUP(I48,'[1]Urban & Non-Urban Counties'!$A$4:$A$11,1,FALSE)),\"Non-Urban\",\"Urban\")","v":"Non-Urban"},{"$f":"VLOOKUP(I48,[1]Region_Map!$A$4:$C$75,3,FALSE)","v":"Western"},"OK"]
[null,null,null,null,null,null,47,"47","Douglas County","Western",{"$f":"IF(ISNA(VLOOKUP(I49,'[1]Urban & Non-Urban Counties'!$A$4:$A$11,1,FALSE)),\"Non-Urban\",\"Urban\")","v":"Non-Urban"},{"$f":"VLOOKUP(I49,[1]Region_Map!$A$4:$C$75,3,FALSE)","v":"Western"},"OK"]
[null,null,null,null,null,null,48,"48","Dunn County","Western",{"$f":"IF(ISNA(VLOOKUP(I50,'[1]Urban & Non-Urban Counties'!$A$4:$A$11,1,FALSE)),\"Non-Urban\",\"Urban\")","v":"Non-Urban"},{"$f":"VLOOKUP(I50,[1]Region_Map!$A$4:$C$75,3,FALSE)","v":"Western"},"OK"]
[null,null,null,null,null,null,49,"49","Eau Claire County","Western",{"$f":"IF(ISNA(VLOOKUP(I51,'[1]Urban & Non-Urban Counties'!$A$4:$A$11,1,FALSE)),\"Non-Urban\",\"Urban\")","v":"Non-Urban"},{"$f":"VLOOKUP(I51,[1]Region_Map!$A$4:$C$75,3,FALSE)","v":"Western"},"OK"]
[null,null,null,null,null,null,50,"50","Jackson County","Western",{"$f":"IF(ISNA(VLOOKUP(I52,'[1]Urban & Non-Urban Counties'!$A$4:$A$11,1,FALSE)),\"Non-Urban\",\"Urban\")","v":"Non-Urban"},{"$f":"VLOOKUP(I52,[1]Region_Map!$A$4:$C$75,3,FALSE)","v":"Western"},"OK"]
[null,null,null,null,null,null,51,"51","Pepin County","Western",{"$f":"IF(ISNA(VLOOKUP(I53,'[1]Urban & Non-Urban Counties'!$A$4:$A$11,1,FALSE)),\"Non-Urban\",\"Urban\")","v":"Non-Urban"},{"$f":"VLOOKUP(I53,[1]Region_Map!$A$4:$C$75,3,FALSE)","v":"Western"},"OK"]
[null,null,null,null,null,null,52,"52","Pierce County","Western",{"$f":"IF(ISNA(VLOOKUP(I54,'[1]Urban & Non-Urban Counties'!$A$4:$A$11,1,FALSE)),\"Non-Urban\",\"Urban\")","v":"Non-Urban"},{"$f":"VLOOKUP(I54,[1]Region_Map!$A$4:$C$75,3,FALSE)","v":"Western"},"OK"]
[null,null,null,null,null,null,53,"53","Polk County","Western",{"$f":"IF(ISNA(VLOOKUP(I55,'[1]Urban & Non-Urban Counties'!$A$4:$A$11,1,FALSE)),\"Non-Urban\",\"Urban\")","v":"Non-Urban"},{"$f":"VLOOKUP(I55,[1]Region_Map!$A$4:$C$75,3,FALSE)","v":"Western"},"OK"]
[null,null,null,null,null,null,54,"54","Rusk County","Western",{"$f":"IF(ISNA(VLOOKUP(I56,'[1]Urban & Non-Urban Counties'!$A$4:$A$11,1,FALSE)),\"Non-Urban\",\"Urban\")","v":"Non-Urban"},{"$f":"VLOOKUP(I56,[1]Region_Map!$A$4:$C$75,3,FALSE)","v":"Western"},"OK"]
[null,null,null,null,null,null,55,"55","St. Croix County","Western",{"$f":"IF(ISNA(VLOOKUP(I57,'[1]Urban & Non-Urban Counties'!$A$4:$A$11,1,FALSE)),\"Non-Urban\",\"Urban\")","v":"Non-Urban"},{"$f":"VLOOKUP(I57,[1]Region_Map!$A$4:$C$75,3,FALSE)","v":"Western"},"OK"]
[null,null,null,null,null,null,56,"56","Trempealeau County","Western",{"$f":"IF(ISNA(VLOOKUP(I58,'[1]Urban & Non-Urban Counties'!$A$4:$A$11,1,FALSE)),\"Non-Urban\",\"Urban\")","v":"Non-Urban"},{"$f":"VLOOKUP(I58,[1]Region_Map!$A$4:$C$75,3,FALSE)","v":"Western"},"OK"]
[null,null,null,null,null,null,57,"57","Washburn County","Western",{"$f":"IF(ISNA(VLOOKUP(I59,'[1]Urban & Non-Urban Counties'!$A$4:$A$11,1,FALSE)),\"Non-Urban\",\"Urban\")","v":"Non-Urban"},{"$f":"VLOOKUP(I59,[1]Region_Map!$A$4:$C$75,3,FALSE)","v":"Western"},"OK"]
[null,null,null,null,null,null,58,"58",{"$f":"E3","v":"Ashland County"},{"$f":"$E$2","v":"Northern"},{"$f":"IF(ISNA(VLOOKUP(I60,'[1]Urban & Non-Urban Counties'!$A$4:$A$11,1,FALSE)),\"Non-Urban\",\"Urban\")","v":"Non-Urban"},{"$f":"VLOOKUP(I60,[1]Region_Map!$A$4:$C$75,3,FALSE)","v":"Northern"},"OK"]
[null,null,null,null,null,null,59,"59",{"$f":"E4","v":"Bayfield County"},"Northern",{"$f":"IF(ISNA(VLOOKUP(I61,'[1]Urban & Non-Urban Counties'!$A$4:$A$11,1,FALSE)),\"Non-Urban\",\"Urban\")","v":"Non-Urban"},{"$f":"VLOOKUP(I61,[1]Region_Map!$A$4:$C$75,3,FALSE)","v":"Northern"},"OK"]
[null,null,null,null,null,null,60,"60","Florence County","Northern",{"$f":"IF(ISNA(VLOOKUP(I62,'[1]Urban & Non-Urban Counties'!$A$4:$A$11,1,FALSE)),\"Non-Urban\",\"Urban\")","v":"Non-Urban"},{"$f":"VLOOKUP(I62,[1]Region_Map!$A$4:$C$75,3,FALSE)","v":"Northern"},"OK"]
[null,null,null,null,null,null,61,"61","Forest County","Northern",{"$f":"IF(ISNA(VLOOKUP(I63,'[1]Urban & Non-Urban Counties'!$A$4:$A$11,1,FALSE)),\"Non-Urban\",\"Urban\")","v":"Non-Urban"},{"$f":"VLOOKUP(I63,[1]Region_Map!$A$4:$C$75,3,FALSE)","v":"Northern"},"OK"]
[null,null,null,null,null,null,62,"62","Iron County","Northern",{"$f":"IF(ISNA(VLOOKUP(I64,'[1]Urban & Non-Urban Counties'!$A$4:$A$11,1,FALSE)),\"Non-Urban\",\"Urban\")","v":"Non-Urban"},{"$f":"VLOOKUP(I64,[1]Region_Map!$A$4:$C$75,3,FALSE)","v":"Northern"},"OK"]
[null,null,null,null,null,null,63,"63","Langlade County","Northern",{"$f":"IF(ISNA(VLOOKUP(I65,'[1]Urban & Non-Urban Counties'!$A$4:$A$11,1,FALSE)),\"Non-Urban\",\"Urban\")","v":"Non-Urban"},{"$f":"VLOOKUP(I65,[1]Region_Map!$A$4:$C$75,3,FALSE)","v":"Northern"},"OK"]
[null,null,null,null,null,null,64,"64","Lincoln County","Northern",{"$f":"IF(ISNA(VLOOKUP(I66,'[1]Urban & Non-Urban Counties'!$A$4:$A$11,1,FALSE)),\"Non-Urban\",\"Urban\")","v":"Non-Urban"},{"$f":"VLOOKUP(I66,[1]Region_Map!$A$4:$C$75,3,FALSE)","v":"Northern"},"OK"]
[null,null,null,null,null,null,65,"65","Marathon County","Northern",{"$f":"IF(ISNA(VLOOKUP(I67,'[1]Urban & Non-Urban Counties'!$A$4:$A$11,1,FALSE)),\"Non-Urban\",\"Urban\")","v":"Non-Urban"},{"$f":"VLOOKUP(I67,[1]Region_Map!$A$4:$C$75,3,FALSE)","v":"Northern"},"OK"]
[null,null,null,null,null,null,66,{"$f":"TEXT(G68,\"##\")","v":"66"},"Oneida County","Northern",{"$f":"IF(ISNA(VLOOKUP(I68,'[1]Urban & Non-Urban Counties'!$A$4:$A$11,1,FALSE)),\"Non-Urban\",\"Urban\")","v":"Non-Urban"},{"$f":"VLOOKUP(I68,[1]Region_Map!$A$4:$C$75,3,FALSE)","v":"Northern"},{"$f":"IF(L68=J68,\"OK\",\"error\")","v":"OK"}]
[null,null,null,null,null,null,{"$f":"G68+1","v":67},"67","Portage County","Northern",{"$f":"IF(ISNA(VLOOKUP(I69,'[1]Urban & Non-Urban Counties'!$A$4:$A$11,1,FALSE)),\"Non-Urban\",\"Urban\")","v":"Non-Urban"},{"$f":"VLOOKUP(I69,[1]Region_Map!$A$4:$C$75,3,FALSE)","v":"Northern"},"OK"]
[null,null,null,null,null,null,68,"68","Price County","Northern",{"$f":"IF(ISNA(VLOOKUP(I70,'[1]Urban & Non-Urban Counties'!$A$4:$A$11,1,FALSE)),\"Non-Urban\",\"Urban\")","v":"Non-Urban"},{"$f":"VLOOKUP(I70,[1]Region_Map!$A$4:$C$75,3,FALSE)","v":"Northern"},"OK"]
[null,null,null,null,null,null,69,"69","Sawyer County","Northern",{"$f":"IF(ISNA(VLOOKUP(I71,'[1]Urban & Non-Urban Counties'!$A$4:$A$11,1,FALSE)),\"Non-Urban\",\"Urban\")","v":"Non-Urban"},{"$f":"VLOOKUP(I71,[1]Region_Map!$A$4:$C$75,3,FALSE)","v":"Northern"},"OK"]
[null,null,null,null,null,null,70,"70","Taylor County","Northern",{"$f":"IF(ISNA(VLOOKUP(I72,'[1]Urban & Non-Urban Counties'!$A$4:$A$11,1,FALSE)),\"Non-Urban\",\"Urban\")","v":"Non-Urban"},{"$f":"VLOOKUP(I72,[1]Region_Map!$A$4:$C$75,3,FALSE)","v":"Northern"},"OK"]
[null,null,null,null,null,null,71,"71","Vilas County","Northern",{"$f":"IF(ISNA(VLOOKUP(I73,'[1]Urban & Non-Urban Counties'!$A$4:$A$11,1,FALSE)),\"Non-Urban\",\"Urban\")","v":"Non-Urban"},{"$f":"VLOOKUP(I73,[1]Region_Map!$A$4:$C$75,3,FALSE)","v":"Northern"},"OK"]
[null,null,null,null,null,null,72,"72","Wood County","Northern",{"$f":"IF(ISNA(VLOOKUP(I74,'[1]Urban & Non-Urban Counties'!$A$4:$A$11,1,FALSE)),\"Non-Urban\",\"Urban\")","v":"Non-Urban"},{"$f":"VLOOKUP(I74,[1]Region_Map!$A$4:$C$75,3,FALSE)","v":"Northern"},"OK"]

{"sheet":"Check Tab Number & County","index":3,"n_rows":74,"n_cols":9,"rows_kept":74,"cut":false,"hidden":true,"merged":[]}
[]
[null,"Tab #","County","Region"]
[null,{"$f":"'Counties and Regions'!G3","v":1},{"$f":"IFERROR(INDIRECT(\"'\"&$B3&\"'!B1\"),\"\")","v":""},{"$f":"IFERROR(INDIRECT(\"'\"&$B3&\"'!B2\"),\"\")","v":""},null,null,null,null,"DO NOT EDIT THIS TAB"]
[null,{"$f":"B3+1","v":2},{"$f":"IFERROR(INDIRECT(\"'\"&$B4&\"'!B1\"),\"\")","v":""},{"$f":"IFERROR(INDIRECT(\"'\"&$B4&\"'!B2\"),\"\")","v":""}]
[null,{"$f":"B4+1","v":3},"","",null,null,null,null,"EDIT IN TAB \"Counties and Regions\""]
[null,4,"",""]
[null,5,"",""]
[null,6,"",""]
[null,7,"",""]
[null,8,"",""]
[null,9,"",""]
[null,10,"",""]
[null,11,"",""]
[null,12,"",""]
[null,13,"",""]
[null,14,"",""]
[null,15,"",""]
[null,16,"",""]
[null,17,"",""]
[null,18,"",""]
[null,19,"",""]
[null,20,"",""]
[null,21,"",""]
[null,22,"",""]
[null,23,"",""]
[null,24,"",""]
[null,25,"",""]
[null,26,"",""]
[null,27,"",""]
[null,28,"",""]
[null,29,"",""]
[null,30,"",""]
[null,31,"",""]
[null,{"$f":"B33+1","v":32},"",""]
[null,{"$f":"B34+1","v":33},"",""]
[null,34,"",""]
[null,35,"",""]
[null,36,"",""]
[null,37,"",""]
[null,38,"",""]
[null,39,"",""]
[null,40,"",""]
[null,41,"",""]
[null,42,"",""]
[null,43,"",""]
[null,44,"",""]
[null,{"$f":"B46+1","v":45},"",""]
[null,{"$f":"B47+1","v":46},"",""]
[null,47,"",""]
[null,48,"",""]
[null,49,"",""]
[null,50,"",""]
[null,51,"",""]
[null,{"$f":"B53+1","v":52},"",""]
[null,{"$f":"B54+1","v":53},"",""]
[null,54,"",""]
[null,55,"",""]
[null,56,"",""]
[null,57,"",""]
[null,58,"",""]
[null,{"$f":"B60+1","v":59},"",""]
[null,{"$f":"B61+1","v":60},"",""]
[null,61,"",""]
[null,62,"",""]
[null,63,"",""]
[null,64,"",""]
[null,65,"",""]
[null,66,{"$f":"IFERROR(INDIRECT(\"'\"&$B68&\"'!B1\"),\"\")","v":""},{"$f":"IFERROR(INDIRECT(\"'\"&$B68&\"'!B2\"),\"\")","v":""}]
[null,67,"",""]
[null,68,"",""]
[null,{"$f":"B70+1","v":69},"",""]
[null,{"$f":"B71+1","v":70},"",""]
[null,71,"",""]
[null,72,"",""]

{"sheet":"Region_Map","index":4,"n_rows":75,"n_cols":7,"rows_kept":75,"cut":false,"hidden":true,"merged":[]}
[null,null,null,"Mediciad"]
["County","Current","Proposed","Rates"]
[null,null,null,null,null,null,"Source:"]
["Green Lake County","Northeastern","Eastern","Central",null,null,"P:\\Wisconsin\\2016\\Self-Insured RFP\\[Region Mapping - GeoAccess - Urban vs Other.xlsx]Region_Map"]
["Marquette County","Northeastern","Eastern","Central"]
["Waushara County","Northeastern","Eastern","Central"]
["Brown County","Northeastern","Eastern","Northeastern"]
["Calumet County","Northeastern","Eastern","Northeastern"]
["Door County","Northeastern","Eastern","Northeastern"]
["Fond Du Lac County","Northeastern","Eastern","Northeastern"]
["Kewaunee County","Northeastern","Eastern","Northeastern"]
["Manitowoc County","Northeastern","Eastern","Northeastern"]
["Marinette County","Northeastern","Eastern","Northeastern"]
["Menominee County","Northeastern","Eastern","Northeastern"]
["Oconto County","Northeastern","Eastern","Northeastern"]
["Outagamie County","Northeastern","Eastern","Northeastern"]
["Sheboygan County","Northeastern","Eastern","Northeastern"]
["Waupaca County","Northeastern","Eastern","Northeastern"]
["Winnebago County","Northeastern","Eastern","Northeastern"]
["Shawano County","Northeastern","Eastern","Northern"]
["Portage County","Northern","Northern","Central"]
["Wood County","Northern","Northern","Central"]
["Florence County","Northern","Northern","Northeastern"]
["Ashland County","Northern","Northern","Northern"]
["Bayfield County","Northern","Northern","Northern"]
["Forest County","Northern","Northern","Northern"]
["Iron County","Northern","Northern","Northern"]
["Langlade County","Northern","Northern","Northern"]
["Lincoln County","Northern","Northern","Northern"]
["Marathon County","Northern","Northern","Northern"]
["Oneida County","Northern","Northern","Northern"]
["Price County","Northern","Northern","Northern"]
["Taylor County","Northern","Northern","Northern"]
["Vilas County","Northern","Northern","Northern"]
["Sawyer County","Northern","Northern","Southern"]
["Milwaukee County","Southeastern","Eastern","Milwaukee"]
["Kenosha County","Southeastern","Eastern","Southeastern"]
["Ozaukee County","Southeastern","Eastern","Southeastern"]
["Racine County","Southeastern","Eastern","Southeastern"]
["Washington County","Southeastern","Eastern","Southeastern"]
["Waukesha County","Southeastern","Eastern","Southeastern"]
["Jefferson County","Southeastern","Southern","Southern"]
["Walworth County","Southeastern","Southern","Southern"]
["Adams County","Southern","Southern","Central"]
["Crawford County","Southern","Southern","Central"]
["Juneau County","Southern","Southern","Central"]
["Richland County","Southern","Southern","Central"]
["Vernon County","Southern","Southern","Central"]
["Columbia County","Southern","Southern","Southern"]
["Dane County","Southern","Southern","Southern"]
["Dodge County","Southern","Southern","Southern"]
["Grant County","Southern","Southern","Southern"]
["Green County","Southern","Southern","Southern"]
["Iowa County","Southern","Southern","Southern"]
["Lafayette County","Southern","Southern","Southern"]
["Rock County","Southern","Southern","Southern"]
["Sauk County","Southern","Southern","Southern"]
["Buffalo County","Western","Western","Central"]
["Clark County","Western","Western","Central"]
["Eau Claire County","Western","Western","Central"]
["Jackson County","Western","Western","Central"]
["La Crosse County","Western","Southern","Central"]
["Monroe County","Western","Southern","Central"]
["Trempealeau County","Western","Western","Central"]
["Barron County","Western","Western","Northern"]
["Burnett County","Western","Western","Northern"]
["Chippewa County","Western","Western","Northern"]
["Douglas County","Western","Western","Northern"]
["Dunn County","Western","Western","Northern"]
["Pepin County","Western","Western","Northern"]
["Pierce County","Western","Western","Northern"]
["Polk County","Western","Western","Northern"]
["Rusk County","Western","Western","Northern"]
["St. Croix County","Western","Western","Northern"]
["Washburn County","Western","Western","Northern"]

{"sheet":"Region, by Zip","index":5,"n_rows":899,"n_cols":9,"rows_kept":899,"cut":false,"hidden":true,"merged":[]}
["ZIP Code","Type","Common Cities","County","Classification (Urban/Non-Urban)","Region"]
[53910,"Standard","Adams","Adams County","Non-Urban",{"$f":"VLOOKUP(D2,Region_Map!$A$4:$C$75,3,FALSE)","v":"Southern"}]
[53927,"PO Box","Dellwood","Adams County","Non-Urban",{"$f":"VLOOKUP(D3,Region_Map!$A$4:$C$75,3,FALSE)","v":"Southern"},null,null,"Source:"]
[53934,"Standard","Friendship","Adams County","Non-Urban",{"$f":"VLOOKUP(D4,Region_Map!$A$4:$C$75,3,FALSE)","v":"Southern"},null,null,"P:\\Wisconsin\\2016\\Self-Insured RFP\\RFI\\[GeoAccess - Urban vs Other.xlsx]Region, by Zip"]
[53936,"Standard","Grand Marsh","Adams County","Non-Urban",{"$f":"VLOOKUP(D5,Region_Map!$A$4:$C$75,3,FALSE)","v":"Southern"}]
[53952,"Standard","Oxford, Brooks","Adams County","Non-Urban",{"$f":"VLOOKUP(D6,Region_Map!$A$4:$C$75,3,FALSE)","v":"Southern"}]
[54457,"Standard","Nekoosa","Adams County","Non-Urban",{"$f":"VLOOKUP(D7,Region_Map!$A$4:$C$75,3,FALSE)","v":"Southern"}]
[54613,"Standard","Arkdale","Adams County","Non-Urban",{"$f":"VLOOKUP(D8,Region_Map!$A$4:$C$75,3,FALSE)","v":"Southern"}]
[54514,"Standard","Butternut","Ashland County","Non-Urban",{"$f":"VLOOKUP(D9,Region_Map!$A$4:$C$75,3,FALSE)","v":"Northern"}]
[54517,"Standard","Clam Lake","Ashland County","Non-Urban",{"$f":"VLOOKUP(D10,Region_Map!$A$4:$C$75,3,FALSE)","v":"Northern"}]
[54527,"Standard","Glidden","Ashland County","Non-Urban",{"$f":"VLOOKUP(D11,Region_Map!$A$4:$C$75,3,FALSE)","v":"Northern"}]
[54546,"Standard","Mellen","Ashland County","Non-Urban",{"$f":"VLOOKUP(D12,Region_Map!$A$4:$C$75,3,FALSE)","v":"Northern"}]
[54806,"Standard","Ashland, Moquah, Sanborn","Ashland County","Non-Urban",{"$f":"VLOOKUP(D13,Region_Map!$A$4:$C$75,3,FALSE)","v":"Northern"}]
[54846,"Standard","High Bridge, Highbridge, Marengo","Ashland County","Non-Urban",{"$f":"VLOOKUP(D14,Region_Map!$A$4:$C$75,3,FALSE)","v":"Northern"}]
[54850,"PO Box","La Pointe","Ashland County","Non-Urban",{"$f":"VLOOKUP(D15,Region_Map!$A$4:$C$75,3,FALSE)","v":"Northern"}]
[54855,"Standard","Marengo","Ashland County","Non-Urban",{"$f":"VLOOKUP(D16,Region_Map!$A$4:$C$75,3,FALSE)","v":"Northern"}]
[54861,"PO Box","Odanah","Ashland County","Non-Urban",{"$f":"VLOOKUP(D17,Region_Map!$A$4:$C$75,3,FALSE)","v":"Northern"}]
[54004,"Standard","Clayton","Barron County","Non-Urban",{"$f":"VLOOKUP(D18,Region_Map!$A$4:$C$75,3,FALSE)","v":"Western"}]
[54728,"Standard","Chetek","Barron County","Non-Urban",{"$f":"VLOOKUP(D19,Region_Map!$A$4:$C$75,3,FALSE)","v":"Western"}]
[54733,"Standard","Dallas, Hillsdale","Barron County","Non-Urban",{"$f":"VLOOKUP(D20,Region_Map!$A$4:$C$75,3,FALSE)","v":"Western"}]
[54762,"Standard","Prairie Farm","Barron County","Non-Urban",{"$f":"VLOOKUP(D21,Region_Map!$A$4:$C$75,3,FALSE)","v":"Western"}]
[54805,"Standard","Almena","Barron County","Non-Urban",{"$f":"VLOOKUP(D22,Region_Map!$A$4:$C$75,3,FALSE)","v":"Western"}]
[54812,"Standard","Barron, Poskin","Barron County","Non-Urban",{"$f":"VLOOKUP(D23,Region_Map!$A$4:$C$75,3,FALSE)","v":"Western"}]
[54818,"PO Box","Brill","Barron County","Non-Urban",{"$f":"VLOOKUP(D24,Region_Map!$A$4:$C$75,3,FALSE)","v":"Western"}]
[54822,"Standard","Cameron","Barron County","Non-Urban",{"$f":"VLOOKUP(D25,Region_Map!$A$4:$C$75,3,FALSE)","v":"Western"}]
[54826,"Standard","Comstock","Barron County","Non-Urban",{"$f":"VLOOKUP(D26,Region_Map!$A$4:$C$75,3,FALSE)","v":"Western"}]
[54829,"Standard","Cumberland","Barron County","Non-Urban",{"$f":"VLOOKUP(D27,Region_Map!$A$4:$C$75,3,FALSE)","v":"Western"}]
[54841,"Standard","Haugen","Barron County","Non-Urban",{"$f":"VLOOKUP(D28,Region_Map!$A$4:$C$75,3,FALSE)","v":"Western"}]
[54857,"PO Box","Mikana","Barron County","Non-Urban",{"$f":"VLOOKUP(D29,Region_Map!$A$4:$C$75,3,FALSE)","v":"Western"}]
[54868,"Standard","Rice Lake, Canton","Barron County","Non-Urban",{"$f":"VLOOKUP(D30,Region_Map!$A$4:$C$75,3,FALSE)","v":"Western"}]
[54814,"Standard","Bayfield","Bayfield County","Non-Urban",{"$f":"VLOOKUP(D31,Region_Map!$A$4:$C$75,3,FALSE)","v":"Northern"}]
[54816,"PO Box","Benoit, Mason","Bayfield County","Non-Urban",{"$f":"VLOOKUP(D32,Region_Map!$A$4:$C$75,3,FALSE)","v":"Northern"}]
[54821,"Standard","Cable","Bayfield County","Non-Urban",{"$f":"VLOOKUP(D33,Region_Map!$A$4:$C$75,3,FALSE)","v":"Northern"}]
[54827,"Standard","Cornucopia","Bayfield County","Non-Urban",{"$f":"VLOOKUP(D34,Region_Map!$A$4:$C$75,3,FALSE)","v":"Northern"}]
[54832,"Standard","Drummond","Bayfield County","Non-Urban",{"$f":"VLOOKUP(D35,Region_Map!$A$4:$C$75,3,FALSE)","v":"Northern"}]
[54839,"Standard","Grand View","Bayfield County","Non-Urban",{"$f":"VLOOKUP(D36,Region_Map!$A$4:$C$75,3,FALSE)","v":"Northern"}]
[54844,"Standard","Herbster","Bayfield County","Non-Urban",{"$f":"VLOOKUP(D37,Region_Map!$A$4:$C$75,3,FALSE)","v":"Northern"}]
[54847,"Standard","Iron River","Bayfield County","Non-Urban",{"$f":"VLOOKUP(D38,Region_Map!$A$4:$C$75,3,FALSE)","v":"Northern"}]
[54856,"Standard","Mason, Delta","Bayfield County","Non-Urban",{"$f":"VLOOKUP(D39,Region_Map!$A$4:$C$75,3,FALSE)","v":"Northern"}]
[54865,"Standard","Port Wing","Bayfield County","Non-Urban",{"$f":"VLOOKUP(D40,Region_Map!$A$4:$C$75,3,FALSE)","v":"Northern"}]
[54891,"Standard","Washburn","Bayfield County","Non-Urban",{"$f":"VLOOKUP(D41,Region_Map!$A$4:$C$75,3,FALSE)","v":"Northern"}]
[54115,"Standard","De Pere, Hobart","Brown County","Urban",{"$f":"VLOOKUP(D42,Region_Map!$A$4:$C$75,3,FALSE)","v":"Eastern"}]
[54126,"Standard","Greenleaf","Brown County","Urban",{"$f":"VLOOKUP(D43,Region_Map!$A$4:$C$75,3,FALSE)","v":"Eastern"}]
[54155,"Standard","Oneida, Hobart","Brown County","Urban",{"$f":"VLOOKUP(D44,Region_Map!$A$4:$C$75,3,FALSE)","v":"Eastern"}]
[54173,"Standard","Suamico","Brown County","Urban",{"$f":"VLOOKUP(D45,Region_Map!$A$4:$C$75,3,FALSE)","v":"Eastern"}]
[54180,"Standard","Wrightstown","Brown County","Urban",{"$f":"VLOOKUP(D46,Region_Map!$A$4:$C$75,3,FALSE)","v":"Eastern"}]
[54208,"Standard","Denmark","Brown County","Urban",{"$f":"VLOOKUP(D47,Region_Map!$A$4:$C$75,3,FALSE)","v":"Eastern"}]
[54229,"Standard","New Franken, Green Bay","Brown County","Urban",{"$f":"VLOOKUP(D48,Region_Map!$A$4:$C$75,3,FALSE)","v":"Eastern"}]
[54301,"Standard","Green Bay, Allouez","Brown County","Urban",{"$f":"VLOOKUP(D49,Region_Map!$A$4:$C$75,3,FALSE)","v":"Eastern"}]
[54302,"Standard","Green Bay","Brown County","Urban",{"$f":"VLOOKUP(D50,Region_Map!$A$4:$C$75,3,FALSE)","v":"Eastern"}]
[54303,"Standard","Green Bay, Howard","Brown County","Urban",{"$f":"VLOOKUP(D51,Region_Map!$A$4:$C$75,3,FALSE)","v":"Eastern"}]
[54304,"Standard","Green Bay, Ashwaubenon","Brown County","Urban",{"$f":"VLOOKUP(D52,Region_Map!$A$4:$C$75,3,FALSE)","v":"Eastern"}]
[54305,"PO Box","Green Bay","Brown County","Urban",{"$f":"VLOOKUP(D53,Region_Map!$A$4:$C$75,3,FALSE)","v":"Eastern"}]
[54306,"PO Box","Green Bay","Brown County","Urban",{"$f":"VLOOKUP(D54,Region_Map!$A$4:$C$75,3,FALSE)","v":"Eastern"}]
[54307,"PO Box","Green Bay","Brown County","Urban",{"$f":"VLOOKUP(D55,Region_Map!$A$4:$C$75,3,FALSE)","v":"Eastern"}]
[54308,"PO Box","Green Bay","Brown County","Urban",{"$f":"VLOOKUP(D56,Region_Map!$A$4:$C$75,3,FALSE)","v":"Eastern"}]
[54311,"Standard","Green Bay, Bellevue","Brown County","Urban",{"$f":"VLOOKUP(D57,Region_Map!$A$4:$C$75,3,FALSE)","v":"Eastern"}]
[54313,"Standard","Green Bay, Ashwaubenon, Hobart, Howard, Suamico","Brown County","Urban",{"$f":"VLOOKUP(D58,Region_Map!$A$4:$C$75,3,FALSE)","v":"Eastern"}]
[54324,"PO Box","Green Bay","Brown County","Urban",{"$f":"VLOOKUP(D59,Region_Map!$A$4:$C$75,3,FALSE)","v":"Eastern"}]
[54344,"Unique","Green Bay","Brown County","Urban",{"$f":"VLOOKUP(D60,Region_Map!$A$4:$C$75,3,FALSE)","v":"Eastern"}]
[54610,"Standard","Alma","Buffalo County","Non-Urban",{"$f":"VLOOKUP(D61,Region_Map!$A$4:$C$75,3,FALSE)","v":"Western"}]
[54622,"Standard","Cochrane, Buffalo City, Waumandee","Buffalo County","Non-Urban",{"$f":"VLOOKUP(D62,Region_Map!$A$4:$C$75,3,FALSE)","v":"Western"}]
[54629,"Standard","Fountain City","Buffalo County","Non-Urban",{"$f":"VLOOKUP(D63,Region_Map!$A$4:$C$75,3,FALSE)","v":"Western"}]
[54743,"PO Box","Gilmanton","Buffalo County","Non-Urban",{"$f":"VLOOKUP(D64,Region_Map!$A$4:$C$75,3,FALSE)","v":"Western"}]
[54755,"Standard","Mondovi, Modena","Buffalo County","Non-Urban",{"$f":"VLOOKUP(D65,Region_Map!$A$4:$C$75,3,FALSE)","v":"Western"}]
[54756,"Standard","Nelson","Buffalo County","Non-Urban",{"$f":"VLOOKUP(D66,Region_Map!$A$4:$C$75,3,FALSE)","v":"Western"}]
[54830,"Standard","Danbury, Dairyland, Webb Lake, Yellow Lake","Burnett County","Non-Urban",{"$f":"VLOOKUP(D67,Region_Map!$A$4:$C$75,3,FALSE)","v":"Western"}]
[54840,"Standard","Grantsburg","Burnett County","Non-Urban",{"$f":"VLOOKUP(D68,Region_Map!$A$4:$C$75,3,FALSE)","v":"Western"}]
[54845,"Standard","Hertel","Burnett County","Non-Urban",{"$f":"VLOOKUP(D69,Region_Map!$A$4:$C$75,3,FALSE)","v":"Western"}]
[54872,"Standard","Siren","Burnett County","Non-Urban",{"$f":"VLOOKUP(D70,Region_Map!$A$4:$C$75,3,FALSE)","v":"Western"}]
[54893,"Standard","Webster","Burnett County","Non-Urban",{"$f":"VLOOKUP(D71,Region_Map!$A$4:$C$75,3,FALSE)","v":"Western"}]
[53014,"Standard","Chilton","Calumet County","Non-Urban",{"$f":"VLOOKUP(D72,Region_Map!$A$4:$C$75,3,FALSE)","v":"Eastern"}]
[53061,"Standard","New Holstein","Calumet County","Non-Urban",{"$f":"VLOOKUP(D73,Region_Map!$A$4:$C$75,3,FALSE)","v":"Eastern"}]
[53062,"Unique","New Holstein, Salvatorian Center, Salvtrian Ctr","Calumet County","Non-Urban",{"$f":"VLOOKUP(D74,Region_Map!$A$4:$C$75,3,FALSE)","v":"Eastern"}]
[53088,"PO Box","Stockbridge","Calumet County","Non-Urban",{"$f":"VLOOKUP(D75,Region_Map!$A$4:$C$75,3,FALSE)","v":"Eastern"}]
[54110,"Standard","Brillion","Calumet County","Non-Urban",{"$f":"VLOOKUP(D76,Region_Map!$A$4:$C$75,3,FALSE)","v":"Eastern"}]
[54123,"Standard","Forest Junction, Forest Jct","Calumet County","Non-Urban",{"$f":"VLOOKUP(D77,Region_Map!$A$4:$C$75,3,FALSE)","v":"Eastern"}]
[54129,"Standard","Hilbert","Calumet County","Non-Urban",{"$f":"VLOOKUP(D78,Region_Map!$A$4:$C$75,3,FALSE)","v":"Eastern"}]
[54160,"PO Box","Potter","Calumet County","Non-Urban",{"$f":"VLOOKUP(D79,Region_Map!$A$4:$C$75,3,FALSE)","v":"Eastern"}]
[54169,"Standard","Sherwood","Calumet County","Non-Urban",{"$f":"VLOOKUP(D80,Region_Map!$A$4:$C$75,3,FALSE)","v":"Eastern"}]
[54724,"Standard","Bloomer","Chippewa County","Non-Urban",{"$f":"VLOOKUP(D81,Region_Map!$A$4:$C$75,3,FALSE)","v":"Western"}]
[54726,"Standard","Boyd","Chippewa County","Non-Urban",{"$f":"VLOOKUP(D82,Region_Map!$A$4:$C$75,3,FALSE)","v":"Western"}]
[54727,"Standard","Cadott","Chippewa County","Non-Urban",{"$f":"VLOOKUP(D83,Region_Map!$A$4:$C$75,3,FALSE)","v":"Western"}]
[54729,"Standard","Chippewa Falls, Chippewa Fls, Lake Hallie","Chippewa County","Non-Urban",{"$f":"VLOOKUP(D84,Region_Map!$A$4:$C$75,3,FALSE)","v":"Western"}]
[54732,"Standard","Cornell","Chippewa County","Non-Urban",{"$f":"VLOOKUP(D85,Region_Map!$A$4:$C$75,3,FALSE)","v":"Western"}]
[54745,"Standard","Holcombe","Chippewa County","Non-Urban",{"$f":"VLOOKUP(D86,Region_Map!$A$4:$C$75,3,FALSE)","v":"Western"}]
[54748,"Standard","Jim Falls","Chippewa County","Non-Urban",{"$f":"VLOOKUP(D87,Region_Map!$A$4:$C$75,3,FALSE)","v":"Western"}]
[54757,"Standard","New Auburn","Chippewa County","Non-Urban",{"$f":"VLOOKUP(D88,Region_Map!$A$4:$C$75,3,FALSE)","v":"Western"}]
[54768,"Standard","Stanley","Chippewa County","Non-Urban",{"$f":"VLOOKUP(D89,Region_Map!$A$4:$C$75,3,FALSE)","v":"Western"}]
[54774,"Unique","Chippewa Falls, Chippewa Fls","Chippewa County","Non-Urban",{"$f":"VLOOKUP(D90,Region_Map!$A$4:$C$75,3,FALSE)","v":"Western"}]
[54420,"Standard","Chili","Clark County","Non-Urban",{"$f":"VLOOKUP(D91,Region_Map!$A$4:$C$75,3,FALSE)","v":"Western"}]
[54422,"Standard","Curtiss","Clark County","Non-Urban",{"$f":"VLOOKUP(D92,Region_Map!$A$4:$C$75,3,FALSE)","v":"Western"}]
[54425,"Standard","Dorchester","Clark County","Non-Urban",{"$f":"VLOOKUP(D93,Region_Map!$A$4:$C$75,3,FALSE)","v":"Western"}]
[54436,"Standard","Granton","Clark County","Non-Urban",{"$f":"VLOOKUP(D94,Region_Map!$A$4:$C$75,3,FALSE)","v":"Western"}]
[54437,"Standard","Greenwood","Clark County","Non-Urban",{"$f":"VLOOKUP(D95,Region_Map!$A$4:$C$75,3,FALSE)","v":"Western"}]
[54446,"Standard","Loyal","Clark County","Non-Urban",{"$f":"VLOOKUP(D96,Region_Map!$A$4:$C$75,3,FALSE)","v":"Western"}]
[54456,"Standard","Neillsville","Clark County","Non-Urban",{"$f":"VLOOKUP(D97,Region_Map!$A$4:$C$75,3,FALSE)","v":"Western"}]
[54460,"Standard","Owen","Clark County","Non-Urban",{"$f":"VLOOKUP(D98,Region_Map!$A$4:$C$75,3,FALSE)","v":"Western"}]
[54488,"Standard","Unity","Clark County","Non-Urban",{"$f":"VLOOKUP(D99,Region_Map!$A$4:$C$75,3,FALSE)","v":"Western"}]
[54493,"Standard","Willard","Clark County","Non-Urban",{"$f":"VLOOKUP(D100,Region_Map!$A$4:$C$75,3,FALSE)","v":"Western"}]
[54498,"Standard","Withee","Clark County","Non-Urban",{"$f":"VLOOKUP(D101,Region_Map!$A$4:$C$75,3,FALSE)","v":"Western"}]
[54746,"Standard","Humbird","Clark County","Non-Urban",{"$f":"VLOOKUP(D102,Region_Map!$A$4:$C$75,3,FALSE)","v":"Western"}]
[54754,"Standard","Merrillan","Clark County","Non-Urban",{"$f":"VLOOKUP(D103,Region_Map!$A$4:$C$75,3,FALSE)","v":"Western"}]
[54771,"Standard","Thorp","Clark County","Non-Urban",{"$f":"VLOOKUP(D104,Region_Map!$A$4:$C$75,3,FALSE)","v":"Western"}]
[53555,"Standard","Lodi","Columbia County","Non-Urban",{"$f":"VLOOKUP(D105,Region_Map!$A$4:$C$75,3,FALSE)","v":"Southern"}]
[53901,"Standard","Portage","Columbia County","Non-Urban",{"$f":"VLOOKUP(D106,Region_Map!$A$4:$C$75,3,FALSE)","v":"Southern"}]
[53911,"Standard","Arlington","Columbia County","Non-Urban",{"$f":"VLOOKUP(D107,Region_Map!$A$4:$C$75,3,FALSE)","v":"Southern"}]
[53923,"Standard","Cambria, Friesland","Columbia County","Non-Urban",{"$f":"VLOOKUP(D108,Region_Map!$A$4:$C$75,3,FALSE)","v":"Southern"}]
[53925,"Standard","Columbus","Columbia County","Non-Urban",{"$f":"VLOOKUP(D109,Region_Map!$A$4:$C$75,3,FALSE)","v":"Southern"}]
[53928,"PO Box","Doylestown","Columbia County","Non-Urban",{"$f":"VLOOKUP(D110,Region_Map!$A$4:$C$75,3,FALSE)","v":"Southern"}]
[53932,"Standard","Fall River","Columbia County","Non-Urban",{"$f":"VLOOKUP(D111,Region_Map!$A$4:$C$75,3,FALSE)","v":"Southern"}]
[53935,"PO Box","Friesland","Columbia County","Non-Urban",{"$f":"VLOOKUP(D112,Region_Map!$A$4:$C$75,3,FALSE)","v":"Southern"}]
[53954,"Standard","Pardeeville","Columbia County","Non-Urban",{"$f":"VLOOKUP(D113,Region_Map!$A$4:$C$75,3,FALSE)","v":"Southern"}]
[53955,"Standard","Poynette","Columbia County","Non-Urban",{"$f":"VLOOKUP(D114,Region_Map!$A$4:$C$75,3,FALSE)","v":"Southern"}]
[53956,"Standard","Randolph","Columbia County","Non-Urban",{"$f":"VLOOKUP(D115,Region_Map!$A$4:$C$75,3,FALSE)","v":"Southern"}]
[53957,"Unique","Randolph","Columbia County","Non-Urban",{"$f":"VLOOKUP(D116,Region_Map!$A$4:$C$75,3,FALSE)","v":"Southern"}]
[53960,"Standard","Rio","Columbia County","Non-Urban",{"$f":"VLOOKUP(D117,Region_Map!$A$4:$C$75,3,FALSE)","v":"Southern"}]
[53969,"PO Box","Wyocena","Columbia County","Non-Urban",{"$f":"VLOOKUP(D118,Region_Map!$A$4:$C$75,3,FALSE)","v":"Southern"}]
[53821,"Standard","Prairie Du Chien, Pr Du Chien","Crawford County","Non-Urban",{"$f":"VLOOKUP(D119,Region_Map!$A$4:$C$75,3,FALSE)","v":"Southern"}]
[53826,"Standard","Wauzeka","Crawford County","Non-Urban",{"$f":"VLOOKUP(D120,Region_Map!$A$4:$C$75,3,FALSE)","v":"Southern"}]
[54626,"Standard","Eastman, Lynxville","Crawford County","Non-Urban",{"$f":"VLOOKUP(D121,Region_Map!$A$4:$C$75,3,FALSE)","v":"Southern"}]
[54628,"Standard","Ferryville","Crawford County","Non-Urban",{"$f":"VLOOKUP(D122,Region_Map!$A$4:$C$75,3,FALSE)","v":"Southern"}]
[54631,"Standard","Gays Mills","Crawford County","Non-Urban",{"$f":"VLOOKUP(D123,Region_Map!$A$4:$C$75,3,FALSE)","v":"Southern"}]
[54640,"PO Box","Lynxville","Crawford County","Non-Urban",{"$f":"VLOOKUP(D124,Region_Map!$A$4:$C$75,3,FALSE)","v":"Southern"}]
[54645,"PO Box","Mount Sterling, Mt Sterling","Crawford County","Non-Urban",{"$f":"VLOOKUP(D125,Region_Map!$A$4:$C$75,3,FALSE)","v":"Southern"}]
[54654,"PO Box","Seneca","Crawford County","Non-Urban",{"$f":"VLOOKUP(D126,Region_Map!$A$4:$C$75,3,FALSE)","v":"Southern"}]
[54655,"Standard","Soldiers Grove, Soldier Grove","Crawford County","Non-Urban",{"$f":"VLOOKUP(D127,Region_Map!$A$4:$C$75,3,FALSE)","v":"Southern"}]
[54657,"Standard","Steuben","Crawford County","Non-Urban",{"$f":"VLOOKUP(D128,Region_Map!$A$4:$C$75,3,FALSE)","v":"Southern"}]
[53508,"Standard","Belleville","Dane County","Urban",{"$f":"VLOOKUP(D129,Region_Map!$A$4:$C$75,3,FALSE)","v":"Southern"}]
[53515,"Standard","Black Earth","Dane County","Urban",{"$f":"VLOOKUP(D130,Region_Map!$A$4:$C$75,3,FALSE)","v":"Southern"}]
[53517,"Standard","Blue Mounds","Dane County","Urban",{"$f":"VLOOKUP(D131,Region_Map!$A$4:$C$75,3,FALSE)","v":"Southern"}]
[53523,"Standard","Cambridge","Dane County","Urban",{"$f":"VLOOKUP(D132,Region_Map!$A$4:$C$75,3,FALSE)","v":"Southern"}]
[53527,"Standard","Cottage Grove","Dane County","Urban",{"$f":"VLOOKUP(D133,Region_Map!$A$4:$C$75,3,FALSE)","v":"Southern"}]
[53528,"Standard","Cross Plains","Dane County","Urban",{"$f":"VLOOKUP(D134,Region_Map!$A$4:$C$75,3,FALSE)","v":"Southern"}]
[53529,"Standard","Dane","Dane County","Urban",{"$f":"VLOOKUP(D135,Region_Map!$A$4:$C$75,3,FALSE)","v":"Southern"}]
[53531,"Standard","Deerfield","Dane County","Urban",{"$f":"VLOOKUP(D136,Region_Map!$A$4:$C$75,3,FALSE)","v":"Southern"}]
[53532,"Standard","De Forest","Dane County","Urban",{"$f":"VLOOKUP(D137,Region_Map!$A$4:$C$75,3,FALSE)","v":"Southern"}]
[53558,"Standard","Mc Farland","Dane County","Urban",{"$f":"VLOOKUP(D138,Region_Map!$A$4:$C$75,3,FALSE)","v":"Southern"}]
[53559,"Standard","Marshall","Dane County","Urban",{"$f":"VLOOKUP(D139,Region_Map!$A$4:$C$75,3,FALSE)","v":"Southern"}]
[53560,"Standard","Mazomanie","Dane County","Urban",{"$f":"VLOOKUP(D140,Region_Map!$A$4:$C$75,3,FALSE)","v":"Southern"}]
[53562,"Standard","Middleton","Dane County","Urban",{"$f":"VLOOKUP(D141,Region_Map!$A$4:$C$75,3,FALSE)","v":"Southern"}]
[53571,"PO Box","Morrisonville","Dane County","Urban",{"$f":"VLOOKUP(D142,Region_Map!$A$4:$C$75,3,FALSE)","v":"Southern"}]
[53572,"Standard","Mount Horeb","Dane County","Urban",{"$f":"VLOOKUP(D143,Region_Map!$A$4:$C$75,3,FALSE)","v":"Southern"}]
[53575,"Standard","Oregon, Fitchburg","Dane County","Urban",{"$f":"VLOOKUP(D144,Region_Map!$A$4:$C$75,3,FALSE)","v":"Southern"}]
[53589,"Standard","Stoughton","Dane County","Urban",{"$f":"VLOOKUP(D145,Region_Map!$A$4:$C$75,3,FALSE)","v":"Southern"}]
[53590,"Standard","Sun Prairie","Dane County","Urban",{"$f":"VLOOKUP(D146,Region_Map!$A$4:$C$75,3,FALSE)","v":"Southern"}]
[53593,"Standard","Verona, Fitchburg","Dane County","Urban",{"$f":"VLOOKUP(D147,Region_Map!$A$4:$C$75,3,FALSE)","v":"Southern"}]
[53596,"Unique","Sun Prairie","Dane County","Urban",{"$f":"VLOOKUP(D148,Region_Map!$A$4:$C$75,3,FALSE)","v":"Southern"}]
[53597,"Standard","Waunakee, Westport","Dane County","Urban",{"$f":"VLOOKUP(D149,Region_Map!$A$4:$C$75,3,FALSE)","v":"Southern"}]
[53598,"Standard","Windsor","Dane County","Urban",{"$f":"VLOOKUP(D150,Region_Map!$A$4:$C$75,3,FALSE)","v":"Southern"}]
[53701,"PO Box","Madison","Dane County","Urban",{"$f":"VLOOKUP(D151,Region_Map!$A$4:$C$75,3,FALSE)","v":"Southern"}]
[53702,"Unique","Madison","Dane County","Urban",{"$f":"VLOOKUP(D152,Region_Map!$A$4:$C$75,3,FALSE)","v":"Southern"}]
[53703,"Standard","Madison","Dane County","Urban",{"$f":"VLOOKUP(D153,Region_Map!$A$4:$C$75,3,FALSE)","v":"Southern"}]
[53704,"Standard","Madison","Dane County","Urban",{"$f":"VLOOKUP(D154,Region_Map!$A$4:$C$75,3,FALSE)","v":"Southern"}]
[53705,"Standard","Madison","Dane County","Urban",{"$f":"VLOOKUP(D155,Region_Map!$A$4:$C$75,3,FALSE)","v":"Southern"}]
[53706,"Standard","Madison","Dane County","Urban",{"$f":"VLOOKUP(D156,Region_Map!$A$4:$C$75,3,FALSE)","v":"Southern"}]
[53707,"PO Box","Madison","Dane County","Urban",{"$f":"VLOOKUP(D157,Region_Map!$A$4:$C$75,3,FALSE)","v":"Southern"}]
[53708,"PO Box","Madison","Dane County","Urban",{"$f":"VLOOKUP(D158,Region_Map!$A$4:$C$75,3,FALSE)","v":"Southern"}]
[53711,"Standard","Madison, Fitchburg","Dane County","Urban",{"$f":"VLOOKUP(D159,Region_Map!$A$4:$C$75,3,FALSE)","v":"Southern"}]
[53713,"Standard","Madison, Fitchburg, Monona","Dane County","Urban",{"$f":"VLOOKUP(D160,Region_Map!$A$4:$C$75,3,FALSE)","v":"Southern"}]
[53714,"Standard","Madison, Monona","Dane County","Urban",{"$f":"VLOOKUP(D161,Region_Map!$A$4:$C$75,3,FALSE)","v":"Southern"}]
[53715,"Standard","Madison","Dane County","Urban",{"$f":"VLOOKUP(D162,Region_Map!$A$4:$C$75,3,FALSE)","v":"Southern"}]
[53716,"Standard","Madison, Monona","Dane County","Urban",{"$f":"VLOOKUP(D163,Region_Map!$A$4:$C$75,3,FALSE)","v":"Southern"}]
[53717,"Standard","Madison","Dane County","Urban",{"$f":"VLOOKUP(D164,Region_Map!$A$4:$C$75,3,FALSE)","v":"Southern"}]
[53718,"Standard","Madison","Dane County","Urban",{"$f":"VLOOKUP(D165,Region_Map!$A$4:$C$75,3,FALSE)","v":"Southern"}]
[53719,"Standard","Madison, Fitchburg","Dane County","Urban",{"$f":"VLOOKUP(D166,Region_Map!$A$4:$C$75,3,FALSE)","v":"Southern"}]
[53725,"Standard","Madison","Dane County","Urban",{"$f":"VLOOKUP(D167,Region_Map!$A$4:$C$75,3,FALSE)","v":"Southern"}]
[53726,"Standard","Madison","Dane County","Urban",{"$f":"VLOOKUP(D168,Region_Map!$A$4:$C$75,3,FALSE)","v":"Southern"}]
[53744,"Standard","Madison","Dane County","Urban",{"$f":"VLOOKUP(D169,Region_Map!$A$4:$C$75,3,FALSE)","v":"Southern"}]
[53774,"Unique","Madison","Dane County","Urban",{"$f":"VLOOKUP(D170,Region_Map!$A$4:$C$75,3,FALSE)","v":"Southern"}]
[53777,"Unique","Madison","Dane County","Urban",{"$f":"VLOOKUP(D171,Region_Map!$A$4:$C$75,3,FALSE)","v":"Southern"}]
[53778,"Unique","Madison","Dane County","Urban",{"$f":"VLOOKUP(D172,Region_Map!$A$4:$C$75,3,FALSE)","v":"Southern"}]
[53779,"Unique","Madison","Dane County","Urban",{"$f":"VLOOKUP(D173,Region_Map!$A$4:$C$75,3,FALSE)","v":"Southern"}]
[53782,"Unique","Madison","Dane County","Urban",{"$f":"VLOOKUP(D174,Region_Map!$A$4:$C$75,3,FALSE)","v":"Southern"}]
[53783,"Unique","Madison","Dane County","Urban",{"$f":"VLOOKUP(D175,Region_Map!$A$4:$C$75,3,FALSE)","v":"Southern"}]
[53784,"Unique","Madison","Dane County","Urban",{"$f":"VLOOKUP(D176,Region_Map!$A$4:$C$75,3,FALSE)","v":"Southern"}]
[53785,"Unique","Madison","Dane County","Urban",{"$f":"VLOOKUP(D177,Region_Map!$A$4:$C$75,3,FALSE)","v":"Southern"}]
[53786,"Unique","Madison","Dane County","Urban",{"$f":"VLOOKUP(D178,Region_Map!$A$4:$C$75,3,FALSE)","v":"Southern"}]
[53788,"Unique","Madison","Dane County","Urban",{"$f":"VLOOKUP(D179,Region_Map!$A$4:$C$75,3,FALSE)","v":"Southern"}]
[53789,"Unique","Madison","Dane County","Urban",{"$f":"VLOOKUP(D180,Region_Map!$A$4:$C$75,3,FALSE)","v":"Southern"}]
[53790,"Unique","Madison","Dane County","Urban",{"$f":"VLOOKUP(D181,Region_Map!$A$4:$C$75,3,FALSE)","v":"Southern"}]
[53791,"Unique","Madison","Dane County","Urban",{"$f":"VLOOKUP(D182,Region_Map!$A$4:$C$75,3,FALSE)","v":"Southern"}]
[53792,"Unique","Madison","Dane County","Urban",{"$f":"VLOOKUP(D183,Region_Map!$A$4:$C$75,3,FALSE)","v":"Southern"}]
[53793,"Unique","Madison","Dane County","Urban",{"$f":"VLOOKUP(D184,Region_Map!$A$4:$C$75,3,FALSE)","v":"Southern"}]
[53794,"Unique","Madison","Dane County","Urban",{"$f":"VLOOKUP(D185,Region_Map!$A$4:$C$75,3,FALSE)","v":"Southern"}]
[53003,"PO Box","Ashippun","Dodge County","Non-Urban",{"$f":"VLOOKUP(D186,Region_Map!$A$4:$C$75,3,FALSE)","v":"Southern"}]
[53006,"Standard","Brownsville, Byron, South Byron","Dodge County","Non-Urban",{"$f":"VLOOKUP(D187,Region_Map!$A$4:$C$75,3,FALSE)","v":"Southern"}]
[53016,"PO Box","Clyman","Dodge County","Non-Urban",{"$f":"VLOOKUP(D188,Region_Map!$A$4:$C$75,3,FALSE)","v":"Southern"}]
[53032,"Standard","Horicon","Dodge County","Non-Urban",{"$f":"VLOOKUP(D189,Region_Map!$A$4:$C$75,3,FALSE)","v":"Southern"}]
[53034,"Standard","Hustisford","Dodge County","Non-Urban",{"$f":"VLOOKUP(D190,Region_Map!$A$4:$C$75,3,FALSE)","v":"Southern"}]
[53035,"Standard","Iron Ridge","Dodge County","Non-Urban",{"$f":"VLOOKUP(D191,Region_Map!$A$4:$C$75,3,FALSE)","v":"Southern"}]
[53039,"Standard","Juneau","Dodge County","Non-Urban",{"$f":"VLOOKUP(D192,Region_Map!$A$4:$C$75,3,FALSE)","v":"Southern"}]
[53047,"PO Box","Lebanon","Dodge County","Non-Urban",{"$f":"VLOOKUP(D193,Region_Map!$A$4:$C$75,3,FALSE)","v":"Southern"}]
[53048,"Standard","Lomira, Knowles","Dodge County","Non-Urban",{"$f":"VLOOKUP(D194,Region_Map!$A$4:$C$75,3,FALSE)","v":"Southern"}]
[53050,"Standard","Mayville","Dodge County","Non-Urban",{"$f":"VLOOKUP(D195,Region_Map!$A$4:$C$75,3,FALSE)","v":"Southern"}]
[53059,"Standard","Neosho","Dodge County","Non-Urban",{"$f":"VLOOKUP(D196,Region_Map!$A$4:$C$75,3,FALSE)","v":"Southern"}]
[53078,"Standard","Rubicon","Dodge County","Non-Urban",{"$f":"VLOOKUP(D197,Region_Map!$A$4:$C$75,3,FALSE)","v":"Southern"}]
[53091,"Standard","Theresa","Dodge County","Non-Urban",{"$f":"VLOOKUP(D198,Region_Map!$A$4:$C$75,3,FALSE)","v":"Southern"}]
[53098,"Standard","Watertown","Dodge County","Non-Urban",{"$f":"VLOOKUP(D199,Region_Map!$A$4:$C$75,3,FALSE)","v":"Southern"}]
[53099,"Standard","Woodland","Dodge County","Non-Urban",{"$f":"VLOOKUP(D200,Region_Map!$A$4:$C$75,3,FALSE)","v":"Southern"}]
[53557,"Standard","Lowell","Dodge County","Non-Urban",{"$f":"VLOOKUP(D201,Region_Map!$A$4:$C$75,3,FALSE)","v":"Southern"}]
[53579,"Standard","Reeseville","Dodge County","Non-Urban",{"$f":"VLOOKUP(D202,Region_Map!$A$4:$C$75,3,FALSE)","v":"Southern"}]
[53916,"Standard","Beaver Dam","Dodge County","Non-Urban",{"$f":"VLOOKUP(D203,Region_Map!$A$4:$C$75,3,FALSE)","v":"Southern"}]
[53922,"Standard","Burnett","Dodge County","Non-Urban",{"$f":"VLOOKUP(D204,Region_Map!$A$4:$C$75,3,FALSE)","v":"Southern"}]
[53933,"Standard","Fox Lake","Dodge County","Non-Urban",{"$f":"VLOOKUP(D205,Region_Map!$A$4:$C$75,3,FALSE)","v":"Southern"}]
[54202,"Standard","Baileys Harbor, Baileys Hbr","Door County","Non-Urban",{"$f":"VLOOKUP(D206,Region_Map!$A$4:$C$75,3,FALSE)","v":"Eastern"}]
[54204,"Standard","Brussels","Door County","Non-Urban",{"$f":"VLOOKUP(D207,Region_Map!$A$4:$C$75,3,FALSE)","v":"Eastern"}]
[54209,"Standard","Egg Harbor","Door County","Non-Urban",{"$f":"VLOOKUP(D208,Region_Map!$A$4:$C$75,3,FALSE)","v":"Eastern"}]
[54210,"Standard","Ellison Bay","Door County","Non-Urban",{"$f":"VLOOKUP(D209,Region_Map!$A$4:$C$75,3,FALSE)","v":"Eastern"}]
[54211,"PO Box","Ephraim","Door County","Non-Urban",{"$f":"VLOOKUP(D210,Region_Map!$A$4:$C$75,3,FALSE)","v":"Eastern"}]
[54212,"Standard","Fish Creek","Door County","Non-Urban",{"$f":"VLOOKUP(D211,Region_Map!$A$4:$C$75,3,FALSE)","v":"Eastern"}]
[54213,"Standard","Forestville","Door County","Non-Urban",{"$f":"VLOOKUP(D212,Region_Map!$A$4:$C$75,3,FALSE)","v":"Eastern"}]
[54226,"PO Box","Maplewood","Door County","Non-Urban",{"$f":"VLOOKUP(D213,Region_Map!$A$4:$C$75,3,FALSE)","v":"Eastern"}]
[54234,"Standard","Sister Bay","Door County","Non-Urban",{"$f":"VLOOKUP(D214,Region_Map!$A$4:$C$75,3,FALSE)","v":"Eastern"}]
[54235,"Standard","Sturgeon Bay","Door County","Non-Urban",{"$f":"VLOOKUP(D215,Region_Map!$A$4:$C$75,3,FALSE)","v":"Eastern"}]
[54246,"Standard","Washington Island, Washington Is","Door County","Non-Urban",{"$f":"VLOOKUP(D216,Region_Map!$A$4:$C$75,3,FALSE)","v":"Eastern"}]
[54820,"Standard","Brule","Douglas County","Non-Urban",{"$f":"VLOOKUP(D217,Region_Map!$A$4:$C$75,3,FALSE)","v":"Western"}]
[54836,"Standard","Foxboro","Douglas County","Non-Urban",{"$f":"VLOOKUP(D218,Region_Map!$A$4:$C$75,3,FALSE)","v":"Western"}]
[54838,"Standard","Gordon, Wascott","Douglas County","Non-Urban",{"$f":"VLOOKUP(D219,Region_Map!$A$4:$C$75,3,FALSE)","v":"Western"}]
[54842,"PO Box","Hawthorne","Douglas County","Non-Urban",{"$f":"VLOOKUP(D220,Region_Map!$A$4:$C$75,3,FALSE)","v":"Western"}]
[54849,"Standard","Lake Nebagamon, Lk Nebagamon","Douglas County","Non-Urban",{"$f":"VLOOKUP(D221,Region_Map!$A$4:$C$75,3,FALSE)","v":"Western"}]
[54854,"Standard","Maple","Douglas County","Non-Urban",{"$f":"VLOOKUP(D222,Region_Map!$A$4:$C$75,3,FALSE)","v":"Western"}]
[54864,"Standard","Poplar","Douglas County","Non-Urban",{"$f":"VLOOKUP(D223,Region_Map!$A$4:$C$75,3,FALSE)","v":"Western"}]
[54873,"Standard","Solon Springs, Barnes, Bennett","Douglas County","Non-Urban",{"$f":"VLOOKUP(D224,Region_Map!$A$4:$C$75,3,FALSE)","v":"Western"}]
[54874,"Standard","South Range, Wentworth","Douglas County","Non-Urban",{"$f":"VLOOKUP(D225,Region_Map!$A$4:$C$75,3,FALSE)","v":"Western"}]
[54880,"Standard","Superior, Oliver","Douglas County","Non-Urban",{"$f":"VLOOKUP(D226,Region_Map!$A$4:$C$75,3,FALSE)","v":"Western"}]
[54890,"PO Box","Wascott","Douglas County","Non-Urban",{"$f":"VLOOKUP(D227,Region_Map!$A$4:$C$75,3,FALSE)","v":"Western"}]
[54725,"Standard","Boyceville","Dunn County","Non-Urban",{"$f":"VLOOKUP(D228,Region_Map!$A$4:$C$75,3,FALSE)","v":"Western"}]
[54730,"Standard","Colfax","Dunn County","Non-Urban",{"$f":"VLOOKUP(D229,Region_Map!$A$4:$C$75,3,FALSE)","v":"Western"}]
[54734,"Standard","Downing","Dunn County","Non-Urban",{"$f":"VLOOKUP(D230,Region_Map!$A$4:$C$75,3,FALSE)","v":"Western"}]
[54735,"PO Box","Downsville","Dunn County","Non-Urban",{"$f":"VLOOKUP(D231,Region_Map!$A$4:$C$75,3,FALSE)","v":"Western"}]
[54737,"Standard","Eau Galle","Dunn County","Non-Urban",{"$f":"VLOOKUP(D232,Region_Map!$A$4:$C$75,3,FALSE)","v":"Western"}]
[54739,"Standard","Elk Mound","Dunn County","Non-Urban",{"$f":"VLOOKUP(D233,Region_Map!$A$4:$C$75,3,FALSE)","v":"Western"}]
[54749,"Standard","Knapp","Dunn County","Non-Urban",{"$f":"VLOOKUP(D234,Region_Map!$A$4:$C$75,3,FALSE)","v":"Western"}]
[54751,"Standard","Menomonie","Dunn County","Non-Urban",{"$f":"VLOOKUP(D235,Region_Map!$A$4:$C$75,3,FALSE)","v":"Western"}]
[54763,"Standard","Ridgeland","Dunn County","Non-Urban",{"$f":"VLOOKUP(D236,Region_Map!$A$4:$C$75,3,FALSE)","v":"Western"}]
[54764,"PO Box","Rock Falls, Mondovi","Dunn County","Non-Urban",{"$f":"VLOOKUP(D237,Region_Map!$A$4:$C$75,3,FALSE)","v":"Western"}]
[54765,"PO Box","Sand Creek","Dunn County","Non-Urban",{"$f":"VLOOKUP(D238,Region_Map!$A$4:$C$75,3,FALSE)","v":"Western"}]
[54772,"Standard","Wheeler","Dunn County","Non-Urban",{"$f":"VLOOKUP(D239,Region_Map!$A$4:$C$75,3,FALSE)","v":"Western"}]
[54701,"Standard","Eau Claire","Eau Claire County","Non-Urban",{"$f":"VLOOKUP(D240,Region_Map!$A$4:$C$75,3,FALSE)","v":"Western"}]
[54702,"PO Box","Eau Claire","Eau Claire County","Non-Urban",{"$f":"VLOOKUP(D241,Region_Map!$A$4:$C$75,3,FALSE)","v":"Western"}]
[54703,"Standard","Eau Claire","Eau Claire County","Non-Urban",{"$f":"VLOOKUP(D242,Region_Map!$A$4:$C$75,3,FALSE)","v":"Western"}]
[54720,"Standard","Altoona","Eau Claire County","Non-Urban",{"$f":"VLOOKUP(D243,Region_Map!$A$4:$C$75,3,FALSE)","v":"Western"}]
[54722,"Standard","Augusta","Eau Claire County","Non-Urban",{"$f":"VLOOKUP(D244,Region_Map!$A$4:$C$75,3,FALSE)","v":"Western"}]
[54738,"Standard","Eleva","Eau Claire County","Non-Urban",{"$f":"VLOOKUP(D245,Region_Map!$A$4:$C$75,3,FALSE)","v":"Western"}]
[54741,"Standard","Fairchild","Eau Claire County","Non-Urban",{"$f":"VLOOKUP(D246,Region_Map!$A$4:$C$75,3,FALSE)","v":"Western"}]
[54742,"Standard","Fall Creek","Eau Claire County","Non-Urban",{"$f":"VLOOKUP(D247,Region_Map!$A$4:$C$75,3,FALSE)","v":"Western"}]
[54120,"Standard","Fence","Florence County","Non-Urban",{"$f":"VLOOKUP(D248,Region_Map!$A$4:$C$75,3,FALSE)","v":"Northern"}]
[54121,"Standard","Florence","Florence County","Non-Urban",{"$f":"VLOOKUP(D249,Region_Map!$A$4:$C$75,3,FALSE)","v":"Northern"}]
[53010,"Standard","Campbellsport","Fond Du Lac County","Non-Urban",{"$f":"VLOOKUP(D250,Region_Map!$A$4:$C$75,3,FALSE)","v":"Eastern"}]
[53019,"Standard","Eden","Fond Du Lac County","Non-Urban",{"$f":"VLOOKUP(D251,Region_Map!$A$4:$C$75,3,FALSE)","v":"Eastern"}]
[53049,"Standard","Malone","Fond Du Lac County","Non-Urban",{"$f":"VLOOKUP(D252,Region_Map!$A$4:$C$75,3,FALSE)","v":"Eastern"}]
[53057,"Standard","Mount Calvary","Fond Du Lac County","Non-Urban",{"$f":"VLOOKUP(D253,Region_Map!$A$4:$C$75,3,FALSE)","v":"Eastern"}]
[53065,"Standard","Oakfield","Fond Du Lac County","Non-Urban",{"$f":"VLOOKUP(D254,Region_Map!$A$4:$C$75,3,FALSE)","v":"Eastern"}]
[53079,"Standard","Saint Cloud","Fond Du Lac County","Non-Urban",{"$f":"VLOOKUP(D255,Region_Map!$A$4:$C$75,3,FALSE)","v":"Eastern"}]
[53919,"Standard","Brandon","Fond Du Lac County","Non-Urban",{"$f":"VLOOKUP(D256,Region_Map!$A$4:$C$75,3,FALSE)","v":"Eastern"}]
[53931,"PO Box","Fairwater","Fond Du Lac County","Non-Urban",{"$f":"VLOOKUP(D257,Region_Map!$A$4:$C$75,3,FALSE)","v":"Eastern"}]
[53963,"Standard","Waupun","Fond Du Lac County","Non-Urban",{"$f":"VLOOKUP(D258,Region_Map!$A$4:$C$75,3,FALSE)","v":"Eastern"}]
[54932,"Standard","Eldorado","Fond Du Lac County","Non-Urban",{"$f":"VLOOKUP(D259,Region_Map!$A$4:$C$75,3,FALSE)","v":"Eastern"}]
[54935,"Standard","Fond Du Lac, N Fond Du Lac, North Fond Du Lac, Tayche...","Fond Du Lac County","Non-Urban",{"$f":"VLOOKUP(D260,Region_Map!$A$4:$C$75,3,FALSE)","v":"Eastern"}]
[54936,"PO Box","Fond Du Lac","Fond du Lac County","Non-Urban",{"$f":"VLOOKUP(D261,Region_Map!$A$4:$C$75,3,FALSE)","v":"Eastern"}]
[54937,"Standard","Fond Du Lac, N Fond Du Lac, North Fond Du Lac","Fond Du Lac County","Non-Urban",{"$f":"VLOOKUP(D262,Region_Map!$A$4:$C$75,3,FALSE)","v":"Eastern"}]
[54971,"Standard","Ripon","Fond Du Lac County","Non-Urban",{"$f":"VLOOKUP(D263,Region_Map!$A$4:$C$75,3,FALSE)","v":"Eastern"}]
[54974,"Standard","Rosendale","Fond Du Lac County","Non-Urban",{"$f":"VLOOKUP(D264,Region_Map!$A$4:$C$75,3,FALSE)","v":"Eastern"}]
[54979,"Standard","Van Dyne","Fond Du Lac County","Non-Urban",{"$f":"VLOOKUP(D265,Region_Map!$A$4:$C$75,3,FALSE)","v":"Eastern"}]
[54103,"Standard","Armstrong Creek, Armstrong Crk","Forest County","Non-Urban",{"$f":"VLOOKUP(D266,Region_Map!$A$4:$C$75,3,FALSE)","v":"Northern"}]
[54465,"Standard","Pickerel","Forest County","Non-Urban",{"$f":"VLOOKUP(D267,Region_Map!$A$4:$C$75,3,FALSE)","v":"Northern"}]
[54511,"Standard","Argonne, Cavour, Hiles, Newald","Forest County","Non-Urban",{"$f":"VLOOKUP(D268,Region_Map!$A$4:$C$75,3,FALSE)","v":"Northern"}]
[54520,"Standard","Crandon","Forest County","Non-Urban",{"$f":"VLOOKUP(D269,Region_Map!$A$4:$C$75,3,FALSE)","v":"Northern"}]
[54541,"Standard","Laona","Forest County","Non-Urban",{"$f":"VLOOKUP(D270,Region_Map!$A$4:$C$75,3,FALSE)","v":"Northern"}]
[54542,"Standard","Long Lake, Alvin, Nelma, Tipler","Forest County","Non-Urban",{"$f":"VLOOKUP(D271,Region_Map!$A$4:$C$75,3,FALSE)","v":"Northern"}]
[54566,"Standard","Wabeno","Forest County","Non-Urban",{"$f":"VLOOKUP(D272,Region_Map!$A$4:$C$75,3,FALSE)","v":"Northern"}]
[53554,"Standard","Livingston","Grant County","Non-Urban",{"$f":"VLOOKUP(D273,Region_Map!$A$4:$C$75,3,FALSE)","v":"Southern"}]
[53569,"Standard","Montfort","Grant County","Non-Urban",{"$f":"VLOOKUP(D274,Region_Map!$A$4:$C$75,3,FALSE)","v":"Southern"}]
[53801,"Standard","Bagley","Grant County","Non-Urban",{"$f":"VLOOKUP(D275,Region_Map!$A$4:$C$75,3,FALSE)","v":"Southern"}]
[53802,"PO Box","Beetown","Grant County","Non-Urban",{"$f":"VLOOKUP(D276,Region_Map!$A$4:$C$75,3,FALSE)","v":"Southern"}]
[53804,"Standard","Bloomington","Grant County","Non-Urban",{"$f":"VLOOKUP(D277,Region_Map!$A$4:$C$75,3,FALSE)","v":"Southern"}]
[53805,"Standard","Boscobel","Grant County","Non-Urban",{"$f":"VLOOKUP(D278,Region_Map!$A$4:$C$75,3,FALSE)","v":"Southern"}]
[53806,"Standard","Cassville","Grant County","Non-Urban",{"$f":"VLOOKUP(D279,Region_Map!$A$4:$C$75,3,FALSE)","v":"Southern"}]
[53807,"Standard","Cuba City","Grant County","Non-Urban",{"$f":"VLOOKUP(D280,Region_Map!$A$4:$C$75,3,FALSE)","v":"Southern"}]
[53808,"PO Box","Dickeyville","Grant County","Non-Urban",{"$f":"VLOOKUP(D281,Region_Map!$A$4:$C$75,3,FALSE)","v":"Southern"}]
[53809,"Standard","Fennimore","Grant County","Non-Urban",{"$f":"VLOOKUP(D282,Region_Map!$A$4:$C$75,3,FALSE)","v":"Southern"}]
[53810,"Standard","Glen Haven","Grant County","Non-Urban",{"$f":"VLOOKUP(D283,Region_Map!$A$4:$C$75,3,FALSE)","v":"Southern"}]
[53811,"Standard","Hazel Green","Grant County","Non-Urban",{"$f":"VLOOKUP(D284,Region_Map!$A$4:$C$75,3,FALSE)","v":"Southern"}]
[53812,"PO Box","Kieler","Grant County","Non-Urban",{"$f":"VLOOKUP(D285,Region_Map!$A$4:$C$75,3,FALSE)","v":"Southern"}]
[53813,"Standard","Lancaster","Grant County","Non-Urban",{"$f":"VLOOKUP(D286,Region_Map!$A$4:$C$75,3,FALSE)","v":"Southern"}]
[53816,"Standard","Mount Hope","Grant County","Non-Urban",{"$f":"VLOOKUP(D287,Region_Map!$A$4:$C$75,3,FALSE)","v":"Southern"}]
[53817,"PO Box","Patch Grove","Grant County","Non-Urban",{"$f":"VLOOKUP(D288,Region_Map!$A$4:$C$75,3,FALSE)","v":"Southern"}]
[53818,"Standard","Platteville","Grant County","Non-Urban",{"$f":"VLOOKUP(D289,Region_Map!$A$4:$C$75,3,FALSE)","v":"Southern"}]
[53820,"Standard","Potosi","Grant County","Non-Urban",{"$f":"VLOOKUP(D290,Region_Map!$A$4:$C$75,3,FALSE)","v":"Southern"}]
[53824,"PO Box","Sinsinawa","Grant County","Non-Urban",{"$f":"VLOOKUP(D291,Region_Map!$A$4:$C$75,3,FALSE)","v":"Southern"}]
[53825,"Standard","Stitzer","Grant County","Non-Urban",{"$f":"VLOOKUP(D292,Region_Map!$A$4:$C$75,3,FALSE)","v":"Southern"}]
[53827,"Standard","Woodman","Grant County","Non-Urban",{"$f":"VLOOKUP(D293,Region_Map!$A$4:$C$75,3,FALSE)","v":"Southern"}]
[53502,"Standard","Albany","Green County","Non-Urban",{"$f":"VLOOKUP(D294,Region_Map!$A$4:$C$75,3,FALSE)","v":"Southern"}]
[53520,"Standard","Brodhead","Green County","Non-Urban",{"$f":"VLOOKUP(D295,Region_Map!$A$4:$C$75,3,FALSE)","v":"Southern"}]
[53521,"Standard","Brooklyn","Green County","Non-Urban",{"$f":"VLOOKUP(D296,Region_Map!$A$4:$C$75,3,FALSE)","v":"Southern"}]
[53522,"Standard","Browntown","Green County","Non-Urban",{"$f":"VLOOKUP(D297,Region_Map!$A$4:$C$75,3,FALSE)","v":"Southern"}]
[53550,"Standard","Juda","Green County","Non-Urban",{"$f":"VLOOKUP(D298,Region_Map!$A$4:$C$75,3,FALSE)","v":"Southern"}]
[53566,"Standard","Monroe","Green County","Non-Urban",{"$f":"VLOOKUP(D299,Region_Map!$A$4:$C$75,3,FALSE)","v":"Southern"}]
[53570,"Standard","Monticello","Green County","Non-Urban",{"$f":"VLOOKUP(D300,Region_Map!$A$4:$C$75,3,FALSE)","v":"Southern"}]
[53574,"Standard","New Glarus","Green County","Non-Urban",{"$f":"VLOOKUP(D301,Region_Map!$A$4:$C$75,3,FALSE)","v":"Southern"}]
[53926,"Standard","Dalton","Green Lake County","Non-Urban",{"$f":"VLOOKUP(D302,Region_Map!$A$4:$C$75,3,FALSE)","v":"Eastern"}]
[53939,"PO Box","Kingston","Green Lake County","Non-Urban",{"$f":"VLOOKUP(D303,Region_Map!$A$4:$C$75,3,FALSE)","v":"Eastern"}]
[53946,"Standard","Markesan, Manchester","Green Lake County","Non-Urban",{"$f":"VLOOKUP(D304,Region_Map!$A$4:$C$75,3,FALSE)","v":"Eastern"}]
[53947,"PO Box","Marquette","Green Lake County","Non-Urban",{"$f":"VLOOKUP(D305,Region_Map!$A$4:$C$75,3,FALSE)","v":"Eastern"}]
[54941,"Standard","Green Lake","Green Lake County","Non-Urban",{"$f":"VLOOKUP(D306,Region_Map!$A$4:$C$75,3,FALSE)","v":"Eastern"}]
[54968,"Standard","Princeton","Green Lake County","Non-Urban",{"$f":"VLOOKUP(D307,Region_Map!$A$4:$C$75,3,FALSE)","v":"Eastern"}]
[53503,"Standard","Arena","Iowa County","Non-Urban",{"$f":"VLOOKUP(D308,Region_Map!$A$4:$C$75,3,FALSE)","v":"Southern"}]
[53506,"Standard","Avoca","Iowa County","Non-Urban",{"$f":"VLOOKUP(D309,Region_Map!$A$4:$C$75,3,FALSE)","v":"Southern"}]
[53507,"Standard","Barneveld","Iowa County","Non-Urban",{"$f":"VLOOKUP(D310,Region_Map!$A$4:$C$75,3,FALSE)","v":"Southern"}]
[53526,"Standard","Cobb","Iowa County","Non-Urban",{"$f":"VLOOKUP(D311,Region_Map!$A$4:$C$75,3,FALSE)","v":"Southern"}]
[53533,"Standard","Dodgeville","Iowa County","Non-Urban",{"$f":"VLOOKUP(D312,Region_Map!$A$4:$C$75,3,FALSE)","v":"Southern"}]
[53535,"PO Box","Edmund","Iowa County","Non-Urban",{"$f":"VLOOKUP(D313,Region_Map!$A$4:$C$75,3,FALSE)","v":"Southern"}]
[53543,"Standard","Highland","Iowa County","Non-Urban",{"$f":"VLOOKUP(D314,Region_Map!$A$4:$C$75,3,FALSE)","v":"Southern"}]
[53544,"Standard","Hollandale","Iowa County","Non-Urban",{"$f":"VLOOKUP(D315,Region_Map!$A$4:$C$75,3,FALSE)","v":"Southern"}]
[53553,"Standard","Linden","Iowa County","Non-Urban",{"$f":"VLOOKUP(D316,Region_Map!$A$4:$C$75,3,FALSE)","v":"Southern"}]
[53565,"Standard","Mineral Point","Iowa County","Non-Urban",{"$f":"VLOOKUP(D317,Region_Map!$A$4:$C$75,3,FALSE)","v":"Southern"}]
[53580,"Standard","Rewey","Iowa County","Non-Urban",{"$f":"VLOOKUP(D318,Region_Map!$A$4:$C$75,3,FALSE)","v":"Southern"}]
[53582,"Standard","Ridgeway","Iowa County","Non-Urban",{"$f":"VLOOKUP(D319,Region_Map!$A$4:$C$75,3,FALSE)","v":"Southern"}]
[53595,"Unique","Dodgeville","Iowa County","Non-Urban",{"$f":"VLOOKUP(D320,Region_Map!$A$4:$C$75,3,FALSE)","v":"Southern"}]
[54525,"Standard","Gile","Iron County","Non-Urban",{"$f":"VLOOKUP(D321,Region_Map!$A$4:$C$75,3,FALSE)","v":"Northern"}]
[54534,"Standard","Hurley","Iron County","Non-Urban",{"$f":"VLOOKUP(D322,Region_Map!$A$4:$C$75,3,FALSE)","v":"Northern"}]
[54536,"PO Box","Iron Belt","Iron County","Non-Urban",{"$f":"VLOOKUP(D323,Region_Map!$A$4:$C$75,3,FALSE)","v":"Northern"}]
[54547,"Standard","Mercer","Iron County","Non-Urban",{"$f":"VLOOKUP(D324,Region_Map!$A$4:$C$75,3,FALSE)","v":"Northern"}]
[54550,"Standard","Montreal, Pence","Iron County","Non-Urban",{"$f":"VLOOKUP(D325,Region_Map!$A$4:$C$75,3,FALSE)","v":"Northern"}]
[54559,"Standard","Saxon, Gurney","Iron County","Non-Urban",{"$f":"VLOOKUP(D326,Region_Map!$A$4:$C$75,3,FALSE)","v":"Northern"}]
[54565,"Standard","Upson","Iron County","Non-Urban",{"$f":"VLOOKUP(D327,Region_Map!$A$4:$C$75,3,FALSE)","v":"Northern"}]
[54611,"Standard","Alma Center","Jackson County","Non-Urban",{"$f":"VLOOKUP(D328,Region_Map!$A$4:$C$75,3,FALSE)","v":"Western"}]
[54615,"Standard","Black River Falls, Blk River Fls","Jackson County","Non-Urban",{"$f":"VLOOKUP(D329,Region_Map!$A$4:$C$75,3,FALSE)","v":"Western"}]
[54635,"Standard","Hixton, Northfield","Jackson County","Non-Urban",{"$f":"VLOOKUP(D330,Region_Map!$A$4:$C$75,3,FALSE)","v":"Western"}]
[54642,"Standard","Melrose","Jackson County","Non-Urban",{"$f":"VLOOKUP(D331,Region_Map!$A$4:$C$75,3,FALSE)","v":"Western"}]
[54643,"PO Box","Millston","Jackson County","Non-Urban",{"$f":"VLOOKUP(D332,Region_Map!$A$4:$C$75,3,FALSE)","v":"Western"}]
[54659,"Standard","Taylor","Jackson County","Non-Urban",{"$f":"VLOOKUP(D333,Region_Map!$A$4:$C$75,3,FALSE)","v":"Western"}]
[53036,"Standard","Ixonia","Jefferson County","Non-Urban",{"$f":"VLOOKUP(D334,Region_Map!$A$4:$C$75,3,FALSE)","v":"Southern"}]
[53038,"Standard","Johnson Creek","Jefferson County","Non-Urban",{"$f":"VLOOKUP(D335,Region_Map!$A$4:$C$75,3,FALSE)","v":"Southern"}]
[53094,"Standard","Watertown, Johnson Creek","Jefferson County","Non-Urban",{"$f":"VLOOKUP(D336,Region_Map!$A$4:$C$75,3,FALSE)","v":"Southern"}]
[53137,"Standard","Helenville","Jefferson County","Non-Urban",{"$f":"VLOOKUP(D337,Region_Map!$A$4:$C$75,3,FALSE)","v":"Southern"}]
[53156,"Standard","Palmyra","Jefferson County","Non-Urban",{"$f":"VLOOKUP(D338,Region_Map!$A$4:$C$75,3,FALSE)","v":"Southern"}]
[53178,"Standard","Sullivan","Jefferson County","Non-Urban",{"$f":"VLOOKUP(D339,Region_Map!$A$4:$C$75,3,FALSE)","v":"Southern"}]
[53538,"Standard","Fort Atkinson","Jefferson County","Non-Urban",{"$f":"VLOOKUP(D340,Region_Map!$A$4:$C$75,3,FALSE)","v":"Southern"}]
[53549,"Standard","Jefferson","Jefferson County","Non-Urban",{"$f":"VLOOKUP(D341,Region_Map!$A$4:$C$75,3,FALSE)","v":"Southern"}]
[53551,"Standard","Lake Mills","Jefferson County","Non-Urban",{"$f":"VLOOKUP(D342,Region_Map!$A$4:$C$75,3,FALSE)","v":"Southern"}]
[53594,"Standard","Waterloo","Jefferson County","Non-Urban",{"$f":"VLOOKUP(D343,Region_Map!$A$4:$C$75,3,FALSE)","v":"Southern"}]
[53929,"Standard","Elroy","Juneau County","Non-Urban",{"$f":"VLOOKUP(D344,Region_Map!$A$4:$C$75,3,FALSE)","v":"Southern"}]
[53944,"Standard","Lyndon Station, Lyndon Sta","Juneau County","Non-Urban",{"$f":"VLOOKUP(D345,Region_Map!$A$4:$C$75,3,FALSE)","v":"Southern"}]
[53948,"Standard","Mauston","Juneau County","Non-Urban",{"$f":"VLOOKUP(D346,Region_Map!$A$4:$C$75,3,FALSE)","v":"Southern"}]
[53950,"Standard","New Lisbon","Juneau County","Non-Urban",{"$f":"VLOOKUP(D347,Region_Map!$A$4:$C$75,3,FALSE)","v":"Southern"}]
[53962,"PO Box","Union Center","Juneau County","Non-Urban",{"$f":"VLOOKUP(D348,Region_Map!$A$4:$C$75,3,FALSE)","v":"Southern"}]
[53968,"Standard","Wonewoc","Juneau County","Non-Urban",{"$f":"VLOOKUP(D349,Region_Map!$A$4:$C$75,3,FALSE)","v":"Southern"}]
[54618,"Standard","Camp Douglas, Cutler","Juneau County","Non-Urban",{"$f":"VLOOKUP(D350,Region_Map!$A$4:$C$75,3,FALSE)","v":"Southern"}]
[54637,"PO Box","Hustler, Camp Douglas","Juneau County","Non-Urban",{"$f":"VLOOKUP(D351,Region_Map!$A$4:$C$75,3,FALSE)","v":"Southern"}]
[54641,"PO Box","Mather","Juneau County","Non-Urban",{"$f":"VLOOKUP(D352,Region_Map!$A$4:$C$75,3,FALSE)","v":"Southern"}]
[54646,"Standard","Necedah","Juneau County","Non-Urban",{"$f":"VLOOKUP(D353,Region_Map!$A$4:$C$75,3,FALSE)","v":"Southern"}]
[53101,"PO Box","Bassett","Kenosha County","Urban",{"$f":"VLOOKUP(D354,Region_Map!$A$4:$C$75,3,FALSE)","v":"Eastern"}]
[53102,"PO Box","Benet Lake, Trevor","Kenosha County","Urban",{"$f":"VLOOKUP(D355,Region_Map!$A$4:$C$75,3,FALSE)","v":"Eastern"}]
[53104,"Standard","Bristol","Kenosha County","Urban",{"$f":"VLOOKUP(D356,Region_Map!$A$4:$C$75,3,FALSE)","v":"Eastern"}]
[53109,"PO Box","Camp Lake","Kenosha County","Urban",{"$f":"VLOOKUP(D357,Region_Map!$A$4:$C$75,3,FALSE)","v":"Eastern"}]
[53140,"Standard","Kenosha","Kenosha County","Urban",{"$f":"VLOOKUP(D358,Region_Map!$A$4:$C$75,3,FALSE)","v":"Eastern"}]
[53141,"PO Box","Kenosha","Kenosha County","Urban",{"$f":"VLOOKUP(D359,Region_Map!$A$4:$C$75,3,FALSE)","v":"Eastern"}]
[53142,"Standard","Kenosha","Kenosha County","Urban",{"$f":"VLOOKUP(D360,Region_Map!$A$4:$C$75,3,FALSE)","v":"Eastern"}]
[53143,"Standard","Kenosha","Kenosha County","Urban",{"$f":"VLOOKUP(D361,Region_Map!$A$4:$C$75,3,FALSE)","v":"Eastern"}]
[53144,"Standard","Kenosha","Kenosha County","Urban",{"$f":"VLOOKUP(D362,Region_Map!$A$4:$C$75,3,FALSE)","v":"Eastern"}]
[53152,"PO Box","New Munster","Kenosha County","Urban",{"$f":"VLOOKUP(D363,Region_Map!$A$4:$C$75,3,FALSE)","v":"Eastern"}]
[53158,"Standard","Pleasant Prairie, Kenosha, Pleasant Pr","Kenosha County","Urban",{"$f":"VLOOKUP(D364,Region_Map!$A$4:$C$75,3,FALSE)","v":"Eastern"}]
[53159,"PO Box","Powers Lake","Kenosha County","Urban",{"$f":"VLOOKUP(D365,Region_Map!$A$4:$C$75,3,FALSE)","v":"Eastern"}]
[53168,"Standard","Salem","Kenosha County","Urban",{"$f":"VLOOKUP(D366,Region_Map!$A$4:$C$75,3,FALSE)","v":"Eastern"}]
[53170,"Standard","Silver Lake","Kenosha County","Urban",{"$f":"VLOOKUP(D367,Region_Map!$A$4:$C$75,3,FALSE)","v":"Eastern"}]
[53171,"PO Box","Somers","Kenosha County","Urban",{"$f":"VLOOKUP(D368,Region_Map!$A$4:$C$75,3,FALSE)","v":"Eastern"}]
[53179,"Standard","Trevor","Kenosha County","Urban",{"$f":"VLOOKUP(D369,Region_Map!$A$4:$C$75,3,FALSE)","v":"Eastern"}]
[53181,"Standard","Twin Lakes","Kenosha County","Urban",{"$f":"VLOOKUP(D370,Region_Map!$A$4:$C$75,3,FALSE)","v":"Eastern"}]
[53192,"PO Box","Wilmot","Kenosha County","Urban",{"$f":"VLOOKUP(D371,Region_Map!$A$4:$C$75,3,FALSE)","v":"Eastern"}]
[53194,"PO Box","Woodworth","Kenosha County","Urban",{"$f":"VLOOKUP(D372,Region_Map!$A$4:$C$75,3,FALSE)","v":"Eastern"}]
[53199,"PO Box","Silver Lake","Kenosha County","Urban",{"$f":"VLOOKUP(D373,Region_Map!$A$4:$C$75,3,FALSE)","v":"Eastern"}]
[54201,"Standard","Algoma, Rio Creek","Kewaunee County","Non-Urban",{"$f":"VLOOKUP(D374,Region_Map!$A$4:$C$75,3,FALSE)","v":"Eastern"}]
[54205,"Standard","Casco","Kewaunee County","Non-Urban",{"$f":"VLOOKUP(D375,Region_Map!$A$4:$C$75,3,FALSE)","v":"Eastern"}]
[54216,"Standard","Kewaunee","Kewaunee County","Non-Urban",{"$f":"VLOOKUP(D376,Region_Map!$A$4:$C$75,3,FALSE)","v":"Eastern"}]
[54217,"Standard","Luxemburg","Kewaunee County","Non-Urban",{"$f":"VLOOKUP(D377,Region_Map!$A$4:$C$75,3,FALSE)","v":"Eastern"}]
[54601,"Standard","La Crosse","La Crosse County","Non-Urban",{"$f":"VLOOKUP(D378,Region_Map!$A$4:$C$75,3,FALSE)","v":"Southern"}]
[54602,"PO Box","La Crosse","La Crosse County","Non-Urban",{"$f":"VLOOKUP(D379,Region_Map!$A$4:$C$75,3,FALSE)","v":"Southern"}]
[54603,"Standard","La Crosse","La Crosse County","Non-Urban",{"$f":"VLOOKUP(D380,Region_Map!$A$4:$C$75,3,FALSE)","v":"Southern"}]
[54614,"Standard","Bangor","La Crosse County","Non-Urban",{"$f":"VLOOKUP(D381,Region_Map!$A$4:$C$75,3,FALSE)","v":"Southern"}]
[54636,"Standard","Holmen","La Crosse County","Non-Urban",{"$f":"VLOOKUP(D382,Region_Map!$A$4:$C$75,3,FALSE)","v":"Southern"}]
[54644,"Standard","Mindoro","La Crosse County","Non-Urban",{"$f":"VLOOKUP(D383,Region_Map!$A$4:$C$75,3,FALSE)","v":"Southern"}]
[54650,"Standard","Onalaska","La Crosse County","Non-Urban",{"$f":"VLOOKUP(D384,Region_Map!$A$4:$C$75,3,FALSE)","v":"Southern"}]
[54653,"Standard","Rockland","La Crosse County","Non-Urban",{"$f":"VLOOKUP(D385,Region_Map!$A$4:$C$75,3,FALSE)","v":"Southern"}]
[54669,"Standard","West Salem","La Crosse County","Non-Urban",{"$f":"VLOOKUP(D386,Region_Map!$A$4:$C$75,3,FALSE)","v":"Southern"}]
[53504,"Standard","Argyle","Lafayette County","Non-Urban",{"$f":"VLOOKUP(D387,Region_Map!$A$4:$C$75,3,FALSE)","v":"Southern"}]
[53510,"Standard","Belmont","Lafayette County","Non-Urban",{"$f":"VLOOKUP(D388,Region_Map!$A$4:$C$75,3,FALSE)","v":"Southern"}]
[53516,"Standard","Blanchardville, Blanchardvlle","Lafayette County","Non-Urban",{"$f":"VLOOKUP(D389,Region_Map!$A$4:$C$75,3,FALSE)","v":"Southern"}]
[53530,"Standard","Darlington","Lafayette County","Non-Urban",{"$f":"VLOOKUP(D390,Region_Map!$A$4:$C$75,3,FALSE)","v":"Southern"}]
[53541,"Standard","Gratiot","Lafayette County","Non-Urban",{"$f":"VLOOKUP(D391,Region_Map!$A$4:$C$75,3,FALSE)","v":"Southern"}]
[53586,"Standard","Shullsburg","Lafayette County","Non-Urban",{"$f":"VLOOKUP(D392,Region_Map!$A$4:$C$75,3,FALSE)","v":"Southern"}]
[53587,"Standard","South Wayne","Lafayette County","Non-Urban",{"$f":"VLOOKUP(D393,Region_Map!$A$4:$C$75,3,FALSE)","v":"Southern"}]
[53599,"PO Box","Woodford","Lafayette County","Non-Urban",{"$f":"VLOOKUP(D394,Region_Map!$A$4:$C$75,3,FALSE)","v":"Southern"}]
[53803,"Standard","Benton","Lafayette County","Non-Urban",{"$f":"VLOOKUP(D395,Region_Map!$A$4:$C$75,3,FALSE)","v":"Southern"}]
[54409,"Standard","Antigo","Langlade County","Non-Urban",{"$f":"VLOOKUP(D396,Region_Map!$A$4:$C$75,3,FALSE)","v":"Northern"}]
[54418,"Standard","Bryant","Langlade County","Non-Urban",{"$f":"VLOOKUP(D397,Region_Map!$A$4:$C$75,3,FALSE)","v":"Northern"}]
[54424,"Standard","Deerbrook, Kempster","Langlade County","Non-Urban",{"$f":"VLOOKUP(D398,Region_Map!$A$4:$C$75,3,FALSE)","v":"Northern"}]
[54428,"Standard","Elcho","Langlade County","Non-Urban",{"$f":"VLOOKUP(D399,Region_Map!$A$4:$C$75,3,FALSE)","v":"Northern"}]
[54430,"Standard","Elton","Langlade County","Non-Urban",{"$f":"VLOOKUP(D400,Region_Map!$A$4:$C$75,3,FALSE)","v":"Northern"}]
[54462,"Standard","Pearson","Langlade County","Non-Urban",{"$f":"VLOOKUP(D401,Region_Map!$A$4:$C$75,3,FALSE)","v":"Northern"}]
[54464,"PO Box","Phlox","Langlade County","Non-Urban",{"$f":"VLOOKUP(D402,Region_Map!$A$4:$C$75,3,FALSE)","v":"Northern"}]
[54485,"Standard","Summit Lake","Langlade County","Non-Urban",{"$f":"VLOOKUP(D403,Region_Map!$A$4:$C$75,3,FALSE)","v":"Northern"}]
[54491,"Standard","White Lake, Lily","Langlade County","Non-Urban",{"$f":"VLOOKUP(D404,Region_Map!$A$4:$C$75,3,FALSE)","v":"Northern"}]
[54435,"Standard","Gleason","Lincoln County","Non-Urban",{"$f":"VLOOKUP(D405,Region_Map!$A$4:$C$75,3,FALSE)","v":"Northern"}]
[54442,"Standard","Irma","Lincoln County","Non-Urban",{"$f":"VLOOKUP(D406,Region_Map!$A$4:$C$75,3,FALSE)","v":"Northern"}]
[54452,"Standard","Merrill","Lincoln County","Non-Urban",{"$f":"VLOOKUP(D407,Region_Map!$A$4:$C$75,3,FALSE)","v":"Northern"}]
[54487,"Standard","Tomahawk","Lincoln County","Non-Urban",{"$f":"VLOOKUP(D408,Region_Map!$A$4:$C$75,3,FALSE)","v":"Northern"}]
[54532,"PO Box","Heafford Junction, Heafford Jct, Tomahawk","Lincoln County","Non-Urban",{"$f":"VLOOKUP(D409,Region_Map!$A$4:$C$75,3,FALSE)","v":"Northern"}]
[53015,"Standard","Cleveland","Manitowoc County","Non-Urban",{"$f":"VLOOKUP(D410,Region_Map!$A$4:$C$75,3,FALSE)","v":"Eastern"}]
[53042,"Standard","Kiel","Manitowoc County","Non-Urban",{"$f":"VLOOKUP(D411,Region_Map!$A$4:$C$75,3,FALSE)","v":"Eastern"}]
[53063,"Standard","Newton","Manitowoc County","Non-Urban",{"$f":"VLOOKUP(D412,Region_Map!$A$4:$C$75,3,FALSE)","v":"Eastern"}]
[54207,"PO Box","Collins","Manitowoc County","Non-Urban",{"$f":"VLOOKUP(D413,Region_Map!$A$4:$C$75,3,FALSE)","v":"Eastern"}]
[54214,"PO Box","Francis Creek","Manitowoc County","Non-Urban",{"$f":"VLOOKUP(D414,Region_Map!$A$4:$C$75,3,FALSE)","v":"Eastern"}]
[54215,"PO Box","Kellnersville","Manitowoc County","Non-Urban",{"$f":"VLOOKUP(D415,Region_Map!$A$4:$C$75,3,FALSE)","v":"Eastern"}]
[54220,"Standard","Manitowoc","Manitowoc County","Non-Urban",{"$f":"VLOOKUP(D416,Region_Map!$A$4:$C$75,3,FALSE)","v":"Eastern"}]
[54221,"PO Box","Manitowoc","Manitowoc County","Non-Urban",{"$f":"VLOOKUP(D417,Region_Map!$A$4:$C$75,3,FALSE)","v":"Eastern"}]
[54227,"Standard","Maribel","Manitowoc County","Non-Urban",{"$f":"VLOOKUP(D418,Region_Map!$A$4:$C$75,3,FALSE)","v":"Eastern"}]
[54228,"Standard","Mishicot","Manitowoc County","Non-Urban",{"$f":"VLOOKUP(D419,Region_Map!$A$4:$C$75,3,FALSE)","v":"Eastern"}]
[54230,"Standard","Reedsville, Cato","Manitowoc County","Non-Urban",{"$f":"VLOOKUP(D420,Region_Map!$A$4:$C$75,3,FALSE)","v":"Eastern"}]
[54232,"PO Box","Saint Nazianz","Manitowoc County","Non-Urban",{"$f":"VLOOKUP(D421,Region_Map!$A$4:$C$75,3,FALSE)","v":"Eastern"}]
[54240,"PO Box","Tisch Mills","Manitowoc County","Non-Urban",{"$f":"VLOOKUP(D422,Region_Map!$A$4:$C$75,3,FALSE)","v":"Eastern"}]
[54241,"Standard","Two Rivers","Manitowoc County","Non-Urban",{"$f":"VLOOKUP(D423,Region_Map!$A$4:$C$75,3,FALSE)","v":"Eastern"}]
[54245,"Standard","Valders","Manitowoc County","Non-Urban",{"$f":"VLOOKUP(D424,Region_Map!$A$4:$C$75,3,FALSE)","v":"Eastern"}]
[54247,"Standard","Whitelaw, Branch","Manitowoc County","Non-Urban",{"$f":"VLOOKUP(D425,Region_Map!$A$4:$C$75,3,FALSE)","v":"Eastern"}]
[54401,"Standard","Wausau","Marathon County","Non-Urban",{"$f":"VLOOKUP(D426,Region_Map!$A$4:$C$75,3,FALSE)","v":"Northern"}]
[54402,"PO Box","Wausau","Marathon County","Non-Urban",{"$f":"VLOOKUP(D427,Region_Map!$A$4:$C$75,3,FALSE)","v":"Northern"}]
[54403,"Standard","Wausau","Marathon County","Non-Urban",{"$f":"VLOOKUP(D428,Region_Map!$A$4:$C$75,3,FALSE)","v":"Northern"}]
[54405,"Standard","Abbotsford","Marathon County","Non-Urban",{"$f":"VLOOKUP(D429,Region_Map!$A$4:$C$75,3,FALSE)","v":"Northern"}]
[54408,"Standard","Aniwa","Marathon County","Non-Urban",{"$f":"VLOOKUP(D430,Region_Map!$A$4:$C$75,3,FALSE)","v":"Northern"}]
[54411,"Standard","Athens, Hamburg, Milan","Marathon County","Non-Urban",{"$f":"VLOOKUP(D431,Region_Map!$A$4:$C$75,3,FALSE)","v":"Northern"}]
[54417,"PO Box","Brokaw","Marathon County","Non-Urban",{"$f":"VLOOKUP(D432,Region_Map!$A$4:$C$75,3,FALSE)","v":"Northern"}]
[54421,"Standard","Colby","Marathon County","Non-Urban",{"$f":"VLOOKUP(D433,Region_Map!$A$4:$C$75,3,FALSE)","v":"Northern"}]
[54426,"Standard","Edgar, Fenwood","Marathon County","Non-Urban",{"$f":"VLOOKUP(D434,Region_Map!$A$4:$C$75,3,FALSE)","v":"Northern"}]
[54427,"Standard","Eland","Marathon County","Non-Urban",{"$f":"VLOOKUP(D435,Region_Map!$A$4:$C$75,3,FALSE)","v":"Northern"}]
[54429,"PO Box","Elderon","Marathon County","Non-Urban",{"$f":"VLOOKUP(D436,Region_Map!$A$4:$C$75,3,FALSE)","v":"Northern"}]
[54432,"PO Box","Galloway, Wittenberg","Marathon County","Non-Urban",{"$f":"VLOOKUP(D437,Region_Map!$A$4:$C$75,3,FALSE)","v":"Northern"}]
[54440,"Standard","Hatley","Marathon County","Non-Urban",{"$f":"VLOOKUP(D438,Region_Map!$A$4:$C$75,3,FALSE)","v":"Northern"}]
[54448,"Standard","Marathon","Marathon County","Non-Urban",{"$f":"VLOOKUP(D439,Region_Map!$A$4:$C$75,3,FALSE)","v":"Northern"}]
[54455,"Standard","Mosinee, Kronenwetter","Marathon County","Non-Urban",{"$f":"VLOOKUP(D440,Region_Map!$A$4:$C$75,3,FALSE)","v":"Northern"}]
[54471,"Standard","Ringle","Marathon County","Non-Urban",{"$f":"VLOOKUP(D441,Region_Map!$A$4:$C$75,3,FALSE)","v":"Northern"}]
[54474,"Standard","Rothschild","Marathon County","Non-Urban",{"$f":"VLOOKUP(D442,Region_Map!$A$4:$C$75,3,FALSE)","v":"Northern"}]
[54476,"Standard","Schofield, Weston","Marathon County","Non-Urban",{"$f":"VLOOKUP(D443,Region_Map!$A$4:$C$75,3,FALSE)","v":"Northern"}]
[54479,"Standard","Spencer","Marathon County","Non-Urban",{"$f":"VLOOKUP(D444,Region_Map!$A$4:$C$75,3,FALSE)","v":"Northern"}]
[54484,"Standard","Stratford","Marathon County","Non-Urban",{"$f":"VLOOKUP(D445,Region_Map!$A$4:$C$75,3,FALSE)","v":"Northern"}]
[54102,"Standard","Amberg","Marinette County","Non-Urban",{"$f":"VLOOKUP(D446,Region_Map!$A$4:$C$75,3,FALSE)","v":"Eastern"}]
[54104,"Standard","Athelstane, Silver Cliff","Marinette County","Non-Urban",{"$f":"VLOOKUP(D447,Region_Map!$A$4:$C$75,3,FALSE)","v":"Eastern"}]
[54112,"Standard","Coleman","Marinette County","Non-Urban",{"$f":"VLOOKUP(D448,Region_Map!$A$4:$C$75,3,FALSE)","v":"Eastern"}]
[54114,"Standard","Crivitz, Beaver, Middle Inlet","Marinette County","Non-Urban",{"$f":"VLOOKUP(D449,Region_Map!$A$4:$C$75,3,FALSE)","v":"Eastern"}]
[54119,"Standard","Dunbar, Pembine","Marinette County","Non-Urban",{"$f":"VLOOKUP(D450,Region_Map!$A$4:$C$75,3,FALSE)","v":"Eastern"}]
[54125,"Standard","Goodman","Marinette County","Non-Urban",{"$f":"VLOOKUP(D451,Region_Map!$A$4:$C$75,3,FALSE)","v":"Eastern"}]
[54143,"Standard","Marinette","Marinette County","Non-Urban",{"$f":"VLOOKUP(D452,Region_Map!$A$4:$C$75,3,FALSE)","v":"Eastern"}]
[54151,"Standard","Niagara","Marinette County","Non-Urban",{"$f":"VLOOKUP(D453,Region_Map!$A$4:$C$75,3,FALSE)","v":"Eastern"}]
[54156,"Standard","Pembine","Marinette County","Non-Urban",{"$f":"VLOOKUP(D454,Region_Map!$A$4:$C$75,3,FALSE)","v":"Eastern"}]
[54157,"Standard","Peshtigo","Marinette County","Non-Urban",{"$f":"VLOOKUP(D455,Region_Map!$A$4:$C$75,3,FALSE)","v":"Eastern"}]
[54159,"Standard","Porterfield","Marinette County","Non-Urban",{"$f":"VLOOKUP(D456,Region_Map!$A$4:$C$75,3,FALSE)","v":"Eastern"}]
[54161,"Standard","Pound","Marinette County","Non-Urban",{"$f":"VLOOKUP(D457,Region_Map!$A$4:$C$75,3,FALSE)","v":"Eastern"}]
[54177,"Standard","Wausaukee","Marinette County","Non-Urban",{"$f":"VLOOKUP(D458,Region_Map!$A$4:$C$75,3,FALSE)","v":"Eastern"}]
[53920,"Standard","Briggsville","Marquette County","Non-Urban",{"$f":"VLOOKUP(D459,Region_Map!$A$4:$C$75,3,FALSE)","v":"Eastern"}]
[53930,"Standard","Endeavor","Marquette County","Non-Urban",{"$f":"VLOOKUP(D460,Region_Map!$A$4:$C$75,3,FALSE)","v":"Eastern"}]
[53949,"Standard","Montello","Marquette County","Non-Urban",{"$f":"VLOOKUP(D461,Region_Map!$A$4:$C$75,3,FALSE)","v":"Eastern"}]
[53953,"PO Box","Packwaukee","Marquette County","Non-Urban",{"$f":"VLOOKUP(D462,Region_Map!$A$4:$C$75,3,FALSE)","v":"Eastern"}]
[53964,"Standard","Westfield","Marquette County","Non-Urban",{"$f":"VLOOKUP(D463,Region_Map!$A$4:$C$75,3,FALSE)","v":"Eastern"}]
[54960,"Standard","Neshkoro","Marquette County","Non-Urban",{"$f":"VLOOKUP(D464,Region_Map!$A$4:$C$75,3,FALSE)","v":"Eastern"}]
[54135,"Standard","Keshena","Menominee County","Non-Urban",{"$f":"VLOOKUP(D465,Region_Map!$A$4:$C$75,3,FALSE)","v":"Eastern"}]
[54150,"Standard","Neopit","Menominee County","Non-Urban",{"$f":"VLOOKUP(D466,Region_Map!$A$4:$C$75,3,FALSE)","v":"Eastern"}]
[53110,"Standard","Cudahy","Milwaukee County","Urban",{"$f":"VLOOKUP(D467,Region_Map!$A$4:$C$75,3,FALSE)","v":"Eastern"}]
[53129,"Standard","Greendale","Milwaukee County","Urban",{"$f":"VLOOKUP(D468,Region_Map!$A$4:$C$75,3,FALSE)","v":"Eastern"}]
[53130,"Standard","Hales Corners","Milwaukee County","Urban",{"$f":"VLOOKUP(D469,Region_Map!$A$4:$C$75,3,FALSE)","v":"Eastern"}]
[53132,"Standard","Franklin","Milwaukee County","Urban",{"$f":"VLOOKUP(D470,Region_Map!$A$4:$C$75,3,FALSE)","v":"Eastern"}]
[53154,"Standard","Oak Creek","Milwaukee County","Urban",{"$f":"VLOOKUP(D471,Region_Map!$A$4:$C$75,3,FALSE)","v":"Eastern"}]
[53172,"Standard","South Milwaukee, S Milwaukee","Milwaukee County","Urban",{"$f":"VLOOKUP(D472,Region_Map!$A$4:$C$75,3,FALSE)","v":"Eastern"}]
[53201,"PO Box","Milwaukee","Milwaukee County","Urban",{"$f":"VLOOKUP(D473,Region_Map!$A$4:$C$75,3,FALSE)","v":"Eastern"}]
[53202,"Standard","Milwaukee","Milwaukee County","Urban",{"$f":"VLOOKUP(D474,Region_Map!$A$4:$C$75,3,FALSE)","v":"Eastern"}]
[53203,"Standard","Milwaukee","Milwaukee County","Urban",{"$f":"VLOOKUP(D475,Region_Map!$A$4:$C$75,3,FALSE)","v":"Eastern"}]
[53204,"Standard","Milwaukee","Milwaukee County","Urban",{"$f":"VLOOKUP(D476,Region_Map!$A$4:$C$75,3,FALSE)","v":"Eastern"}]
[53205,"Standard","Milwaukee","Milwaukee County","Urban",{"$f":"VLOOKUP(D477,Region_Map!$A$4:$C$75,3,FALSE)","v":"Eastern"}]
[53206,"Standard","Milwaukee","Milwaukee County","Urban",{"$f":"VLOOKUP(D478,Region_Map!$A$4:$C$75,3,FALSE)","v":"Eastern"}]
[53207,"Standard","Milwaukee, Bay View","Milwaukee County","Urban",{"$f":"VLOOKUP(D479,Region_Map!$A$4:$C$75,3,FALSE)","v":"Eastern"}]
[53208,"Standard","Milwaukee","Milwaukee County","Urban",{"$f":"VLOOKUP(D480,Region_Map!$A$4:$C$75,3,FALSE)","v":"Eastern"}]
[53209,"Standard","Milwaukee, Brown Deer, Glendale, River Hills","Milwaukee County","Urban",{"$f":"VLOOKUP(D481,Region_Map!$A$4:$C$75,3,FALSE)","v":"Eastern"}]
[53210,"Standard","Milwaukee, Wauwatosa","Milwaukee County","Urban",{"$f":"VLOOKUP(D482,Region_Map!$A$4:$C$75,3,FALSE)","v":"Eastern"}]
[53211,"Standard","Milwaukee, Glendale, Shorewood, Whitefish Bay","Milwaukee County","Urban",{"$f":"VLOOKUP(D483,Region_Map!$A$4:$C$75,3,FALSE)","v":"Eastern"}]
[53212,"Standard","Milwaukee, Glendale","Milwaukee County","Urban",{"$f":"VLOOKUP(D484,Region_Map!$A$4:$C$75,3,FALSE)","v":"Eastern"}]
[53213,"Standard","Milwaukee, Wauwatosa","Milwaukee County","Urban",{"$f":"VLOOKUP(D485,Region_Map!$A$4:$C$75,3,FALSE)","v":"Eastern"}]
[53214,"Standard","Milwaukee, W Milwaukee, West Allis, West Milwaukee","Milwaukee County","Urban",{"$f":"VLOOKUP(D486,Region_Map!$A$4:$C$75,3,FALSE)","v":"Eastern"}]
[53215,"Standard","Milwaukee, W Milwaukee, West Milwaukee","Milwaukee County","Urban",{"$f":"VLOOKUP(D487,Region_Map!$A$4:$C$75,3,FALSE)","v":"Eastern"}]
[53216,"Standard","Milwaukee","Milwaukee County","Urban",{"$f":"VLOOKUP(D488,Region_Map!$A$4:$C$75,3,FALSE)","v":"Eastern"}]
[53217,"Standard","Milwaukee, Bayside, Fox Point, Glendale, River Hill...","Milwaukee County","Urban",{"$f":"VLOOKUP(D489,Region_Map!$A$4:$C$75,3,FALSE)","v":"Eastern"}]
[53218,"Standard","Milwaukee","Milwaukee County","Urban",{"$f":"VLOOKUP(D490,Region_Map!$A$4:$C$75,3,FALSE)","v":"Eastern"}]
[53219,"Standard","Milwaukee, Greenfield, W Milwaukee, West Allis, Wes...","Milwaukee County","Urban",{"$f":"VLOOKUP(D491,Region_Map!$A$4:$C$75,3,FALSE)","v":"Eastern"}]
[53220,"Standard","Milwaukee, Greenfield","Milwaukee County","Urban",{"$f":"VLOOKUP(D492,Region_Map!$A$4:$C$75,3,FALSE)","v":"Eastern"}]
[53221,"Standard","Milwaukee, Greenfield","Milwaukee County","Urban",{"$f":"VLOOKUP(D493,Region_Map!$A$4:$C$75,3,FALSE)","v":"Eastern"}]
[53222,"Standard","Milwaukee, Wauwatosa","Milwaukee County","Urban",{"$f":"VLOOKUP(D494,Region_Map!$A$4:$C$75,3,FALSE)","v":"Eastern"}]
[53223,"Standard","Milwaukee, Brown Deer","Milwaukee County","Urban",{"$f":"VLOOKUP(D495,Region_Map!$A$4:$C$75,3,FALSE)","v":"Eastern"}]
[53224,"Standard","Milwaukee","Milwaukee County","Urban",{"$f":"VLOOKUP(D496,Region_Map!$A$4:$C$75,3,FALSE)","v":"Eastern"}]
[53225,"Standard","Milwaukee, Wauwatosa","Milwaukee County","Urban",{"$f":"VLOOKUP(D497,Region_Map!$A$4:$C$75,3,FALSE)","v":"Eastern"}]
[53226,"Standard","Milwaukee, Wauwatosa","Milwaukee County","Urban",{"$f":"VLOOKUP(D498,Region_Map!$A$4:$C$75,3,FALSE)","v":"Eastern"}]
[53227,"Standard","Milwaukee, New Berlin, West Allis","Milwaukee County","Urban",{"$f":"VLOOKUP(D499,Region_Map!$A$4:$C$75,3,FALSE)","v":"Eastern"}]
[53228,"Standard","Milwaukee, Greenfield, New Berlin","Milwaukee County","Urban",{"$f":"VLOOKUP(D500,Region_Map!$A$4:$C$75,3,FALSE)","v":"Eastern"}]
[53233,"Standard","Milwaukee","Milwaukee County","Urban",{"$f":"VLOOKUP(D501,Region_Map!$A$4:$C$75,3,FALSE)","v":"Eastern"}]
[53234,"PO Box","Milwaukee","Milwaukee County","Urban",{"$f":"VLOOKUP(D502,Region_Map!$A$4:$C$75,3,FALSE)","v":"Eastern"}]
[53235,"Standard","Saint Francis, Milwaukee, St Francis","Milwaukee County","Urban",{"$f":"VLOOKUP(D503,Region_Map!$A$4:$C$75,3,FALSE)","v":"Eastern"}]
[53237,"PO Box","Milwaukee","Milwaukee County","Urban",{"$f":"VLOOKUP(D504,Region_Map!$A$4:$C$75,3,FALSE)","v":"Eastern"}]
[53244,"PO Box","Milwaukee","Milwaukee County","Urban",{"$f":"VLOOKUP(D505,Region_Map!$A$4:$C$75,3,FALSE)","v":"Eastern"}]
[53259,"Unique","Milwaukee","Milwaukee County","Urban",{"$f":"VLOOKUP(D506,Region_Map!$A$4:$C$75,3,FALSE)","v":"Eastern"}]
[53263,"Unique","Milwaukee","Milwaukee County","Urban",{"$f":"VLOOKUP(D507,Region_Map!$A$4:$C$75,3,FALSE)","v":"Eastern"}]
[53267,"Unique","Milwaukee","Milwaukee County","Urban",{"$f":"VLOOKUP(D508,Region_Map!$A$4:$C$75,3,FALSE)","v":"Eastern"}]
[53268,"Unique","Milwaukee","Milwaukee County","Urban",{"$f":"VLOOKUP(D509,Region_Map!$A$4:$C$75,3,FALSE)","v":"Eastern"}]
[53274,"Unique","Milwaukee","Milwaukee County","Urban",{"$f":"VLOOKUP(D510,Region_Map!$A$4:$C$75,3,FALSE)","v":"Eastern"}]
[53278,"Unique","Milwaukee","Milwaukee County","Urban",{"$f":"VLOOKUP(D511,Region_Map!$A$4:$C$75,3,FALSE)","v":"Eastern"}]
[53288,"Unique","Milwaukee","Milwaukee County","Urban",{"$f":"VLOOKUP(D512,Region_Map!$A$4:$C$75,3,FALSE)","v":"Eastern"}]
[53290,"Unique","Milwaukee","Milwaukee County","Urban",{"$f":"VLOOKUP(D513,Region_Map!$A$4:$C$75,3,FALSE)","v":"Eastern"}]
[53293,"Unique","Milwaukee","Milwaukee County","Urban",{"$f":"VLOOKUP(D514,Region_Map!$A$4:$C$75,3,FALSE)","v":"Eastern"}]
[53295,"Unique","Milwaukee","Milwaukee County","Urban",{"$f":"VLOOKUP(D515,Region_Map!$A$4:$C$75,3,FALSE)","v":"Eastern"}]
[54619,"Standard","Cashton","Monroe County","Non-Urban",{"$f":"VLOOKUP(D516,Region_Map!$A$4:$C$75,3,FALSE)","v":"Southern"}]
[54620,"PO Box","Cataract","Monroe County","Non-Urban",{"$f":"VLOOKUP(D517,Region_Map!$A$4:$C$75,3,FALSE)","v":"Southern"}]
[54638,"Standard","Kendall","Monroe County","Non-Urban",{"$f":"VLOOKUP(D518,Region_Map!$A$4:$C$75,3,FALSE)","v":"Southern"}]
[54648,"Standard","Norwalk","Monroe County","Non-Urban",{"$f":"VLOOKUP(D519,Region_Map!$A$4:$C$75,3,FALSE)","v":"Southern"}]
[54649,"PO Box","Oakdale","Monroe County","Non-Urban",{"$f":"VLOOKUP(D520,Region_Map!$A$4:$C$75,3,FALSE)","v":"Southern"}]
[54656,"Standard","Sparta, Fort Mccoy","Monroe County","Non-Urban",{"$f":"VLOOKUP(D521,Region_Map!$A$4:$C$75,3,FALSE)","v":"Southern"}]
[54660,"Standard","Tomah, Wyeville","Monroe County","Non-Urban",{"$f":"VLOOKUP(D522,Region_Map!$A$4:$C$75,3,FALSE)","v":"Southern"}]
[54662,"PO Box","Tunnel City","Monroe County","Non-Urban",{"$f":"VLOOKUP(D523,Region_Map!$A$4:$C$75,3,FALSE)","v":"Southern"}]
[54666,"Standard","Warrens","Monroe County","Non-Urban",{"$f":"VLOOKUP(D524,Region_Map!$A$4:$C$75,3,FALSE)","v":"Southern"}]
[54670,"Standard","Wilton","Monroe County","Non-Urban",{"$f":"VLOOKUP(D525,Region_Map!$A$4:$C$75,3,FALSE)","v":"Southern"}]
[54101,"Standard","Abrams","Oconto County","Non-Urban",{"$f":"VLOOKUP(D526,Region_Map!$A$4:$C$75,3,FALSE)","v":"Eastern"}]
[54124,"Standard","Gillett, Pulcifer, Underhill","Oconto County","Non-Urban",{"$f":"VLOOKUP(D527,Region_Map!$A$4:$C$75,3,FALSE)","v":"Eastern"}]
[54138,"Standard","Lakewood","Oconto County","Non-Urban",{"$f":"VLOOKUP(D528,Region_Map!$A$4:$C$75,3,FALSE)","v":"Eastern"}]
[54139,"Standard","Lena, Stiles","Oconto County","Non-Urban",{"$f":"VLOOKUP(D529,Region_Map!$A$4:$C$75,3,FALSE)","v":"Eastern"}]
[54141,"Standard","Little Suamico, Ltl Suamico","Oconto County","Non-Urban",{"$f":"VLOOKUP(D530,Region_Map!$A$4:$C$75,3,FALSE)","v":"Eastern"}]
[54149,"Standard","Mountain","Oconto County","Non-Urban",{"$f":"VLOOKUP(D531,Region_Map!$A$4:$C$75,3,FALSE)","v":"Eastern"}]
[54153,"Standard","Oconto","Oconto County","Non-Urban",{"$f":"VLOOKUP(D532,Region_Map!$A$4:$C$75,3,FALSE)","v":"Eastern"}]
[54154,"Standard","Oconto Falls","Oconto County","Non-Urban",{"$f":"VLOOKUP(D533,Region_Map!$A$4:$C$75,3,FALSE)","v":"Eastern"}]
[54171,"Standard","Sobieski, Krakow","Oconto County","Non-Urban",{"$f":"VLOOKUP(D534,Region_Map!$A$4:$C$75,3,FALSE)","v":"Eastern"}]
[54174,"Standard","Suring","Oconto County","Non-Urban",{"$f":"VLOOKUP(D535,Region_Map!$A$4:$C$75,3,FALSE)","v":"Eastern"}]
[54175,"Standard","Townsend","Oconto County","Non-Urban",{"$f":"VLOOKUP(D536,Region_Map!$A$4:$C$75,3,FALSE)","v":"Eastern"}]
[54463,"Standard","Pelican Lake","Oneida County","Non-Urban",{"$f":"VLOOKUP(D537,Region_Map!$A$4:$C$75,3,FALSE)","v":"Northern"}]
[54501,"Standard","Rhinelander, Monico","Oneida County","Non-Urban",{"$f":"VLOOKUP(D538,Region_Map!$A$4:$C$75,3,FALSE)","v":"Northern"}]
[54529,"Standard","Harshaw","Oneida County","Non-Urban",{"$f":"VLOOKUP(D539,Region_Map!$A$4:$C$75,3,FALSE)","v":"Northern"}]
[54531,"Standard","Hazelhurst","Oneida County","Non-Urban",{"$f":"VLOOKUP(D540,Region_Map!$A$4:$C$75,3,FALSE)","v":"Northern"}]
[54539,"Standard","Lake Tomahawk","Oneida County","Non-Urban",{"$f":"VLOOKUP(D541,Region_Map!$A$4:$C$75,3,FALSE)","v":"Northern"}]
[54543,"PO Box","Mc Naughton","Oneida County","Non-Urban",{"$f":"VLOOKUP(D542,Region_Map!$A$4:$C$75,3,FALSE)","v":"Northern"}]
[54548,"Standard","Minocqua","Oneida County","Non-Urban",{"$f":"VLOOKUP(D543,Region_Map!$A$4:$C$75,3,FALSE)","v":"Northern"}]
[54562,"Standard","Three Lakes","Oneida County","Non-Urban",{"$f":"VLOOKUP(D544,Region_Map!$A$4:$C$75,3,FALSE)","v":"Northern"}]
[54564,"Standard","Tripoli","Oneida County","Non-Urban",{"$f":"VLOOKUP(D545,Region_Map!$A$4:$C$75,3,FALSE)","v":"Northern"}]
[54106,"Standard","Black Creek","Outagamie County","Non-Urban",{"$f":"VLOOKUP(D546,Region_Map!$A$4:$C$75,3,FALSE)","v":"Eastern"}]
[54113,"Standard","Combined Locks, Combined Lcks","Outagamie County","Non-Urban",{"$f":"VLOOKUP(D547,Region_Map!$A$4:$C$75,3,FALSE)","v":"Eastern"}]
[54130,"Standard","Kaukauna, Freedom","Outagamie County","Non-Urban",{"$f":"VLOOKUP(D548,Region_Map!$A$4:$C$75,3,FALSE)","v":"Eastern"}]
[54131,"PO Box","Freedom, Kaukauna","Outagamie County","Non-Urban",{"$f":"VLOOKUP(D549,Region_Map!$A$4:$C$75,3,FALSE)","v":"Eastern"}]
[54136,"Standard","Kimberly","Outagamie County","Non-Urban",{"$f":"VLOOKUP(D550,Region_Map!$A$4:$C$75,3,FALSE)","v":"Eastern"}]
[54140,"Standard","Little Chute","Outagamie County","Non-Urban",{"$f":"VLOOKUP(D551,Region_Map!$A$4:$C$75,3,FALSE)","v":"Eastern"}]
[54152,"PO Box","Nichols","Outagamie County","Non-Urban",{"$f":"VLOOKUP(D552,Region_Map!$A$4:$C$75,3,FALSE)","v":"Eastern"}]
[54165,"Standard","Seymour, Freedom","Outagamie County","Non-Urban",{"$f":"VLOOKUP(D553,Region_Map!$A$4:$C$75,3,FALSE)","v":"Eastern"}]
[54170,"Standard","Shiocton","Outagamie County","Non-Urban",{"$f":"VLOOKUP(D554,Region_Map!$A$4:$C$75,3,FALSE)","v":"Eastern"}]
[54911,"Standard","Appleton, Grand Chute, Little Chute","Outagamie County","Non-Urban",{"$f":"VLOOKUP(D555,Region_Map!$A$4:$C$75,3,FALSE)","v":"Eastern"}]
[54912,"PO Box","Appleton, Grand Chute","Outagamie County","Non-Urban",{"$f":"VLOOKUP(D556,Region_Map!$A$4:$C$75,3,FALSE)","v":"Eastern"}]
[54913,"Standard","Appleton, Freedom, Grand Chute","Outagamie County","Non-Urban",{"$f":"VLOOKUP(D557,Region_Map!$A$4:$C$75,3,FALSE)","v":"Eastern"}]
[54914,"Standard","Appleton, Grand Chute","Outagamie County","Non-Urban",{"$f":"VLOOKUP(D558,Region_Map!$A$4:$C$75,3,FALSE)","v":"Eastern"}]
[54915,"Standard","Appleton, Grand Chute","Outagamie County","Non-Urban",{"$f":"VLOOKUP(D559,Region_Map!$A$4:$C$75,3,FALSE)","v":"Eastern"}]
[54919,"Unique","Appleton","Outagamie County","Non-Urban",{"$f":"VLOOKUP(D560,Region_Map!$A$4:$C$75,3,FALSE)","v":"Eastern"}]
[54922,"Standard","Bear Creek","Outagamie County","Non-Urban",{"$f":"VLOOKUP(D561,Region_Map!$A$4:$C$75,3,FALSE)","v":"Eastern"}]
[54931,"PO Box","Dale","Outagamie County","Non-Urban",{"$f":"VLOOKUP(D562,Region_Map!$A$4:$C$75,3,FALSE)","v":"Eastern"}]
[54942,"Standard","Greenville","Outagamie County","Non-Urban",{"$f":"VLOOKUP(D563,Region_Map!$A$4:$C$75,3,FALSE)","v":"Eastern"}]
[54944,"Standard","Hortonville, Medina","Outagamie County","Non-Urban",{"$f":"VLOOKUP(D564,Region_Map!$A$4:$C$75,3,FALSE)","v":"Eastern"}]
[53004,"Standard","Belgium","Ozaukee County","Urban",{"$f":"VLOOKUP(D565,Region_Map!$A$4:$C$75,3,FALSE)","v":"Eastern"}]
[53012,"Standard","Cedarburg","Ozaukee County","Urban",{"$f":"VLOOKUP(D566,Region_Map!$A$4:$C$75,3,FALSE)","v":"Eastern"}]
[53021,"Standard","Fredonia, Waubeka","Ozaukee County","Urban",{"$f":"VLOOKUP(D567,Region_Map!$A$4:$C$75,3,FALSE)","v":"Eastern"}]
[53024,"Standard","Grafton","Ozaukee County","Urban",{"$f":"VLOOKUP(D568,Region_Map!$A$4:$C$75,3,FALSE)","v":"Eastern"}]
[53074,"Standard","Port Washington, Prt Washingtn","Ozaukee County","Urban",{"$f":"VLOOKUP(D569,Region_Map!$A$4:$C$75,3,FALSE)","v":"Eastern"}]
[53080,"Standard","Saukville","Ozaukee County","Urban",{"$f":"VLOOKUP(D570,Region_Map!$A$4:$C$75,3,FALSE)","v":"Eastern"}]
[53092,"Standard","Thiensville, Mequon","Ozaukee County","Urban",{"$f":"VLOOKUP(D571,Region_Map!$A$4:$C$75,3,FALSE)","v":"Eastern"}]
[53097,"Standard","Mequon, Thiensville","Ozaukee County","Urban",{"$f":"VLOOKUP(D572,Region_Map!$A$4:$C$75,3,FALSE)","v":"Eastern"}]
[54721,"Standard","Arkansaw","Pepin County","Non-Urban",{"$f":"VLOOKUP(D573,Region_Map!$A$4:$C$75,3,FALSE)","v":"Western"}]
[54736,"Standard","Durand","Pepin County","Non-Urban",{"$f":"VLOOKUP(D574,Region_Map!$A$4:$C$75,3,FALSE)","v":"Western"}]
[54759,"Standard","Pepin","Pepin County","Non-Urban",{"$f":"VLOOKUP(D575,Region_Map!$A$4:$C$75,3,FALSE)","v":"Western"}]
[54769,"Standard","Stockholm","Pepin County","Non-Urban",{"$f":"VLOOKUP(D576,Region_Map!$A$4:$C$75,3,FALSE)","v":"Western"}]
[54003,"Standard","Beldenville","Pierce County","Non-Urban",{"$f":"VLOOKUP(D577,Region_Map!$A$4:$C$75,3,FALSE)","v":"Western"}]
[54010,"PO Box","East Ellsworth, E Ellsworth, Ellsworth","Pierce County","Non-Urban",{"$f":"VLOOKUP(D578,Region_Map!$A$4:$C$75,3,FALSE)","v":"Western"}]
[54011,"Standard","Ellsworth","Pierce County","Non-Urban",{"$f":"VLOOKUP(D579,Region_Map!$A$4:$C$75,3,FALSE)","v":"Western"}]
[54014,"Standard","Hager City","Pierce County","Non-Urban",{"$f":"VLOOKUP(D580,Region_Map!$A$4:$C$75,3,FALSE)","v":"Western"}]
[54021,"Standard","Prescott","Pierce County","Non-Urban",{"$f":"VLOOKUP(D581,Region_Map!$A$4:$C$75,3,FALSE)","v":"Western"}]
[54022,"Standard","River Falls","Pierce County","Non-Urban",{"$f":"VLOOKUP(D582,Region_Map!$A$4:$C$75,3,FALSE)","v":"Western"}]
[54723,"Standard","Bay City","Pierce County","Non-Urban",{"$f":"VLOOKUP(D583,Region_Map!$A$4:$C$75,3,FALSE)","v":"Western"}]
[54740,"Standard","Elmwood","Pierce County","Non-Urban",{"$f":"VLOOKUP(D584,Region_Map!$A$4:$C$75,3,FALSE)","v":"Western"}]
[54750,"Standard","Maiden Rock","Pierce County","Non-Urban",{"$f":"VLOOKUP(D585,Region_Map!$A$4:$C$75,3,FALSE)","v":"Western"}]
[54761,"Standard","Plum City","Pierce County","Non-Urban",{"$f":"VLOOKUP(D586,Region_Map!$A$4:$C$75,3,FALSE)","v":"Western"}]
[54767,"Standard","Spring Valley","Pierce County","Non-Urban",{"$f":"VLOOKUP(D587,Region_Map!$A$4:$C$75,3,FALSE)","v":"Western"}]
[54001,"Standard","Amery, Deronda","Polk County","Non-Urban",{"$f":"VLOOKUP(D588,Region_Map!$A$4:$C$75,3,FALSE)","v":"Western"}]
[54005,"Standard","Clear Lake","Polk County","Non-Urban",{"$f":"VLOOKUP(D589,Region_Map!$A$4:$C$75,3,FALSE)","v":"Western"}]
[54006,"Standard","Cushing","Polk County","Non-Urban",{"$f":"VLOOKUP(D590,Region_Map!$A$4:$C$75,3,FALSE)","v":"Western"}]
[54009,"Standard","Dresser","Polk County","Non-Urban",{"$f":"VLOOKUP(D591,Region_Map!$A$4:$C$75,3,FALSE)","v":"Western"}]
[54020,"Standard","Osceola","Polk County","Non-Urban",{"$f":"VLOOKUP(D592,Region_Map!$A$4:$C$75,3,FALSE)","v":"Western"}]
[54024,"Standard","Saint Croix Falls, St Croix Fls","Polk County","Non-Urban",{"$f":"VLOOKUP(D593,Region_Map!$A$4:$C$75,3,FALSE)","v":"Western"}]
[54026,"Standard","Star Prairie","Polk County","Non-Urban",{"$f":"VLOOKUP(D594,Region_Map!$A$4:$C$75,3,FALSE)","v":"Western"}]
[54810,"Standard","Balsam Lake","Polk County","Non-Urban",{"$f":"VLOOKUP(D595,Region_Map!$A$4:$C$75,3,FALSE)","v":"Western"}]
[54824,"Standard","Centuria","Polk County","Non-Urban",{"$f":"VLOOKUP(D596,Region_Map!$A$4:$C$75,3,FALSE)","v":"Western"}]
[54837,"Standard","Frederic, Clam Falls, Lewis","Polk County","Non-Urban",{"$f":"VLOOKUP(D597,Region_Map!$A$4:$C$75,3,FALSE)","v":"Western"}]
[54853,"Standard","Luck","Polk County","Non-Urban",{"$f":"VLOOKUP(D598,Region_Map!$A$4:$C$75,3,FALSE)","v":"Western"}]
[54858,"Standard","Milltown","Polk County","Non-Urban",{"$f":"VLOOKUP(D599,Region_Map!$A$4:$C$75,3,FALSE)","v":"Western"}]
[54889,"Standard","Turtle Lake","Polk County","Non-Urban",{"$f":"VLOOKUP(D600,Region_Map!$A$4:$C$75,3,FALSE)","v":"Western"}]
[54406,"Standard","Amherst","Portage County","Non-Urban",{"$f":"VLOOKUP(D601,Region_Map!$A$4:$C$75,3,FALSE)","v":"Northern"}]
[54407,"Standard","Amherst Junction, Amherst Jct","Portage County","Non-Urban",{"$f":"VLOOKUP(D602,Region_Map!$A$4:$C$75,3,FALSE)","v":"Northern"}]
[54423,"Standard","Custer","Portage County","Non-Urban",{"$f":"VLOOKUP(D603,Region_Map!$A$4:$C$75,3,FALSE)","v":"Northern"}]
[54443,"Standard","Junction City","Portage County","Non-Urban",{"$f":"VLOOKUP(D604,Region_Map!$A$4:$C$75,3,FALSE)","v":"Northern"}]
[54458,"PO Box","Nelsonville","Portage County","Non-Urban",{"$f":"VLOOKUP(D605,Region_Map!$A$4:$C$75,3,FALSE)","v":"Northern"}]
[54467,"Standard","Plover","Portage County","Non-Urban",{"$f":"VLOOKUP(D606,Region_Map!$A$4:$C$75,3,FALSE)","v":"Northern"}]
[54473,"Standard","Rosholt","Portage County","Non-Urban",{"$f":"VLOOKUP(D607,Region_Map!$A$4:$C$75,3,FALSE)","v":"Northern"}]
[54481,"Standard","Stevens Point","Portage County","Non-Urban",{"$f":"VLOOKUP(D608,Region_Map!$A$4:$C$75,3,FALSE)","v":"Northern"}]
[54482,"Standard","Stevens Point","Portage County","Non-Urban",{"$f":"VLOOKUP(D609,Region_Map!$A$4:$C$75,3,FALSE)","v":"Northern"}]
[54492,"Unique","Stevens Point","Portage County","Non-Urban",{"$f":"VLOOKUP(D610,Region_Map!$A$4:$C$75,3,FALSE)","v":"Northern"}]
[54909,"Standard","Almond","Portage County","Non-Urban",{"$f":"VLOOKUP(D611,Region_Map!$A$4:$C$75,3,FALSE)","v":"Northern"}]
[54921,"Standard","Bancroft","Portage County","Non-Urban",{"$f":"VLOOKUP(D612,Region_Map!$A$4:$C$75,3,FALSE)","v":"Northern"}]
[54459,"Standard","Ogema","Price County","Non-Urban",{"$f":"VLOOKUP(D613,Region_Map!$A$4:$C$75,3,FALSE)","v":"Northern"}]
[54513,"Standard","Brantwood","Price County","Non-Urban",{"$f":"VLOOKUP(D614,Region_Map!$A$4:$C$75,3,FALSE)","v":"Northern"}]
[54515,"Standard","Catawba","Price County","Non-Urban",{"$f":"VLOOKUP(D615,Region_Map!$A$4:$C$75,3,FALSE)","v":"Northern"}]
[54524,"Standard","Fifield","Price County","Non-Urban",{"$f":"VLOOKUP(D616,Region_Map!$A$4:$C$75,3,FALSE)","v":"Northern"}]
[54537,"Standard","Kennan","Price County","Non-Urban",{"$f":"VLOOKUP(D617,Region_Map!$A$4:$C$75,3,FALSE)","v":"Northern"}]
[54552,"Standard","Park Falls","Price County","Non-Urban",{"$f":"VLOOKUP(D618,Region_Map!$A$4:$C$75,3,FALSE)","v":"Northern"}]
[54555,"Standard","Phillips","Price County","Non-Urban",{"$f":"VLOOKUP(D619,Region_Map!$A$4:$C$75,3,FALSE)","v":"Northern"}]
[54556,"Standard","Prentice","Price County","Non-Urban",{"$f":"VLOOKUP(D620,Region_Map!$A$4:$C$75,3,FALSE)","v":"Northern"}]
[53105,"Standard","Burlington","Racine County","Urban",{"$f":"VLOOKUP(D621,Region_Map!$A$4:$C$75,3,FALSE)","v":"Eastern"}]
[53108,"Standard","Caledonia","Racine County","Urban",{"$f":"VLOOKUP(D622,Region_Map!$A$4:$C$75,3,FALSE)","v":"Eastern"}]
[53126,"Standard","Franksville","Racine County","Urban",{"$f":"VLOOKUP(D623,Region_Map!$A$4:$C$75,3,FALSE)","v":"Eastern"}]
[53139,"Standard","Kansasville","Racine County","Urban",{"$f":"VLOOKUP(D624,Region_Map!$A$4:$C$75,3,FALSE)","v":"Eastern"}]
[53167,"PO Box","Rochester","Racine County","Urban",{"$f":"VLOOKUP(D625,Region_Map!$A$4:$C$75,3,FALSE)","v":"Eastern"}]
[53177,"Standard","Sturtevant, Mount Pleasant, Mt Pleasant","Racine County","Urban",{"$f":"VLOOKUP(D626,Region_Map!$A$4:$C$75,3,FALSE)","v":"Eastern"}]
[53182,"Standard","Union Grove","Racine County","Urban",{"$f":"VLOOKUP(D627,Region_Map!$A$4:$C$75,3,FALSE)","v":"Eastern"}]
[53185,"Standard","Waterford, Wind Lake","Racine County","Urban",{"$f":"VLOOKUP(D628,Region_Map!$A$4:$C$75,3,FALSE)","v":"Eastern"}]
[53401,"PO Box","Racine, Mount Pleasant, Mt Pleasant","Racine County","Urban",{"$f":"VLOOKUP(D629,Region_Map!$A$4:$C$75,3,FALSE)","v":"Eastern"}]
[53402,"Standard","Racine, Wind Point","Racine County","Urban",{"$f":"VLOOKUP(D630,Region_Map!$A$4:$C$75,3,FALSE)","v":"Eastern"}]
[53403,"Standard","Racine, Mount Pleasant, Mt Pleasant","Racine County","Urban",{"$f":"VLOOKUP(D631,Region_Map!$A$4:$C$75,3,FALSE)","v":"Eastern"}]
[53404,"Standard","Racine, Mount Pleasant, Mt Pleasant","Racine County","Urban",{"$f":"VLOOKUP(D632,Region_Map!$A$4:$C$75,3,FALSE)","v":"Eastern"}]
[53405,"Standard","Racine, Mount Pleasant, Mt Pleasant","Racine County","Urban",{"$f":"VLOOKUP(D633,Region_Map!$A$4:$C$75,3,FALSE)","v":"Eastern"}]
[53406,"Standard","Racine, Mount Pleasant, Mt Pleasant","Racine County","Urban",{"$f":"VLOOKUP(D634,Region_Map!$A$4:$C$75,3,FALSE)","v":"Eastern"}]
[53407,"Unique","Racine","Racine County","Urban",{"$f":"VLOOKUP(D635,Region_Map!$A$4:$C$75,3,FALSE)","v":"Eastern"}]
[53408,"PO Box","Racine","Racine County","Urban",{"$f":"VLOOKUP(D636,Region_Map!$A$4:$C$75,3,FALSE)","v":"Eastern"}]
[53518,"Standard","Blue River","Richland County","Non-Urban",{"$f":"VLOOKUP(D637,Region_Map!$A$4:$C$75,3,FALSE)","v":"Southern"}]
[53540,"PO Box","Gotham","Richland County","Non-Urban",{"$f":"VLOOKUP(D638,Region_Map!$A$4:$C$75,3,FALSE)","v":"Southern"}]
[53556,"Standard","Lone Rock","Richland County","Non-Urban",{"$f":"VLOOKUP(D639,Region_Map!$A$4:$C$75,3,FALSE)","v":"Southern"}]
[53573,"Standard","Muscoda","Richland County","Non-Urban",{"$f":"VLOOKUP(D640,Region_Map!$A$4:$C$75,3,FALSE)","v":"Southern"}]
[53581,"Standard","Richland Center, Richland Ctr","Richland County","Non-Urban",{"$f":"VLOOKUP(D641,Region_Map!$A$4:$C$75,3,FALSE)","v":"Southern"}]
[53584,"PO Box","Sextonville","Richland County","Non-Urban",{"$f":"VLOOKUP(D642,Region_Map!$A$4:$C$75,3,FALSE)","v":"Southern"}]
[53924,"Standard","Cazenovia","Richland County","Non-Urban",{"$f":"VLOOKUP(D643,Region_Map!$A$4:$C$75,3,FALSE)","v":"Southern"}]
[54664,"Standard","Viola","Richland County","Non-Urban",{"$f":"VLOOKUP(D644,Region_Map!$A$4:$C$75,3,FALSE)","v":"Southern"}]
[53501,"PO Box","Afton","Rock County","Non-Urban",{"$f":"VLOOKUP(D645,Region_Map!$A$4:$C$75,3,FALSE)","v":"Southern"}]
[53505,"Standard","Avalon","Rock County","Non-Urban",{"$f":"VLOOKUP(D646,Region_Map!$A$4:$C$75,3,FALSE)","v":"Southern"}]
[53511,"Standard","Beloit","Rock County","Non-Urban",{"$f":"VLOOKUP(D647,Region_Map!$A$4:$C$75,3,FALSE)","v":"Southern"}]
[53512,"PO Box","Beloit","Rock County","Non-Urban",{"$f":"VLOOKUP(D648,Region_Map!$A$4:$C$75,3,FALSE)","v":"Southern"}]
[53525,"Standard","Clinton","Rock County","Non-Urban",{"$f":"VLOOKUP(D649,Region_Map!$A$4:$C$75,3,FALSE)","v":"Southern"}]
[53534,"Standard","Edgerton","Rock County","Non-Urban",{"$f":"VLOOKUP(D650,Region_Map!$A$4:$C$75,3,FALSE)","v":"Southern"}]
[53536,"Standard","Evansville","Rock County","Non-Urban",{"$f":"VLOOKUP(D651,Region_Map!$A$4:$C$75,3,FALSE)","v":"Southern"}]
[53537,"PO Box","Footville","Rock County","Non-Urban",{"$f":"VLOOKUP(D652,Region_Map!$A$4:$C$75,3,FALSE)","v":"Southern"}]
[53542,"PO Box","Hanover","Rock County","Non-Urban",{"$f":"VLOOKUP(D653,Region_Map!$A$4:$C$75,3,FALSE)","v":"Southern"}]
[53545,"Standard","Janesville","Rock County","Non-Urban",{"$f":"VLOOKUP(D654,Region_Map!$A$4:$C$75,3,FALSE)","v":"Southern"}]
[53546,"Standard","Janesville","Rock County","Non-Urban",{"$f":"VLOOKUP(D655,Region_Map!$A$4:$C$75,3,FALSE)","v":"Southern"}]
[53547,"PO Box","Janesville","Rock County","Non-Urban",{"$f":"VLOOKUP(D656,Region_Map!$A$4:$C$75,3,FALSE)","v":"Southern"}]
[53548,"Standard","Janesville","Rock County","Non-Urban",{"$f":"VLOOKUP(D657,Region_Map!$A$4:$C$75,3,FALSE)","v":"Southern"}]
[53563,"Standard","Milton","Rock County","Non-Urban",{"$f":"VLOOKUP(D658,Region_Map!$A$4:$C$75,3,FALSE)","v":"Southern"}]
[53576,"Standard","Orfordville","Rock County","Non-Urban",{"$f":"VLOOKUP(D659,Region_Map!$A$4:$C$75,3,FALSE)","v":"Southern"}]
[54526,"Standard","Glen Flora, Ingram","Rusk County","Non-Urban",{"$f":"VLOOKUP(D660,Region_Map!$A$4:$C$75,3,FALSE)","v":"Western"}]
[54530,"Standard","Hawkins","Rusk County","Non-Urban",{"$f":"VLOOKUP(D661,Region_Map!$A$4:$C$75,3,FALSE)","v":"Western"}]
[54563,"Standard","Tony","Rusk County","Non-Urban",{"$f":"VLOOKUP(D662,Region_Map!$A$4:$C$75,3,FALSE)","v":"Western"}]
[54731,"Standard","Conrath","Rusk County","Non-Urban",{"$f":"VLOOKUP(D663,Region_Map!$A$4:$C$75,3,FALSE)","v":"Western"}]
[54819,"Standard","Bruce","Rusk County","Non-Urban",{"$f":"VLOOKUP(D664,Region_Map!$A$4:$C$75,3,FALSE)","v":"Western"}]
[54848,"Standard","Ladysmith","Rusk County","Non-Urban",{"$f":"VLOOKUP(D665,Region_Map!$A$4:$C$75,3,FALSE)","v":"Western"}]
[54895,"Standard","Weyerhaeuser","Rusk County","Non-Urban",{"$f":"VLOOKUP(D666,Region_Map!$A$4:$C$75,3,FALSE)","v":"Western"}]
[53561,"Standard","Merrimac","Sauk County","Non-Urban",{"$f":"VLOOKUP(D667,Region_Map!$A$4:$C$75,3,FALSE)","v":"Southern"}]
[53577,"Standard","Plain","Sauk County","Non-Urban",{"$f":"VLOOKUP(D668,Region_Map!$A$4:$C$75,3,FALSE)","v":"Southern"}]
[53578,"Standard","Prairie Du Sac, Pr Du Sac","Sauk County","Non-Urban",{"$f":"VLOOKUP(D669,Region_Map!$A$4:$C$75,3,FALSE)","v":"Southern"}]
[53583,"Standard","Sauk City","Sauk County","Non-Urban",{"$f":"VLOOKUP(D670,Region_Map!$A$4:$C$75,3,FALSE)","v":"Southern"}]
[53588,"Standard","Spring Green","Sauk County","Non-Urban",{"$f":"VLOOKUP(D671,Region_Map!$A$4:$C$75,3,FALSE)","v":"Southern"}]
[53913,"Standard","Baraboo","Sauk County","Non-Urban",{"$f":"VLOOKUP(D672,Region_Map!$A$4:$C$75,3,FALSE)","v":"Southern"}]
[53937,"Standard","Hillpoint","Sauk County","Non-Urban",{"$f":"VLOOKUP(D673,Region_Map!$A$4:$C$75,3,FALSE)","v":"Southern"}]
[53940,"PO Box","Lake Delton","Sauk County","Non-Urban",{"$f":"VLOOKUP(D674,Region_Map!$A$4:$C$75,3,FALSE)","v":"Southern"}]
[53941,"Standard","La Valle","Sauk County","Non-Urban",{"$f":"VLOOKUP(D675,Region_Map!$A$4:$C$75,3,FALSE)","v":"Southern"}]
[53942,"PO Box","Lime Ridge","Sauk County","Non-Urban",{"$f":"VLOOKUP(D676,Region_Map!$A$4:$C$75,3,FALSE)","v":"Southern"}]
[53943,"Standard","Loganville","Sauk County","Non-Urban",{"$f":"VLOOKUP(D677,Region_Map!$A$4:$C$75,3,FALSE)","v":"Southern"}]
[53951,"Standard","North Freedom","Sauk County","Non-Urban",{"$f":"VLOOKUP(D678,Region_Map!$A$4:$C$75,3,FALSE)","v":"Southern"}]
[53958,"Unique","Reedsburg","Sauk County","Non-Urban",{"$f":"VLOOKUP(D679,Region_Map!$A$4:$C$75,3,FALSE)","v":"Southern"}]
[53959,"Standard","Reedsburg","Sauk County","Non-Urban",{"$f":"VLOOKUP(D680,Region_Map!$A$4:$C$75,3,FALSE)","v":"Southern"}]
[53961,"Standard","Rock Springs","Sauk County","Non-Urban",{"$f":"VLOOKUP(D681,Region_Map!$A$4:$C$75,3,FALSE)","v":"Southern"}]
[53965,"Standard","Wisconsin Dells, Wisc Dells","Sauk County","Non-Urban",{"$f":"VLOOKUP(D682,Region_Map!$A$4:$C$75,3,FALSE)","v":"Southern"}]
[54828,"Standard","Couderay, New Post","Sawyer County","Non-Urban",{"$f":"VLOOKUP(D683,Region_Map!$A$4:$C$75,3,FALSE)","v":"Northern"}]
[54834,"PO Box","Edgewater","Sawyer County","Non-Urban",{"$f":"VLOOKUP(D684,Region_Map!$A$4:$C$75,3,FALSE)","v":"Northern"}]
[54835,"Standard","Exeland","Sawyer County","Non-Urban",{"$f":"VLOOKUP(D685,Region_Map!$A$4:$C$75,3,FALSE)","v":"Northern"}]
[54843,"Standard","Hayward, N Woods Beach, North Woods Beach","Sawyer County","Non-Urban",{"$f":"VLOOKUP(D686,Region_Map!$A$4:$C$75,3,FALSE)","v":"Northern"}]
[54862,"Standard","Ojibwa","Sawyer County","Non-Urban",{"$f":"VLOOKUP(D687,Region_Map!$A$4:$C$75,3,FALSE)","v":"Northern"}]
[54867,"Standard","Radisson","Sawyer County","Non-Urban",{"$f":"VLOOKUP(D688,Region_Map!$A$4:$C$75,3,FALSE)","v":"Northern"}]
[54876,"Standard","Stone Lake","Sawyer County","Non-Urban",{"$f":"VLOOKUP(D689,Region_Map!$A$4:$C$75,3,FALSE)","v":"Northern"}]
[54896,"Standard","Winter, Loretta","Sawyer County","Non-Urban",{"$f":"VLOOKUP(D690,Region_Map!$A$4:$C$75,3,FALSE)","v":"Northern"}]
[54107,"Standard","Bonduel, Navarino","Shawano County","Non-Urban",{"$f":"VLOOKUP(D691,Region_Map!$A$4:$C$75,3,FALSE)","v":"Eastern"}]
[54111,"Standard","Cecil","Shawano County","Non-Urban",{"$f":"VLOOKUP(D692,Region_Map!$A$4:$C$75,3,FALSE)","v":"Eastern"}]
[54127,"Standard","Green Valley","Shawano County","Non-Urban",{"$f":"VLOOKUP(D693,Region_Map!$A$4:$C$75,3,FALSE)","v":"Eastern"}]
[54128,"Standard","Gresham","Shawano County","Non-Urban",{"$f":"VLOOKUP(D694,Region_Map!$A$4:$C$75,3,FALSE)","v":"Eastern"}]
[54137,"Standard","Krakow","Shawano County","Non-Urban",{"$f":"VLOOKUP(D695,Region_Map!$A$4:$C$75,3,FALSE)","v":"Eastern"}]
[54162,"Standard","Pulaski","Shawano County","Non-Urban",{"$f":"VLOOKUP(D696,Region_Map!$A$4:$C$75,3,FALSE)","v":"Eastern"}]
[54166,"Standard","Shawano","Shawano County","Non-Urban",{"$f":"VLOOKUP(D697,Region_Map!$A$4:$C$75,3,FALSE)","v":"Eastern"}]
[54182,"PO Box","Zachow, Bonduel","Shawano County","Non-Urban",{"$f":"VLOOKUP(D698,Region_Map!$A$4:$C$75,3,FALSE)","v":"Eastern"}]
[54414,"Standard","Birnamwood","Shawano County","Non-Urban",{"$f":"VLOOKUP(D699,Region_Map!$A$4:$C$75,3,FALSE)","v":"Eastern"}]
[54416,"Standard","Bowler","Shawano County","Non-Urban",{"$f":"VLOOKUP(D700,Region_Map!$A$4:$C$75,3,FALSE)","v":"Eastern"}]
[54450,"PO Box","Mattoon","Shawano County","Non-Urban",{"$f":"VLOOKUP(D701,Region_Map!$A$4:$C$75,3,FALSE)","v":"Eastern"}]
[54486,"Standard","Tigerton","Shawano County","Non-Urban",{"$f":"VLOOKUP(D702,Region_Map!$A$4:$C$75,3,FALSE)","v":"Eastern"}]
[54499,"Standard","Wittenberg","Shawano County","Non-Urban",{"$f":"VLOOKUP(D703,Region_Map!$A$4:$C$75,3,FALSE)","v":"Eastern"}]
[54928,"Standard","Caroline","Shawano County","Non-Urban",{"$f":"VLOOKUP(D704,Region_Map!$A$4:$C$75,3,FALSE)","v":"Eastern"}]
[54948,"Standard","Leopolis","Shawano County","Non-Urban",{"$f":"VLOOKUP(D705,Region_Map!$A$4:$C$75,3,FALSE)","v":"Eastern"}]
[54978,"Standard","Tilleda","Shawano County","Non-Urban",{"$f":"VLOOKUP(D706,Region_Map!$A$4:$C$75,3,FALSE)","v":"Eastern"}]
[53001,"Standard","Adell","Sheboygan County","Non-Urban",{"$f":"VLOOKUP(D707,Region_Map!$A$4:$C$75,3,FALSE)","v":"Eastern"}]
[53011,"Standard","Cascade","Sheboygan County","Non-Urban",{"$f":"VLOOKUP(D708,Region_Map!$A$4:$C$75,3,FALSE)","v":"Eastern"}]
[53013,"Standard","Cedar Grove","Sheboygan County","Non-Urban",{"$f":"VLOOKUP(D709,Region_Map!$A$4:$C$75,3,FALSE)","v":"Eastern"}]
[53020,"Standard","Elkhart Lake","Sheboygan County","Non-Urban",{"$f":"VLOOKUP(D710,Region_Map!$A$4:$C$75,3,FALSE)","v":"Eastern"}]
[53023,"Standard","Glenbeulah","Sheboygan County","Non-Urban",{"$f":"VLOOKUP(D711,Region_Map!$A$4:$C$75,3,FALSE)","v":"Eastern"}]
[53026,"PO Box","Greenbush","Sheboygan County","Non-Urban",{"$f":"VLOOKUP(D712,Region_Map!$A$4:$C$75,3,FALSE)","v":"Eastern"}]
[53031,"PO Box","Hingham","Sheboygan County","Non-Urban",{"$f":"VLOOKUP(D713,Region_Map!$A$4:$C$75,3,FALSE)","v":"Eastern"}]
[53044,"Standard","Kohler","Sheboygan County","Non-Urban",{"$f":"VLOOKUP(D714,Region_Map!$A$4:$C$75,3,FALSE)","v":"Eastern"}]
[53070,"Standard","Oostburg","Sheboygan County","Non-Urban",{"$f":"VLOOKUP(D715,Region_Map!$A$4:$C$75,3,FALSE)","v":"Eastern"}]
[53073,"Standard","Plymouth","Sheboygan County","Non-Urban",{"$f":"VLOOKUP(D716,Region_Map!$A$4:$C$75,3,FALSE)","v":"Eastern"}]
[53075,"Standard","Random Lake","Sheboygan County","Non-Urban",{"$f":"VLOOKUP(D717,Region_Map!$A$4:$C$75,3,FALSE)","v":"Eastern"}]
[53081,"Standard","Sheboygan","Sheboygan County","Non-Urban",{"$f":"VLOOKUP(D718,Region_Map!$A$4:$C$75,3,FALSE)","v":"Eastern"}]
[53082,"PO Box","Sheboygan","Sheboygan County","Non-Urban",{"$f":"VLOOKUP(D719,Region_Map!$A$4:$C$75,3,FALSE)","v":"Eastern"}]
[53083,"Standard","Sheboygan, Haven, Howards Grove","Sheboygan County","Non-Urban",{"$f":"VLOOKUP(D720,Region_Map!$A$4:$C$75,3,FALSE)","v":"Eastern"}]
[53085,"Standard","Sheboygan Falls, Sheboygan Fls","Sheboygan County","Non-Urban",{"$f":"VLOOKUP(D721,Region_Map!$A$4:$C$75,3,FALSE)","v":"Eastern"}]
[53093,"Standard","Waldo","Sheboygan County","Non-Urban",{"$f":"VLOOKUP(D722,Region_Map!$A$4:$C$75,3,FALSE)","v":"Eastern"}]
[54002,"Standard","Baldwin","St. Croix County","Non-Urban",{"$f":"VLOOKUP(D723,Region_Map!$A$4:$C$75,3,FALSE)","v":"Western"}]
[54007,"Standard","Deer Park","St. Croix County","Non-Urban",{"$f":"VLOOKUP(D724,Region_Map!$A$4:$C$75,3,FALSE)","v":"Western"}]
[54013,"Standard","Glenwood City, Emerald","St. Croix County","Non-Urban",{"$f":"VLOOKUP(D725,Region_Map!$A$4:$C$75,3,FALSE)","v":"Western"}]
[54015,"Standard","Hammond","St. Croix County","Non-Urban",{"$f":"VLOOKUP(D726,Region_Map!$A$4:$C$75,3,FALSE)","v":"Western"}]
[54016,"Standard","Hudson","St. Croix County","Non-Urban",{"$f":"VLOOKUP(D727,Region_Map!$A$4:$C$75,3,FALSE)","v":"Western"}]
[54017,"Standard","New Richmond","St. Croix County","Non-Urban",{"$f":"VLOOKUP(D728,Region_Map!$A$4:$C$75,3,FALSE)","v":"Western"}]
[54023,"Standard","Roberts","St. Croix County","Non-Urban",{"$f":"VLOOKUP(D729,Region_Map!$A$4:$C$75,3,FALSE)","v":"Western"}]
[54025,"Standard","Somerset","St. Croix County","Non-Urban",{"$f":"VLOOKUP(D730,Region_Map!$A$4:$C$75,3,FALSE)","v":"Western"}]
[54027,"Standard","Wilson","St. Croix County","Non-Urban",{"$f":"VLOOKUP(D731,Region_Map!$A$4:$C$75,3,FALSE)","v":"Western"}]
[54028,"Standard","Woodville","St. Croix County","Non-Urban",{"$f":"VLOOKUP(D732,Region_Map!$A$4:$C$75,3,FALSE)","v":"Western"}]
[54082,"Standard","Houlton","St. Croix County","Non-Urban",{"$f":"VLOOKUP(D733,Region_Map!$A$4:$C$75,3,FALSE)","v":"Western"}]
[54433,"Standard","Gilman","Taylor County","Non-Urban",{"$f":"VLOOKUP(D734,Region_Map!$A$4:$C$75,3,FALSE)","v":"Northern"}]
[54434,"PO Box","Jump River, Gilman","Taylor County","Non-Urban",{"$f":"VLOOKUP(D735,Region_Map!$A$4:$C$75,3,FALSE)","v":"Northern"}]
[54439,"PO Box","Hannibal","Taylor County","Non-Urban",{"$f":"VLOOKUP(D736,Region_Map!$A$4:$C$75,3,FALSE)","v":"Northern"}]
[54447,"Standard","Lublin","Taylor County","Non-Urban",{"$f":"VLOOKUP(D737,Region_Map!$A$4:$C$75,3,FALSE)","v":"Northern"}]
[54451,"Standard","Medford, Chelsea","Taylor County","Non-Urban",{"$f":"VLOOKUP(D738,Region_Map!$A$4:$C$75,3,FALSE)","v":"Northern"}]
[54470,"Standard","Rib Lake","Taylor County","Non-Urban",{"$f":"VLOOKUP(D739,Region_Map!$A$4:$C$75,3,FALSE)","v":"Northern"}]
[54480,"Standard","Stetsonville","Taylor County","Non-Urban",{"$f":"VLOOKUP(D740,Region_Map!$A$4:$C$75,3,FALSE)","v":"Northern"}]
[54490,"Standard","Westboro","Taylor County","Non-Urban",{"$f":"VLOOKUP(D741,Region_Map!$A$4:$C$75,3,FALSE)","v":"Northern"}]
[54766,"Standard","Sheldon","Taylor County","Non-Urban",{"$f":"VLOOKUP(D742,Region_Map!$A$4:$C$75,3,FALSE)","v":"Northern"}]
[54612,"Standard","Arcadia","Trempealeau County","Non-Urban",{"$f":"VLOOKUP(D743,Region_Map!$A$4:$C$75,3,FALSE)","v":"Western"}]
[54616,"Standard","Blair","Trempealeau County","Non-Urban",{"$f":"VLOOKUP(D744,Region_Map!$A$4:$C$75,3,FALSE)","v":"Western"}]
[54625,"Standard","Dodge","Trempealeau County","Non-Urban",{"$f":"VLOOKUP(D745,Region_Map!$A$4:$C$75,3,FALSE)","v":"Western"}]
[54627,"Standard","Ettrick","Trempealeau County","Non-Urban",{"$f":"VLOOKUP(D746,Region_Map!$A$4:$C$75,3,FALSE)","v":"Western"}]
[54630,"Standard","Galesville","Trempealeau County","Non-Urban",{"$f":"VLOOKUP(D747,Region_Map!$A$4:$C$75,3,FALSE)","v":"Western"}]
[54661,"Standard","Trempealeau","Trempealeau County","Non-Urban",{"$f":"VLOOKUP(D748,Region_Map!$A$4:$C$75,3,FALSE)","v":"Western"}]
[54747,"Standard","Independence","Trempealeau County","Non-Urban",{"$f":"VLOOKUP(D749,Region_Map!$A$4:$C$75,3,FALSE)","v":"Western"}]
[54758,"Standard","Osseo","Trempealeau County","Non-Urban",{"$f":"VLOOKUP(D750,Region_Map!$A$4:$C$75,3,FALSE)","v":"Western"}]
[54760,"PO Box","Pigeon Falls","Trempealeau County","Non-Urban",{"$f":"VLOOKUP(D751,Region_Map!$A$4:$C$75,3,FALSE)","v":"Western"}]
[54770,"Standard","Strum","Trempealeau County","Non-Urban",{"$f":"VLOOKUP(D752,Region_Map!$A$4:$C$75,3,FALSE)","v":"Western"}]
[54773,"Standard","Whitehall","Trempealeau County","Non-Urban",{"$f":"VLOOKUP(D753,Region_Map!$A$4:$C$75,3,FALSE)","v":"Western"}]
[54621,"Standard","Chaseburg","Vernon County","Non-Urban",{"$f":"VLOOKUP(D754,Region_Map!$A$4:$C$75,3,FALSE)","v":"Southern"}]
[54623,"Standard","Coon Valley","Vernon County","Non-Urban",{"$f":"VLOOKUP(D755,Region_Map!$A$4:$C$75,3,FALSE)","v":"Southern"}]
[54624,"Standard","De Soto, Victory","Vernon County","Non-Urban",{"$f":"VLOOKUP(D756,Region_Map!$A$4:$C$75,3,FALSE)","v":"Southern"}]
[54632,"Standard","Genoa","Vernon County","Non-Urban",{"$f":"VLOOKUP(D757,Region_Map!$A$4:$C$75,3,FALSE)","v":"Southern"}]
[54634,"Standard","Hillsboro, Bloom City, Yuba","Vernon County","Non-Urban",{"$f":"VLOOKUP(D758,Region_Map!$A$4:$C$75,3,FALSE)","v":"Southern"}]
[54639,"Standard","La Farge, West Lima","Vernon County","Non-Urban",{"$f":"VLOOKUP(D759,Region_Map!$A$4:$C$75,3,FALSE)","v":"Southern"}]
[54651,"Standard","Ontario","Vernon County","Non-Urban",{"$f":"VLOOKUP(D760,Region_Map!$A$4:$C$75,3,FALSE)","v":"Southern"}]
[54652,"Standard","Readstown","Vernon County","Non-Urban",{"$f":"VLOOKUP(D761,Region_Map!$A$4:$C$75,3,FALSE)","v":"Southern"}]
[54658,"Standard","Stoddard","Vernon County","Non-Urban",{"$f":"VLOOKUP(D762,Region_Map!$A$4:$C$75,3,FALSE)","v":"Southern"}]
[54665,"Standard","Viroqua","Vernon County","Non-Urban",{"$f":"VLOOKUP(D763,Region_Map!$A$4:$C$75,3,FALSE)","v":"Southern"}]
[54667,"Standard","Westby","Vernon County","Non-Urban",{"$f":"VLOOKUP(D764,Region_Map!$A$4:$C$75,3,FALSE)","v":"Southern"}]
[54512,"Standard","Boulder Junction, Boulder Jct","Vilas County","Non-Urban",{"$f":"VLOOKUP(D765,Region_Map!$A$4:$C$75,3,FALSE)","v":"Northern"}]
[54519,"Standard","Conover","Vilas County","Non-Urban",{"$f":"VLOOKUP(D766,Region_Map!$A$4:$C$75,3,FALSE)","v":"Northern"}]
[54521,"Standard","Eagle River","Vilas County","Non-Urban",{"$f":"VLOOKUP(D767,Region_Map!$A$4:$C$75,3,FALSE)","v":"Northern"}]
[54538,"Standard","Lac Du Flambeau, Lac Du Flambu","Vilas County","Non-Urban",{"$f":"VLOOKUP(D768,Region_Map!$A$4:$C$75,3,FALSE)","v":"Northern"}]
[54540,"Standard","Land O Lakes","Vilas County","Non-Urban",{"$f":"VLOOKUP(D769,Region_Map!$A$4:$C$75,3,FALSE)","v":"Northern"}]
[54545,"Standard","Manitowish Waters, Manitowsh Wtr","Vilas County","Non-Urban",{"$f":"VLOOKUP(D770,Region_Map!$A$4:$C$75,3,FALSE)","v":"Northern"}]
[54554,"Standard","Phelps","Vilas County","Non-Urban",{"$f":"VLOOKUP(D771,Region_Map!$A$4:$C$75,3,FALSE)","v":"Northern"}]
[54557,"Standard","Presque Isle, Winchester","Vilas County","Non-Urban",{"$f":"VLOOKUP(D772,Region_Map!$A$4:$C$75,3,FALSE)","v":"Northern"}]
[54558,"Standard","Saint Germain","Vilas County","Non-Urban",{"$f":"VLOOKUP(D773,Region_Map!$A$4:$C$75,3,FALSE)","v":"Northern"}]
[54560,"Standard","Sayner","Vilas County","Non-Urban",{"$f":"VLOOKUP(D774,Region_Map!$A$4:$C$75,3,FALSE)","v":"Northern"}]
[54561,"Standard","Star Lake","Vilas County","Non-Urban",{"$f":"VLOOKUP(D775,Region_Map!$A$4:$C$75,3,FALSE)","v":"Northern"}]
[54568,"Standard","Woodruff, Arbor Vitae","Vilas County","Non-Urban",{"$f":"VLOOKUP(D776,Region_Map!$A$4:$C$75,3,FALSE)","v":"Northern"}]
[53114,"Standard","Darien","Walworth County","Non-Urban",{"$f":"VLOOKUP(D777,Region_Map!$A$4:$C$75,3,FALSE)","v":"Southern"}]
[53115,"Standard","Delavan","Walworth County","Non-Urban",{"$f":"VLOOKUP(D778,Region_Map!$A$4:$C$75,3,FALSE)","v":"Southern"}]
[53120,"Standard","East Troy","Walworth County","Non-Urban",{"$f":"VLOOKUP(D779,Region_Map!$A$4:$C$75,3,FALSE)","v":"Southern"}]
[53121,"Standard","Elkhorn","Walworth County","Non-Urban",{"$f":"VLOOKUP(D780,Region_Map!$A$4:$C$75,3,FALSE)","v":"Southern"}]
[53125,"Standard","Fontana","Walworth County","Non-Urban",{"$f":"VLOOKUP(D781,Region_Map!$A$4:$C$75,3,FALSE)","v":"Southern"}]
[53128,"Standard","Genoa City","Walworth County","Non-Urban",{"$f":"VLOOKUP(D782,Region_Map!$A$4:$C$75,3,FALSE)","v":"Southern"}]
[53138,"PO Box","Honey Creek","Walworth County","Non-Urban",{"$f":"VLOOKUP(D783,Region_Map!$A$4:$C$75,3,FALSE)","v":"Southern"}]
[53147,"Standard","Lake Geneva","Walworth County","Non-Urban",{"$f":"VLOOKUP(D784,Region_Map!$A$4:$C$75,3,FALSE)","v":"Southern"}]
[53148,"PO Box","Lyons","Walworth County","Non-Urban",{"$f":"VLOOKUP(D785,Region_Map!$A$4:$C$75,3,FALSE)","v":"Southern"}]
[53157,"PO Box","Pell Lake","Walworth County","Non-Urban",{"$f":"VLOOKUP(D786,Region_Map!$A$4:$C$75,3,FALSE)","v":"Southern"}]
[53176,"PO Box","Springfield","Walworth County","Non-Urban",{"$f":"VLOOKUP(D787,Region_Map!$A$4:$C$75,3,FALSE)","v":"Southern"}]
[53184,"Standard","Walworth","Walworth County","Non-Urban",{"$f":"VLOOKUP(D788,Region_Map!$A$4:$C$75,3,FALSE)","v":"Southern"}]
[53190,"Standard","Whitewater","Walworth County","Non-Urban",{"$f":"VLOOKUP(D789,Region_Map!$A$4:$C$75,3,FALSE)","v":"Southern"}]
[53191,"Standard","Williams Bay","Walworth County","Non-Urban",{"$f":"VLOOKUP(D790,Region_Map!$A$4:$C$75,3,FALSE)","v":"Southern"}]
[53195,"PO Box","Zenda","Walworth County","Non-Urban",{"$f":"VLOOKUP(D791,Region_Map!$A$4:$C$75,3,FALSE)","v":"Southern"}]
[53585,"Standard","Sharon","Walworth County","Non-Urban",{"$f":"VLOOKUP(D792,Region_Map!$A$4:$C$75,3,FALSE)","v":"Southern"}]
[54801,"Standard","Spooner","Washburn County","Non-Urban",{"$f":"VLOOKUP(D793,Region_Map!$A$4:$C$75,3,FALSE)","v":"Western"}]
[54813,"Standard","Barronett","Washburn County","Non-Urban",{"$f":"VLOOKUP(D794,Region_Map!$A$4:$C$75,3,FALSE)","v":"Western"}]
[54817,"Standard","Birchwood","Washburn County","Non-Urban",{"$f":"VLOOKUP(D795,Region_Map!$A$4:$C$75,3,FALSE)","v":"Western"}]
[54859,"Standard","Minong","Washburn County","Non-Urban",{"$f":"VLOOKUP(D796,Region_Map!$A$4:$C$75,3,FALSE)","v":"Western"}]
[54870,"Standard","Sarona","Washburn County","Non-Urban",{"$f":"VLOOKUP(D797,Region_Map!$A$4:$C$75,3,FALSE)","v":"Western"}]
[54871,"Standard","Shell Lake","Washburn County","Non-Urban",{"$f":"VLOOKUP(D798,Region_Map!$A$4:$C$75,3,FALSE)","v":"Western"}]
[54875,"Standard","Springbrook","Washburn County","Non-Urban",{"$f":"VLOOKUP(D799,Region_Map!$A$4:$C$75,3,FALSE)","v":"Western"}]
[54888,"Standard","Trego","Washburn County","Non-Urban",{"$f":"VLOOKUP(D800,Region_Map!$A$4:$C$75,3,FALSE)","v":"Western"}]
[53002,"Standard","Allenton","Washington County","Urban",{"$f":"VLOOKUP(D801,Region_Map!$A$4:$C$75,3,FALSE)","v":"Eastern"}]
[53017,"Standard","Colgate","Washington County","Urban",{"$f":"VLOOKUP(D802,Region_Map!$A$4:$C$75,3,FALSE)","v":"Eastern"}]
[53022,"Standard","Germantown, Rockfield","Washington County","Urban",{"$f":"VLOOKUP(D803,Region_Map!$A$4:$C$75,3,FALSE)","v":"Eastern"}]
[53027,"Standard","Hartford","Washington County","Urban",{"$f":"VLOOKUP(D804,Region_Map!$A$4:$C$75,3,FALSE)","v":"Eastern"}]
[53033,"Standard","Hubertus","Washington County","Urban",{"$f":"VLOOKUP(D805,Region_Map!$A$4:$C$75,3,FALSE)","v":"Eastern"}]
[53037,"Standard","Jackson","Washington County","Urban",{"$f":"VLOOKUP(D806,Region_Map!$A$4:$C$75,3,FALSE)","v":"Eastern"}]
[53040,"Standard","Kewaskum","Washington County","Urban",{"$f":"VLOOKUP(D807,Region_Map!$A$4:$C$75,3,FALSE)","v":"Eastern"}]
[53060,"PO Box","Newburg","Washington County","Urban",{"$f":"VLOOKUP(D808,Region_Map!$A$4:$C$75,3,FALSE)","v":"Eastern"}]
[53076,"Standard","Richfield","Washington County","Urban",{"$f":"VLOOKUP(D809,Region_Map!$A$4:$C$75,3,FALSE)","v":"Eastern"}]
[53086,"Standard","Slinger","Washington County","Urban",{"$f":"VLOOKUP(D810,Region_Map!$A$4:$C$75,3,FALSE)","v":"Eastern"}]
[53090,"Standard","West Bend","Washington County","Urban",{"$f":"VLOOKUP(D811,Region_Map!$A$4:$C$75,3,FALSE)","v":"Eastern"}]
[53095,"Standard","West Bend","Washington County","Urban",{"$f":"VLOOKUP(D812,Region_Map!$A$4:$C$75,3,FALSE)","v":"Eastern"}]
[53005,"Standard","Brookfield","Waukesha County","Urban",{"$f":"VLOOKUP(D813,Region_Map!$A$4:$C$75,3,FALSE)","v":"Eastern"}]
[53007,"Standard","Butler","Waukesha County","Urban",{"$f":"VLOOKUP(D814,Region_Map!$A$4:$C$75,3,FALSE)","v":"Eastern"}]
[53008,"PO Box","Brookfield","Waukesha County","Urban",{"$f":"VLOOKUP(D815,Region_Map!$A$4:$C$75,3,FALSE)","v":"Eastern"}]
[53018,"Standard","Delafield","Waukesha County","Urban",{"$f":"VLOOKUP(D816,Region_Map!$A$4:$C$75,3,FALSE)","v":"Eastern"}]
[53029,"Standard","Hartland","Waukesha County","Urban",{"$f":"VLOOKUP(D817,Region_Map!$A$4:$C$75,3,FALSE)","v":"Eastern"}]
[53045,"Standard","Brookfield","Waukesha County","Urban",{"$f":"VLOOKUP(D818,Region_Map!$A$4:$C$75,3,FALSE)","v":"Eastern"}]
[53046,"Standard","Lannon","Waukesha County","Urban",{"$f":"VLOOKUP(D819,Region_Map!$A$4:$C$75,3,FALSE)","v":"Eastern"}]
[53051,"Standard","Menomonee Falls, Menomonee Fls","Waukesha County","Urban",{"$f":"VLOOKUP(D820,Region_Map!$A$4:$C$75,3,FALSE)","v":"Eastern"}]
[53052,"PO Box","Menomonee Falls, Menomonee Fls","Waukesha County","Urban",{"$f":"VLOOKUP(D821,Region_Map!$A$4:$C$75,3,FALSE)","v":"Eastern"}]
[53056,"PO Box","Merton","Waukesha County","Urban",{"$f":"VLOOKUP(D822,Region_Map!$A$4:$C$75,3,FALSE)","v":"Eastern"}]
[53058,"Standard","Nashotah","Waukesha County","Urban",{"$f":"VLOOKUP(D823,Region_Map!$A$4:$C$75,3,FALSE)","v":"Eastern"}]
[53064,"PO Box","North Lake","Waukesha County","Urban",{"$f":"VLOOKUP(D824,Region_Map!$A$4:$C$75,3,FALSE)","v":"Eastern"}]
[53066,"Standard","Oconomowoc, Summit","Waukesha County","Urban",{"$f":"VLOOKUP(D825,Region_Map!$A$4:$C$75,3,FALSE)","v":"Eastern"}]
[53069,"Standard","Okauchee","Waukesha County","Urban",{"$f":"VLOOKUP(D826,Region_Map!$A$4:$C$75,3,FALSE)","v":"Eastern"}]
[53072,"Standard","Pewaukee, Brookfield","Waukesha County","Urban",{"$f":"VLOOKUP(D827,Region_Map!$A$4:$C$75,3,FALSE)","v":"Eastern"}]
[53089,"Standard","Sussex, Lisbon","Waukesha County","Urban",{"$f":"VLOOKUP(D828,Region_Map!$A$4:$C$75,3,FALSE)","v":"Eastern"}]
[53103,"Standard","Big Bend","Waukesha County","Urban",{"$f":"VLOOKUP(D829,Region_Map!$A$4:$C$75,3,FALSE)","v":"Eastern"}]
[53118,"Standard","Dousman","Waukesha County","Urban",{"$f":"VLOOKUP(D830,Region_Map!$A$4:$C$75,3,FALSE)","v":"Eastern"}]
[53119,"Standard","Eagle","Waukesha County","Urban",{"$f":"VLOOKUP(D831,Region_Map!$A$4:$C$75,3,FALSE)","v":"Eastern"}]
[53122,"Standard","Elm Grove","Waukesha County","Urban",{"$f":"VLOOKUP(D832,Region_Map!$A$4:$C$75,3,FALSE)","v":"Eastern"}]
[53127,"PO Box","Genesee Depot","Waukesha County","Urban",{"$f":"VLOOKUP(D833,Region_Map!$A$4:$C$75,3,FALSE)","v":"Eastern"}]
[53146,"Standard","New Berlin","Waukesha County","Urban",{"$f":"VLOOKUP(D834,Region_Map!$A$4:$C$75,3,FALSE)","v":"Eastern"}]
[53149,"Standard","Mukwonago","Waukesha County","Urban",{"$f":"VLOOKUP(D835,Region_Map!$A$4:$C$75,3,FALSE)","v":"Eastern"}]
[53150,"Standard","Muskego","Waukesha County","Urban",{"$f":"VLOOKUP(D836,Region_Map!$A$4:$C$75,3,FALSE)","v":"Eastern"}]
[53151,"Standard","New Berlin","Waukesha County","Urban",{"$f":"VLOOKUP(D837,Region_Map!$A$4:$C$75,3,FALSE)","v":"Eastern"}]
[53153,"Standard","North Prairie","Waukesha County","Urban",{"$f":"VLOOKUP(D838,Region_Map!$A$4:$C$75,3,FALSE)","v":"Eastern"}]
[53183,"Standard","Wales","Waukesha County","Urban",{"$f":"VLOOKUP(D839,Region_Map!$A$4:$C$75,3,FALSE)","v":"Eastern"}]
[53186,"Standard","Waukesha, Vernon","Waukesha County","Urban",{"$f":"VLOOKUP(D840,Region_Map!$A$4:$C$75,3,FALSE)","v":"Eastern"}]
[53187,"PO Box","Waukesha","Waukesha County","Urban",{"$f":"VLOOKUP(D841,Region_Map!$A$4:$C$75,3,FALSE)","v":"Eastern"}]
[53188,"Standard","Waukesha, Vernon","Waukesha County","Urban",{"$f":"VLOOKUP(D842,Region_Map!$A$4:$C$75,3,FALSE)","v":"Eastern"}]
[53189,"Standard","Waukesha","Waukesha County","Urban",{"$f":"VLOOKUP(D843,Region_Map!$A$4:$C$75,3,FALSE)","v":"Eastern"}]
[54926,"PO Box","Big Falls","Waupaca County","Non-Urban",{"$f":"VLOOKUP(D844,Region_Map!$A$4:$C$75,3,FALSE)","v":"Eastern"}]
[54929,"Standard","Clintonville","Waupaca County","Non-Urban",{"$f":"VLOOKUP(D845,Region_Map!$A$4:$C$75,3,FALSE)","v":"Eastern"}]
[54933,"PO Box","Embarrass","Waupaca County","Non-Urban",{"$f":"VLOOKUP(D846,Region_Map!$A$4:$C$75,3,FALSE)","v":"Eastern"}]
[54940,"Standard","Fremont","Waupaca County","Non-Urban",{"$f":"VLOOKUP(D847,Region_Map!$A$4:$C$75,3,FALSE)","v":"Eastern"}]
[54945,"Standard","Iola","Waupaca County","Non-Urban",{"$f":"VLOOKUP(D848,Region_Map!$A$4:$C$75,3,FALSE)","v":"Eastern"}]
[54946,"PO Box","King","Waupaca County","Non-Urban",{"$f":"VLOOKUP(D849,Region_Map!$A$4:$C$75,3,FALSE)","v":"Eastern"}]
[54949,"Standard","Manawa","Waupaca County","Non-Urban",{"$f":"VLOOKUP(D850,Region_Map!$A$4:$C$75,3,FALSE)","v":"Eastern"}]
[54950,"Standard","Marion","Waupaca County","Non-Urban",{"$f":"VLOOKUP(D851,Region_Map!$A$4:$C$75,3,FALSE)","v":"Eastern"}]
[54961,"Standard","New London, Royalton","Waupaca County","Non-Urban",{"$f":"VLOOKUP(D852,Region_Map!$A$4:$C$75,3,FALSE)","v":"Eastern"}]
[54962,"Standard","Ogdensburg","Waupaca County","Non-Urban",{"$f":"VLOOKUP(D853,Region_Map!$A$4:$C$75,3,FALSE)","v":"Eastern"}]
[54969,"PO Box","Readfield","Waupaca County","Non-Urban",{"$f":"VLOOKUP(D854,Region_Map!$A$4:$C$75,3,FALSE)","v":"Eastern"}]
[54977,"Standard","Scandinavia","Waupaca County","Non-Urban",{"$f":"VLOOKUP(D855,Region_Map!$A$4:$C$75,3,FALSE)","v":"Eastern"}]
[54981,"Standard","Waupaca","Waupaca County","Non-Urban",{"$f":"VLOOKUP(D856,Region_Map!$A$4:$C$75,3,FALSE)","v":"Eastern"}]
[54983,"Standard","Weyauwega","Waupaca County","Non-Urban",{"$f":"VLOOKUP(D857,Region_Map!$A$4:$C$75,3,FALSE)","v":"Eastern"}]
[54990,"Unique","Iola","Waupaca County","Non-Urban",{"$f":"VLOOKUP(D858,Region_Map!$A$4:$C$75,3,FALSE)","v":"Eastern"}]
[54923,"Standard","Berlin","Waushara County","Non-Urban",{"$f":"VLOOKUP(D859,Region_Map!$A$4:$C$75,3,FALSE)","v":"Eastern"}]
[54930,"Standard","Coloma","Waushara County","Non-Urban",{"$f":"VLOOKUP(D860,Region_Map!$A$4:$C$75,3,FALSE)","v":"Eastern"}]
[54943,"Standard","Hancock","Waushara County","Non-Urban",{"$f":"VLOOKUP(D861,Region_Map!$A$4:$C$75,3,FALSE)","v":"Eastern"}]
[54965,"Standard","Pine River","Waushara County","Non-Urban",{"$f":"VLOOKUP(D862,Region_Map!$A$4:$C$75,3,FALSE)","v":"Eastern"}]
[54966,"Standard","Plainfield","Waushara County","Non-Urban",{"$f":"VLOOKUP(D863,Region_Map!$A$4:$C$75,3,FALSE)","v":"Eastern"}]
[54967,"Standard","Poy Sippi","Waushara County","Non-Urban",{"$f":"VLOOKUP(D864,Region_Map!$A$4:$C$75,3,FALSE)","v":"Eastern"}]
[54970,"Standard","Redgranite","Waushara County","Non-Urban",{"$f":"VLOOKUP(D865,Region_Map!$A$4:$C$75,3,FALSE)","v":"Eastern"}]
[54976,"PO Box","Saxeville","Waushara County","Non-Urban",{"$f":"VLOOKUP(D866,Region_Map!$A$4:$C$75,3,FALSE)","v":"Eastern"}]
[54982,"Standard","Wautoma","Waushara County","Non-Urban",{"$f":"VLOOKUP(D867,Region_Map!$A$4:$C$75,3,FALSE)","v":"Eastern"}]
[54984,"Standard","Wild Rose","Waushara County","Non-Urban",{"$f":"VLOOKUP(D868,Region_Map!$A$4:$C$75,3,FALSE)","v":"Eastern"}]
[54901,"Standard","Oshkosh","Winnebago County","Non-Urban",{"$f":"VLOOKUP(D869,Region_Map!$A$4:$C$75,3,FALSE)","v":"Eastern"}]
[54902,"Standard","Oshkosh","Winnebago County","Non-Urban",{"$f":"VLOOKUP(D870,Region_Map!$A$4:$C$75,3,FALSE)","v":"Eastern"}]
[54903,"PO Box","Oshkosh","Winnebago County","Non-Urban",{"$f":"VLOOKUP(D871,Region_Map!$A$4:$C$75,3,FALSE)","v":"Eastern"}]
[54904,"Standard","Oshkosh","Winnebago County","Non-Urban",{"$f":"VLOOKUP(D872,Region_Map!$A$4:$C$75,3,FALSE)","v":"Eastern"}]
[54906,"Unique","Oshkosh","Winnebago County","Non-Urban",{"$f":"VLOOKUP(D873,Region_Map!$A$4:$C$75,3,FALSE)","v":"Eastern"}]
[54927,"PO Box","Butte Des Morts, Bte Des Morts","Winnebago County","Non-Urban",{"$f":"VLOOKUP(D874,Region_Map!$A$4:$C$75,3,FALSE)","v":"Eastern"}]
[54934,"PO Box","Eureka","Winnebago County","Non-Urban",{"$f":"VLOOKUP(D875,Region_Map!$A$4:$C$75,3,FALSE)","v":"Eastern"}]
[54947,"Standard","Larsen","Winnebago County","Non-Urban",{"$f":"VLOOKUP(D876,Region_Map!$A$4:$C$75,3,FALSE)","v":"Eastern"}]
[54952,"Standard","Menasha","Winnebago County","Non-Urban",{"$f":"VLOOKUP(D877,Region_Map!$A$4:$C$75,3,FALSE)","v":"Eastern"}]
[54956,"Standard","Neenah","Winnebago County","Non-Urban",{"$f":"VLOOKUP(D878,Region_Map!$A$4:$C$75,3,FALSE)","v":"Eastern"}]
[54957,"PO Box","Neenah","Winnebago County","Non-Urban",{"$f":"VLOOKUP(D879,Region_Map!$A$4:$C$75,3,FALSE)","v":"Eastern"}]
[54963,"Standard","Omro","Winnebago County","Non-Urban",{"$f":"VLOOKUP(D880,Region_Map!$A$4:$C$75,3,FALSE)","v":"Eastern"}]
[54964,"Standard","Pickett","Winnebago County","Non-Urban",{"$f":"VLOOKUP(D881,Region_Map!$A$4:$C$75,3,FALSE)","v":"Eastern"}]
[54980,"PO Box","Waukau","Winnebago County","Non-Urban",{"$f":"VLOOKUP(D882,Region_Map!$A$4:$C$75,3,FALSE)","v":"Eastern"}]
[54985,"PO Box","Winnebago","Winnebago County","Non-Urban",{"$f":"VLOOKUP(D883,Region_Map!$A$4:$C$75,3,FALSE)","v":"Eastern"}]
[54986,"Standard","Winneconne","Winnebago County","Non-Urban",{"$f":"VLOOKUP(D884,Region_Map!$A$4:$C$75,3,FALSE)","v":"Eastern"}]
[54404,"Unique","Marshfield","Wood County","Non-Urban",{"$f":"VLOOKUP(D885,Region_Map!$A$4:$C$75,3,FALSE)","v":"Northern"}]
[54410,"Standard","Arpin","Wood County","Non-Urban",{"$f":"VLOOKUP(D886,Region_Map!$A$4:$C$75,3,FALSE)","v":"Northern"}]
[54412,"Standard","Auburndale","Wood County","Non-Urban",{"$f":"VLOOKUP(D887,Region_Map!$A$4:$C$75,3,FALSE)","v":"Northern"}]
[54413,"PO Box","Babcock","Wood County","Non-Urban",{"$f":"VLOOKUP(D888,Region_Map!$A$4:$C$75,3,FALSE)","v":"Northern"}]
[54415,"PO Box","Blenker","Wood County","Non-Urban",{"$f":"VLOOKUP(D889,Region_Map!$A$4:$C$75,3,FALSE)","v":"Northern"}]
[54441,"Standard","Hewitt","Wood County","Non-Urban",{"$f":"VLOOKUP(D890,Region_Map!$A$4:$C$75,3,FALSE)","v":"Northern"}]
[54449,"Standard","Marshfield","Wood County","Non-Urban",{"$f":"VLOOKUP(D891,Region_Map!$A$4:$C$75,3,FALSE)","v":"Northern"}]
[54454,"Standard","Milladore","Wood County","Non-Urban",{"$f":"VLOOKUP(D892,Region_Map!$A$4:$C$75,3,FALSE)","v":"Northern"}]
[54466,"Standard","Pittsville","Wood County","Non-Urban",{"$f":"VLOOKUP(D893,Region_Map!$A$4:$C$75,3,FALSE)","v":"Northern"}]
[54469,"Standard","Port Edwards","Wood County","Non-Urban",{"$f":"VLOOKUP(D894,Region_Map!$A$4:$C$75,3,FALSE)","v":"Northern"}]
[54472,"Unique","Marshfield","Wood County","Non-Urban",{"$f":"VLOOKUP(D895,Region_Map!$A$4:$C$75,3,FALSE)","v":"Northern"}]
[54475,"Standard","Rudolph","Wood County","Non-Urban",{"$f":"VLOOKUP(D896,Region_Map!$A$4:$C$75,3,FALSE)","v":"Northern"}]
[54489,"Standard","Vesper","Wood County","Non-Urban",{"$f":"VLOOKUP(D897,Region_Map!$A$4:$C$75,3,FALSE)","v":"Northern"}]
[54494,"Standard","Wisconsin Rapids, Wisc Rapids","Wood County","Non-Urban",{"$f":"VLOOKUP(D898,Region_Map!$A$4:$C$75,3,FALSE)","v":"Northern"}]
[54495,"Standard","Wisconsin Rapids, Wisc Rapids","Wood County","Non-Urban",{"$f":"VLOOKUP(D899,Region_Map!$A$4:$C$75,3,FALSE)","v":"Northern"}]

{"sheet":"Show to Carriers>>>","index":6,"n_rows":0,"n_cols":0,"rows_kept":0,"cut":false,"hidden":true,"merged":[]}

{"sheet":"Table","index":7,"n_rows":1736,"n_cols":28,"rows_kept":1736,"cut":false,"hidden":false,"merged":[[1,2,1,10],[2,2,2,10],[6,10,6,15],[6,16,6,21],[6,22,6,27],[6,5,6,9]]}
[]
[null,"Proposer:"]
[null,"Network:"]
[]
[null,"Contract Type ->   F = Fee Schedule, D = Discount off submitted charges, B = Bundled payment, O = Other contract arrangement"]
[]
[null,null,null,null,null,"Total",null,null,null,null,"In-Network",null,null,null,null,null,"Intent",null,null,null,null,null,"Out-of-Network"]
[null,"Region","County","Major Service Category","Contract Type","# of Claims","# of Services","# of Admissions","# of Days","Billed","# of Claims","# of Services","# of Admissions","# of Days","Billed","Allowed","# of Claims","# of Services","# of Admissions","# of Days","Billed","Allowed","# of Claims","# of Services","# of Admissions","# of Days","Billed","Allowed"]
[1,{"$f":"VLOOKUP(A9,'Counties and Regions'!$G$3:$J$74,4,FALSE)","v":"Southern"},{"$f":"VLOOKUP(A9,'Counties and Regions'!$G$3:$J$74,3,FALSE)","v":"Adams County"},"Hospital Inpatient","F"]
[{"$f":"IF(COUNTIF($A$9:A9,A9)<24,A9,A9+1)","v":1},{"$f":"VLOOKUP(A10,'Counties and Regions'!$G$3:$J$74,4,FALSE)","v":"Southern"},{"$f":"VLOOKUP(A10,'Counties and Regions'!$G$3:$J$74,3,FALSE)","v":"Adams County"},"Hospital Inpatient","D"]
[{"$f":"IF(COUNTIF($A$9:A10,A10)<24,A10,A10+1)","v":1},{"$f":"VLOOKUP(A11,'Counties and Regions'!$G$3:$J$74,4,FALSE)","v":"Southern"},{"$f":"VLOOKUP(A11,'Counties and Regions'!$G$3:$J$74,3,FALSE)","v":"Adams County"},"Hospital Inpatient","B"]
[{"$f":"IF(COUNTIF($A$9:A11,A11)<24,A11,A11+1)","v":1},{"$f":"VLOOKUP(A12,'Counties and Regions'!$G$3:$J$74,4,FALSE)","v":"Southern"},{"$f":"VLOOKUP(A12,'Counties and Regions'!$G$3:$J$74,3,FALSE)","v":"Adams County"},"Hospital Inpatient","O"]
[{"$f":"IF(COUNTIF($A$9:A12,A12)<24,A12,A12+1)","v":1},{"$f":"VLOOKUP(A13,'Counties and Regions'!$G$3:$J$74,4,FALSE)","v":"Southern"},{"$f":"VLOOKUP(A13,'Counties and Regions'!$G$3:$J$74,3,FALSE)","v":"Adams County"},"Hospital Outpatient","F"]
[{"$f":"IF(COUNTIF($A$9:A13,A13)<24,A13,A13+1)","v":1},{"$f":"VLOOKUP(A14,'Counties and Regions'!$G$3:$J$74,4,FALSE)","v":"Southern"},{"$f":"VLOOKUP(A14,'Counties and Regions'!$G$3:$J$74,3,FALSE)","v":"Adams County"},"Hospital Outpatient","D"]
[{"$f":"IF(COUNTIF($A$9:A14,A14)<24,A14,A14+1)","v":1},{"$f":"VLOOKUP(A15,'Counties and Regions'!$G$3:$J$74,4,FALSE)","v":"Southern"},{"$f":"VLOOKUP(A15,'Counties and Regions'!$G$3:$J$74,3,FALSE)","v":"Adams County"},"Hospital Outpatient","B"]
[{"$f":"IF(COUNTIF($A$9:A15,A15)<24,A15,A15+1)","v":1},{"$f":"VLOOKUP(A16,'Counties and Regions'!$G$3:$J$74,4,FALSE)","v":"Southern"},{"$f":"VLOOKUP(A16,'Counties and Regions'!$G$3:$J$74,3,FALSE)","v":"Adams County"},"Hospital Outpatient","O"]
[{"$f":"IF(COUNTIF($A$9:A16,A16)<24,A16,A16+1)","v":1},{"$f":"VLOOKUP(A17,'Counties and Regions'!$G$3:$J$74,4,FALSE)","v":"Southern"},{"$f":"VLOOKUP(A17,'Counties and Regions'!$G$3:$J$74,3,FALSE)","v":"Adams County"},"Other Facility","F"]
[{"$f":"IF(COUNTIF($A$9:A17,A17)<24,A17,A17+1)","v":1},{"$f":"VLOOKUP(A18,'Counties and Regions'!$G$3:$J$74,4,FALSE)","v":"Southern"},{"$f":"VLOOKUP(A18,'Counties and Regions'!$G$3:$J$74,3,FALSE)","v":"Adams County"},"Other Facility","D"]
[{"$f":"IF(COUNTIF($A$9:A18,A18)<24,A18,A18+1)","v":1},{"$f":"VLOOKUP(A19,'Counties and Regions'!$G$3:$J$74,4,FALSE)","v":"Southern"},{"$f":"VLOOKUP(A19,'Counties and Regions'!$G$3:$J$74,3,FALSE)","v":"Adams County"},"Other Facility","B"]
[{"$f":"IF(COUNTIF($A$9:A19,A19)<24,A19,A19+1)","v":1},{"$f":"VLOOKUP(A20,'Counties and Regions'!$G$3:$J$74,4,FALSE)","v":"Southern"},{"$f":"VLOOKUP(A20,'Counties and Regions'!$G$3:$J$74,3,FALSE)","v":"Adams County"},"Other Facility","O"]
[{"$f":"IF(COUNTIF($A$9:A20,A20)<24,A20,A20+1)","v":1},{"$f":"VLOOKUP(A21,'Counties and Regions'!$G$3:$J$74,4,FALSE)","v":"Southern"},{"$f":"VLOOKUP(A21,'Counties and Regions'!$G$3:$J$74,3,FALSE)","v":"Adams County"},"Physician Services","F"]
[{"$f":"IF(COUNTIF($A$9:A21,A21)<24,A21,A21+1)","v":1},{"$f":"VLOOKUP(A22,'Counties and Regions'!$G$3:$J$74,4,FALSE)","v":"Southern"},{"$f":"VLOOKUP(A22,'Counties and Regions'!$G$3:$J$74,3,FALSE)","v":"Adams County"},"Physician Services","D"]
[{"$f":"IF(COUNTIF($A$9:A22,A22)<24,A22,A22+1)","v":1},{"$f":"VLOOKUP(A23,'Counties and Regions'!$G$3:$J$74,4,FALSE)","v":"Southern"},{"$f":"VLOOKUP(A23,'Counties and Regions'!$G$3:$J$74,3,FALSE)","v":"Adams County"},"Physician Services","B"]
[{"$f":"IF(COUNTIF($A$9:A23,A23)<24,A23,A23+1)","v":1},{"$f":"VLOOKUP(A24,'Counties and Regions'!$G$3:$J$74,4,FALSE)","v":"Southern"},{"$f":"VLOOKUP(A24,'Counties and Regions'!$G$3:$J$74,3,FALSE)","v":"Adams County"},"Physician Services","O"]
[{"$f":"IF(COUNTIF($A$9:A24,A24)<24,A24,A24+1)","v":1},{"$f":"VLOOKUP(A25,'Counties and Regions'!$G$3:$J$74,4,FALSE)","v":"Southern"},{"$f":"VLOOKUP(A25,'Counties and Regions'!$G$3:$J$74,3,FALSE)","v":"Adams County"},"Other Services","F"]
[{"$f":"IF(COUNTIF($A$9:A25,A25)<24,A25,A25+1)","v":1},{"$f":"VLOOKUP(A26,'Counties and Regions'!$G$3:$J$74,4,FALSE)","v":"Southern"},{"$f":"VLOOKUP(A26,'Counties and Regions'!$G$3:$J$74,3,FALSE)","v":"Adams County"},"Other Services","D"]
[{"$f":"IF(COUNTIF($A$9:A26,A26)<24,A26,A26+1)","v":1},{"$f":"VLOOKUP(A27,'Counties and Regions'!$G$3:$J$74,4,FALSE)","v":"Southern"},{"$f":"VLOOKUP(A27,'Counties and Regions'!$G$3:$J$74,3,FALSE)","v":"Adams County"},"Other Services","B"]
[{"$f":"IF(COUNTIF($A$9:A27,A27)<24,A27,A27+1)","v":1},{"$f":"VLOOKUP(A28,'Counties and Regions'!$G$3:$J$74,4,FALSE)","v":"Southern"},{"$f":"VLOOKUP(A28,'Counties and Regions'!$G$3:$J$74,3,FALSE)","v":"Adams County"},"Other Services","O"]
[{"$f":"IF(COUNTIF($A$9:A28,A28)<24,A28,A28+1)","v":1},{"$f":"VLOOKUP(A29,'Counties and Regions'!$G$3:$J$74,4,FALSE)","v":"Southern"},{"$f":"VLOOKUP(A29,'Counties and Regions'!$G$3:$J$74,3,FALSE)","v":"Adams County"},"Additional Services","F"]
[{"$f":"IF(COUNTIF($A$9:A29,A29)<24,A29,A29+1)","v":1},{"$f":"VLOOKUP(A30,'Counties and Regions'!$G$3:$J$74,4,FALSE)","v":"Southern"},{"$f":"VLOOKUP(A30,'Counties and Regions'!$G$3:$J$74,3,FALSE)","v":"Adams County"},"Additional Services","D"]
[{"$f":"IF(COUNTIF($A$9:A30,A30)<24,A30,A30+1)","v":1},{"$f":"VLOOKUP(A31,'Counties and Regions'!$G$3:$J$74,4,FALSE)","v":"Southern"},{"$f":"VLOOKUP(A31,'Counties and Regions'!$G$3:$J$74,3,FALSE)","v":"Adams County"},"Additional Services","B"]
[{"$f":"IF(COUNTIF($A$9:A31,A31)<24,A31,A31+1)","v":1},{"$f":"VLOOKUP(A32,'Counties and Regions'!$G$3:$J$74,4,FALSE)","v":"Southern"},{"$f":"VLOOKUP(A32,'Counties and Regions'!$G$3:$J$74,3,FALSE)","v":"Adams County"},"Additional Services","O"]
[{"$f":"IF(COUNTIF($A$9:A32,A32)<24,A32,A32+1)","v":2},{"$f":"VLOOKUP(A33,'Counties and Regions'!$G$3:$J$74,4,FALSE)","v":"Southern"},{"$f":"VLOOKUP(A33,'Counties and Regions'!$G$3:$J$74,3,FALSE)","v":"Columbia County"},"Hospital Inpatient","F"]
[{"$f":"IF(COUNTIF($A$9:A33,A33)<24,A33,A33+1)","v":2},{"$f":"VLOOKUP(A34,'Counties and Regions'!$G$3:$J$74,4,FALSE)","v":"Southern"},{"$f":"VLOOKUP(A34,'Counties and Regions'!$G$3:$J$74,3,FALSE)","v":"Columbia County"},"Hospital Inpatient","D"]
[{"$f":"IF(COUNTIF($A$9:A34,A34)<24,A34,A34+1)","v":2},{"$f":"VLOOKUP(A35,'Counties and Regions'!$G$3:$J$74,4,FALSE)","v":"Southern"},{"$f":"VLOOKUP(A35,'Counties and Regions'!$G$3:$J$74,3,FALSE)","v":"Columbia County"},"Hospital Inpatient","B"]
[{"$f":"IF(COUNTIF($A$9:A35,A35)<24,A35,A35+1)","v":2},{"$f":"VLOOKUP(A36,'Counties and Regions'!$G$3:$J$74,4,FALSE)","v":"Southern"},{"$f":"VLOOKUP(A36,'Counties and Regions'!$G$3:$J$74,3,FALSE)","v":"Columbia County"},"Hospital Inpatient","O"]
[{"$f":"IF(COUNTIF($A$9:A36,A36)<24,A36,A36+1)","v":2},{"$f":"VLOOKUP(A37,'Counties and Regions'!$G$3:$J$74,4,FALSE)","v":"Southern"},{"$f":"VLOOKUP(A37,'Counties and Regions'!$G$3:$J$74,3,FALSE)","v":"Columbia County"},"Hospital Outpatient","F"]
[{"$f":"IF(COUNTIF($A$9:A37,A37)<24,A37,A37+1)","v":2},{"$f":"VLOOKUP(A38,'Counties and Regions'!$G$3:$J$74,4,FALSE)","v":"Southern"},{"$f":"VLOOKUP(A38,'Counties and Regions'!$G$3:$J$74,3,FALSE)","v":"Columbia County"},"Hospital Outpatient","D"]
[{"$f":"IF(COUNTIF($A$9:A38,A38)<24,A38,A38+1)","v":2},{"$f":"VLOOKUP(A39,'Counties and Regions'!$G$3:$J$74,4,FALSE)","v":"Southern"},{"$f":"VLOOKUP(A39,'Counties and Regions'!$G$3:$J$74,3,FALSE)","v":"Columbia County"},"Hospital Outpatient","B"]
[{"$f":"IF(COUNTIF($A$9:A39,A39)<24,A39,A39+1)","v":2},{"$f":"VLOOKUP(A40,'Counties and Regions'!$G$3:$J$74,4,FALSE)","v":"Southern"},{"$f":"VLOOKUP(A40,'Counties and Regions'!$G$3:$J$74,3,FALSE)","v":"Columbia County"},"Hospital Outpatient","O"]
[{"$f":"IF(COUNTIF($A$9:A40,A40)<24,A40,A40+1)","v":2},{"$f":"VLOOKUP(A41,'Counties and Regions'!$G$3:$J$74,4,FALSE)","v":"Southern"},{"$f":"VLOOKUP(A41,'Counties and Regions'!$G$3:$J$74,3,FALSE)","v":"Columbia County"},"Other Facility","F"]
[{"$f":"IF(COUNTIF($A$9:A41,A41)<24,A41,A41+1)","v":2},{"$f":"VLOOKUP(A42,'Counties and Regions'!$G$3:$J$74,4,FALSE)","v":"Southern"},{"$f":"VLOOKUP(A42,'Counties and Regions'!$G$3:$J$74,3,FALSE)","v":"Columbia County"},"Other Facility","D"]
[{"$f":"IF(COUNTIF($A$9:A42,A42)<24,A42,A42+1)","v":2},{"$f":"VLOOKUP(A43,'Counties and Regions'!$G$3:$J$74,4,FALSE)","v":"Southern"},{"$f":"VLOOKUP(A43,'Counties and Regions'!$G$3:$J$74,3,FALSE)","v":"Columbia County"},"Other Facility","B"]
[{"$f":"IF(COUNTIF($A$9:A43,A43)<24,A43,A43+1)","v":2},{"$f":"VLOOKUP(A44,'Counties and Regions'!$G$3:$J$74,4,FALSE)","v":"Southern"},{"$f":"VLOOKUP(A44,'Counties and Regions'!$G$3:$J$74,3,FALSE)","v":"Columbia County"},"Other Facility","O"]
[{"$f":"IF(COUNTIF($A$9:A44,A44)<24,A44,A44+1)","v":2},{"$f":"VLOOKUP(A45,'Counties and Regions'!$G$3:$J$74,4,FALSE)","v":"Southern"},{"$f":"VLOOKUP(A45,'Counties and Regions'!$G$3:$J$74,3,FALSE)","v":"Columbia County"},"Physician Services","F"]
[{"$f":"IF(COUNTIF($A$9:A45,A45)<24,A45,A45+1)","v":2},{"$f":"VLOOKUP(A46,'Counties and Regions'!$G$3:$J$74,4,FALSE)","v":"Southern"},{"$f":"VLOOKUP(A46,'Counties and Regions'!$G$3:$J$74,3,FALSE)","v":"Columbia County"},"Physician Services","D"]
[{"$f":"IF(COUNTIF($A$9:A46,A46)<24,A46,A46+1)","v":2},{"$f":"VLOOKUP(A47,'Counties and Regions'!$G$3:$J$74,4,FALSE)","v":"Southern"},{"$f":"VLOOKUP(A47,'Counties and Regions'!$G$3:$J$74,3,FALSE)","v":"Columbia County"},"Physician Services","B"]
[{"$f":"IF(COUNTIF($A$9:A47,A47)<24,A47,A47+1)","v":2},{"$f":"VLOOKUP(A48,'Counties and Regions'!$G$3:$J$74,4,FALSE)","v":"Southern"},{"$f":"VLOOKUP(A48,'Counties and Regions'!$G$3:$J$74,3,FALSE)","v":"Columbia County"},"Physician Services","O"]
[{"$f":"IF(COUNTIF($A$9:A48,A48)<24,A48,A48+1)","v":2},{"$f":"VLOOKUP(A49,'Counties and Regions'!$G$3:$J$74,4,FALSE)","v":"Southern"},{"$f":"VLOOKUP(A49,'Counties and Regions'!$G$3:$J$74,3,FALSE)","v":"Columbia County"},"Other Services","F"]
[{"$f":"IF(COUNTIF($A$9:A49,A49)<24,A49,A49+1)","v":2},{"$f":"VLOOKUP(A50,'Counties and Regions'!$G$3:$J$74,4,FALSE)","v":"Southern"},{"$f":"VLOOKUP(A50,'Counties and Regions'!$G$3:$J$74,3,FALSE)","v":"Columbia County"},"Other Services","D"]
[{"$f":"IF(COUNTIF($A$9:A50,A50)<24,A50,A50+1)","v":2},{"$f":"VLOOKUP(A51,'Counties and Regions'!$G$3:$J$74,4,FALSE)","v":"Southern"},{"$f":"VLOOKUP(A51,'Counties and Regions'!$G$3:$J$74,3,FALSE)","v":"Columbia County"},"Other Services","B"]
[{"$f":"IF(COUNTIF($A$9:A51,A51)<24,A51,A51+1)","v":2},{"$f":"VLOOKUP(A52,'Counties and Regions'!$G$3:$J$74,4,FALSE)","v":"Southern"},{"$f":"VLOOKUP(A52,'Counties and Regions'!$G$3:$J$74,3,FALSE)","v":"Columbia County"},"Other Services","O"]
[{"$f":"IF(COUNTIF($A$9:A52,A52)<24,A52,A52+1)","v":2},{"$f":"VLOOKUP(A53,'Counties and Regions'!$G$3:$J$74,4,FALSE)","v":"Southern"},{"$f":"VLOOKUP(A53,'Counties and Regions'!$G$3:$J$74,3,FALSE)","v":"Columbia County"},"Additional Services","F"]
[{"$f":"IF(COUNTIF($A$9:A53,A53)<24,A53,A53+1)","v":2},{"$f":"VLOOKUP(A54,'Counties and Regions'!$G$3:$J$74,4,FALSE)","v":"Southern"},{"$f":"VLOOKUP(A54,'Counties and Regions'!$G$3:$J$74,3,FALSE)","v":"Columbia County"},"Additional Services","D"]
[{"$f":"IF(COUNTIF($A$9:A54,A54)<24,A54,A54+1)","v":2},{"$f":"VLOOKUP(A55,'Counties and Regions'!$G$3:$J$74,4,FALSE)","v":"Southern"},{"$f":"VLOOKUP(A55,'Counties and Regions'!$G$3:$J$74,3,FALSE)","v":"Columbia County"},"Additional Services","B"]
[{"$f":"IF(COUNTIF($A$9:A55,A55)<24,A55,A55+1)","v":2},{"$f":"VLOOKUP(A56,'Counties and Regions'!$G$3:$J$74,4,FALSE)","v":"Southern"},{"$f":"VLOOKUP(A56,'Counties and Regions'!$G$3:$J$74,3,FALSE)","v":"Columbia County"},"Additional Services","O"]
[{"$f":"IF(COUNTIF($A$9:A56,A56)<24,A56,A56+1)","v":3},{"$f":"VLOOKUP(A57,'Counties and Regions'!$G$3:$J$74,4,FALSE)","v":"Southern"},{"$f":"VLOOKUP(A57,'Counties and Regions'!$G$3:$J$74,3,FALSE)","v":"Crawford County"},"Hospital Inpatient","F"]
[{"$f":"IF(COUNTIF($A$9:A57,A57)<24,A57,A57+1)","v":3},{"$f":"VLOOKUP(A58,'Counties and Regions'!$G$3:$J$74,4,FALSE)","v":"Southern"},{"$f":"VLOOKUP(A58,'Counties and Regions'!$G$3:$J$74,3,FALSE)","v":"Crawford County"},"Hospital Inpatient","D"]
[{"$f":"IF(COUNTIF($A$9:A58,A58)<24,A58,A58+1)","v":3},{"$f":"VLOOKUP(A59,'Counties and Regions'!$G$3:$J$74,4,FALSE)","v":"Southern"},{"$f":"VLOOKUP(A59,'Counties and Regions'!$G$3:$J$74,3,FALSE)","v":"Crawford County"},"Hospital Inpatient","B"]
[{"$f":"IF(COUNTIF($A$9:A59,A59)<24,A59,A59+1)","v":3},{"$f":"VLOOKUP(A60,'Counties and Regions'!$G$3:$J$74,4,FALSE)","v":"Southern"},{"$f":"VLOOKUP(A60,'Counties and Regions'!$G$3:$J$74,3,FALSE)","v":"Crawford County"},"Hospital Inpatient","O"]
[{"$f":"IF(COUNTIF($A$9:A60,A60)<24,A60,A60+1)","v":3},{"$f":"VLOOKUP(A61,'Counties and Regions'!$G$3:$J$74,4,FALSE)","v":"Southern"},{"$f":"VLOOKUP(A61,'Counties and Regions'!$G$3:$J$74,3,FALSE)","v":"Crawford County"},"Hospital Outpatient","F"]
[{"$f":"IF(COUNTIF($A$9:A61,A61)<24,A61,A61+1)","v":3},{"$f":"VLOOKUP(A62,'Counties and Regions'!$G$3:$J$74,4,FALSE)","v":"Southern"},{"$f":"VLOOKUP(A62,'Counties and Regions'!$G$3:$J$74,3,FALSE)","v":"Crawford County"},"Hospital Outpatient","D"]
[{"$f":"IF(COUNTIF($A$9:A62,A62)<24,A62,A62+1)","v":3},{"$f":"VLOOKUP(A63,'Counties and Regions'!$G$3:$J$74,4,FALSE)","v":"Southern"},{"$f":"VLOOKUP(A63,'Counties and Regions'!$G$3:$J$74,3,FALSE)","v":"Crawford County"},"Hospital Outpatient","B"]
[{"$f":"IF(COUNTIF($A$9:A63,A63)<24,A63,A63+1)","v":3},{"$f":"VLOOKUP(A64,'Counties and Regions'!$G$3:$J$74,4,FALSE)","v":"Southern"},{"$f":"VLOOKUP(A64,'Counties and Regions'!$G$3:$J$74,3,FALSE)","v":"Crawford County"},"Hospital Outpatient","O"]
[{"$f":"IF(COUNTIF($A$9:A64,A64)<24,A64,A64+1)","v":3},{"$f":"VLOOKUP(A65,'Counties and Regions'!$G$3:$J$74,4,FALSE)","v":"Southern"},{"$f":"VLOOKUP(A65,'Counties and Regions'!$G$3:$J$74,3,FALSE)","v":"Crawford County"},"Other Facility","F"]
[{"$f":"IF(COUNTIF($A$9:A65,A65)<24,A65,A65+1)","v":3},{"$f":"VLOOKUP(A66,'Counties and Regions'!$G$3:$J$74,4,FALSE)","v":"Southern"},{"$f":"VLOOKUP(A66,'Counties and Regions'!$G$3:$J$74,3,FALSE)","v":"Crawford County"},"Other Facility","D"]
[{"$f":"IF(COUNTIF($A$9:A66,A66)<24,A66,A66+1)","v":3},{"$f":"VLOOKUP(A67,'Counties and Regions'!$G$3:$J$74,4,FALSE)","v":"Southern"},{"$f":"VLOOKUP(A67,'Counties and Regions'!$G$3:$J$74,3,FALSE)","v":"Crawford County"},"Other Facility","B"]
[{"$f":"IF(COUNTIF($A$9:A67,A67)<24,A67,A67+1)","v":3},{"$f":"VLOOKUP(A68,'Counties and Regions'!$G$3:$J$74,4,FALSE)","v":"Southern"},{"$f":"VLOOKUP(A68,'Counties and Regions'!$G$3:$J$74,3,FALSE)","v":"Crawford County"},"Other Facility","O"]
[{"$f":"IF(COUNTIF($A$9:A68,A68)<24,A68,A68+1)","v":3},{"$f":"VLOOKUP(A69,'Counties and Regions'!$G$3:$J$74,4,FALSE)","v":"Southern"},{"$f":"VLOOKUP(A69,'Counties and Regions'!$G$3:$J$74,3,FALSE)","v":"Crawford County"},"Physician Services","F"]
[{"$f":"IF(COUNTIF($A$9:A69,A69)<24,A69,A69+1)","v":3},{"$f":"VLOOKUP(A70,'Counties and Regions'!$G$3:$J$74,4,FALSE)","v":"Southern"},{"$f":"VLOOKUP(A70,'Counties and Regions'!$G$3:$J$74,3,FALSE)","v":"Crawford County"},"Physician Services","D"]
[{"$f":"IF(COUNTIF($A$9:A70,A70)<24,A70,A70+1)","v":3},{"$f":"VLOOKUP(A71,'Counties and Regions'!$G$3:$J$74,4,FALSE)","v":"Southern"},{"$f":"VLOOKUP(A71,'Counties and Regions'!$G$3:$J$74,3,FALSE)","v":"Crawford County"},"Physician Services","B"]
[{"$f":"IF(COUNTIF($A$9:A71,A71)<24,A71,A71+1)","v":3},{"$f":"VLOOKUP(A72,'Counties and Regions'!$G$3:$J$74,4,FALSE)","v":"Southern"},{"$f":"VLOOKUP(A72,'Counties and Regions'!$G$3:$J$74,3,FALSE)","v":"Crawford County"},"Physician Services","O"]
[{"$f":"IF(COUNTIF($A$9:A72,A72)<24,A72,A72+1)","v":3},{"$f":"VLOOKUP(A73,'Counties and Regions'!$G$3:$J$74,4,FALSE)","v":"Southern"},{"$f":"VLOOKUP(A73,'Counties and Regions'!$G$3:$J$74,3,FALSE)","v":"Crawford County"},"Other Services","F"]
[{"$f":"IF(COUNTIF($A$9:A73,A73)<24,A73,A73+1)","v":3},{"$f":"VLOOKUP(A74,'Counties and Regions'!$G$3:$J$74,4,FALSE)","v":"Southern"},{"$f":"VLOOKUP(A74,'Counties and Regions'!$G$3:$J$74,3,FALSE)","v":"Crawford County"},"Other Services","D"]
[{"$f":"IF(COUNTIF($A$9:A74,A74)<24,A74,A74+1)","v":3},{"$f":"VLOOKUP(A75,'Counties and Regions'!$G$3:$J$74,4,FALSE)","v":"Southern"},{"$f":"VLOOKUP(A75,'Counties and Regions'!$G$3:$J$74,3,FALSE)","v":"Crawford County"},"Other Services","B"]
[{"$f":"IF(COUNTIF($A$9:A75,A75)<24,A75,A75+1)","v":3},{"$f":"VLOOKUP(A76,'Counties and Regions'!$G$3:$J$74,4,FALSE)","v":"Southern"},{"$f":"VLOOKUP(A76,'Counties and Regions'!$G$3:$J$74,3,FALSE)","v":"Crawford County"},"Other Services","O"]
[{"$f":"IF(COUNTIF($A$9:A76,A76)<24,A76,A76+1)","v":3},{"$f":"VLOOKUP(A77,'Counties and Regions'!$G$3:$J$74,4,FALSE)","v":"Southern"},{"$f":"VLOOKUP(A77,'Counties and Regions'!$G$3:$J$74,3,FALSE)","v":"Crawford County"},"Additional Services","F"]
[{"$f":"IF(COUNTIF($A$9:A77,A77)<24,A77,A77+1)","v":3},{"$f":"VLOOKUP(A78,'Counties and Regions'!$G$3:$J$74,4,FALSE)","v":"Southern"},{"$f":"VLOOKUP(A78,'Counties and Regions'!$G$3:$J$74,3,FALSE)","v":"Crawford County"},"Additional Services","D"]
[{"$f":"IF(COUNTIF($A$9:A78,A78)<24,A78,A78+1)","v":3},{"$f":"VLOOKUP(A79,'Counties and Regions'!$G$3:$J$74,4,FALSE)","v":"Southern"},{"$f":"VLOOKUP(A79,'Counties and Regions'!$G$3:$J$74,3,FALSE)","v":"Crawford County"},"Additional Services","B"]
[{"$f":"IF(COUNTIF($A$9:A79,A79)<24,A79,A79+1)","v":3},{"$f":"VLOOKUP(A80,'Counties and Regions'!$G$3:$J$74,4,FALSE)","v":"Southern"},{"$f":"VLOOKUP(A80,'Counties and Regions'!$G$3:$J$74,3,FALSE)","v":"Crawford County"},"Additional Services","O"]
[{"$f":"IF(COUNTIF($A$9:A80,A80)<24,A80,A80+1)","v":4},{"$f":"VLOOKUP(A81,'Counties and Regions'!$G$3:$J$74,4,FALSE)","v":"Southern"},{"$f":"VLOOKUP(A81,'Counties and Regions'!$G$3:$J$74,3,FALSE)","v":"Dane County"},"Hospital Inpatient","F"]
[{"$f":"IF(COUNTIF($A$9:A81,A81)<24,A81,A81+1)","v":4},{"$f":"VLOOKUP(A82,'Counties and Regions'!$G$3:$J$74,4,FALSE)","v":"Southern"},{"$f":"VLOOKUP(A82,'Counties and Regions'!$G$3:$J$74,3,FALSE)","v":"Dane County"},"Hospital Inpatient","D"]
[{"$f":"IF(COUNTIF($A$9:A82,A82)<24,A82,A82+1)","v":4},{"$f":"VLOOKUP(A83,'Counties and Regions'!$G$3:$J$74,4,FALSE)","v":"Southern"},{"$f":"VLOOKUP(A83,'Counties and Regions'!$G$3:$J$74,3,FALSE)","v":"Dane County"},"Hospital Inpatient","B"]
[{"$f":"IF(COUNTIF($A$9:A83,A83)<24,A83,A83+1)","v":4},{"$f":"VLOOKUP(A84,'Counties and Regions'!$G$3:$J$74,4,FALSE)","v":"Southern"},{"$f":"VLOOKUP(A84,'Counties and Regions'!$G$3:$J$74,3,FALSE)","v":"Dane County"},"Hospital Inpatient","O"]
[{"$f":"IF(COUNTIF($A$9:A84,A84)<24,A84,A84+1)","v":4},{"$f":"VLOOKUP(A85,'Counties and Regions'!$G$3:$J$74,4,FALSE)","v":"Southern"},{"$f":"VLOOKUP(A85,'Counties and Regions'!$G$3:$J$74,3,FALSE)","v":"Dane County"},"Hospital Outpatient","F"]
[{"$f":"IF(COUNTIF($A$9:A85,A85)<24,A85,A85+1)","v":4},{"$f":"VLOOKUP(A86,'Counties and Regions'!$G$3:$J$74,4,FALSE)","v":"Southern"},{"$f":"VLOOKUP(A86,'Counties and Regions'!$G$3:$J$74,3,FALSE)","v":"Dane County"},"Hospital Outpatient","D"]
[{"$f":"IF(COUNTIF($A$9:A86,A86)<24,A86,A86+1)","v":4},{"$f":"VLOOKUP(A87,'Counties and Regions'!$G$3:$J$74,4,FALSE)","v":"Southern"},{"$f":"VLOOKUP(A87,'Counties and Regions'!$G$3:$J$74,3,FALSE)","v":"Dane County"},"Hospital Outpatient","B"]
[{"$f":"IF(COUNTIF($A$9:A87,A87)<24,A87,A87+1)","v":4},{"$f":"VLOOKUP(A88,'Counties and Regions'!$G$3:$J$74,4,FALSE)","v":"Southern"},{"$f":"VLOOKUP(A88,'Counties and Regions'!$G$3:$J$74,3,FALSE)","v":"Dane County"},"Hospital Outpatient","O"]
[{"$f":"IF(COUNTIF($A$9:A88,A88)<24,A88,A88+1)","v":4},{"$f":"VLOOKUP(A89,'Counties and Regions'!$G$3:$J$74,4,FALSE)","v":"Southern"},{"$f":"VLOOKUP(A89,'Counties and Regions'!$G$3:$J$74,3,FALSE)","v":"Dane County"},"Other Facility","F"]
[{"$f":"IF(COUNTIF($A$9:A89,A89)<24,A89,A89+1)","v":4},{"$f":"VLOOKUP(A90,'Counties and Regions'!$G$3:$J$74,4,FALSE)","v":"Southern"},{"$f":"VLOOKUP(A90,'Counties and Regions'!$G$3:$J$74,3,FALSE)","v":"Dane County"},"Other Facility","D"]
[{"$f":"IF(COUNTIF($A$9:A90,A90)<24,A90,A90+1)","v":4},{"$f":"VLOOKUP(A91,'Counties and Regions'!$G$3:$J$74,4,FALSE)","v":"Southern"},{"$f":"VLOOKUP(A91,'Counties and Regions'!$G$3:$J$74,3,FALSE)","v":"Dane County"},"Other Facility","B"]
[{"$f":"IF(COUNTIF($A$9:A91,A91)<24,A91,A91+1)","v":4},{"$f":"VLOOKUP(A92,'Counties and Regions'!$G$3:$J$74,4,FALSE)","v":"Southern"},{"$f":"VLOOKUP(A92,'Counties and Regions'!$G$3:$J$74,3,FALSE)","v":"Dane County"},"Other Facility","O"]
[{"$f":"IF(COUNTIF($A$9:A92,A92)<24,A92,A92+1)","v":4},{"$f":"VLOOKUP(A93,'Counties and Regions'!$G$3:$J$74,4,FALSE)","v":"Southern"},{"$f":"VLOOKUP(A93,'Counties and Regions'!$G$3:$J$74,3,FALSE)","v":"Dane County"},"Physician Services","F"]
[{"$f":"IF(COUNTIF($A$9:A93,A93)<24,A93,A93+1)","v":4},{"$f":"VLOOKUP(A94,'Counties and Regions'!$G$3:$J$74,4,FALSE)","v":"Southern"},{"$f":"VLOOKUP(A94,'Counties and Regions'!$G$3:$J$74,3,FALSE)","v":"Dane County"},"Physician Services","D"]
[{"$f":"IF(COUNTIF($A$9:A94,A94)<24,A94,A94+1)","v":4},{"$f":"VLOOKUP(A95,'Counties and Regions'!$G$3:$J$74,4,FALSE)","v":"Southern"},{"$f":"VLOOKUP(A95,'Counties and Regions'!$G$3:$J$74,3,FALSE)","v":"Dane County"},"Physician Services","B"]
[{"$f":"IF(COUNTIF($A$9:A95,A95)<24,A95,A95+1)","v":4},{"$f":"VLOOKUP(A96,'Counties and Regions'!$G$3:$J$74,4,FALSE)","v":"Southern"},{"$f":"VLOOKUP(A96,'Counties and Regions'!$G$3:$J$74,3,FALSE)","v":"Dane County"},"Physician Services","O"]
[{"$f":"IF(COUNTIF($A$9:A96,A96)<24,A96,A96+1)","v":4},{"$f":"VLOOKUP(A97,'Counties and Regions'!$G$3:$J$74,4,FALSE)","v":"Southern"},{"$f":"VLOOKUP(A97,'Counties and Regions'!$G$3:$J$74,3,FALSE)","v":"Dane County"},"Other Services","F"]
[{"$f":"IF(COUNTIF($A$9:A97,A97)<24,A97,A97+1)","v":4},{"$f":"VLOOKUP(A98,'Counties and Regions'!$G$3:$J$74,4,FALSE)","v":"Southern"},{"$f":"VLOOKUP(A98,'Counties and Regions'!$G$3:$J$74,3,FALSE)","v":"Dane County"},"Other Services","D"]
[{"$f":"IF(COUNTIF($A$9:A98,A98)<24,A98,A98+1)","v":4},{"$f":"VLOOKUP(A99,'Counties and Regions'!$G$3:$J$74,4,FALSE)","v":"Southern"},{"$f":"VLOOKUP(A99,'Counties and Regions'!$G$3:$J$74,3,FALSE)","v":"Dane County"},"Other Services","B"]
[{"$f":"IF(COUNTIF($A$9:A99,A99)<24,A99,A99+1)","v":4},{"$f":"VLOOKUP(A100,'Counties and Regions'!$G$3:$J$74,4,FALSE)","v":"Southern"},{"$f":"VLOOKUP(A100,'Counties and Regions'!$G$3:$J$74,3,FALSE)","v":"Dane County"},"Other Services","O"]
[{"$f":"IF(COUNTIF($A$9:A100,A100)<24,A100,A100+1)","v":4},{"$f":"VLOOKUP(A101,'Counties and Regions'!$G$3:$J$74,4,FALSE)","v":"Southern"},{"$f":"VLOOKUP(A101,'Counties and Regions'!$G$3:$J$74,3,FALSE)","v":"Dane County"},"Additional Services","F"]
[{"$f":"IF(COUNTIF($A$9:A101,A101)<24,A101,A101+1)","v":4},{"$f":"VLOOKUP(A102,'Counties and Regions'!$G$3:$J$74,4,FALSE)","v":"Southern"},{"$f":"VLOOKUP(A102,'Counties and Regions'!$G$3:$J$74,3,FALSE)","v":"Dane County"},"Additional Services","D"]
[{"$f":"IF(COUNTIF($A$9:A102,A102)<24,A102,A102+1)","v":4},{"$f":"VLOOKUP(A103,'Counties and Regions'!$G$3:$J$74,4,FALSE)","v":"Southern"},{"$f":"VLOOKUP(A103,'Counties and Regions'!$G$3:$J$74,3,FALSE)","v":"Dane County"},"Additional Services","B"]
[{"$f":"IF(COUNTIF($A$9:A103,A103)<24,A103,A103+1)","v":4},{"$f":"VLOOKUP(A104,'Counties and Regions'!$G$3:$J$74,4,FALSE)","v":"Southern"},{"$f":"VLOOKUP(A104,'Counties and Regions'!$G$3:$J$74,3,FALSE)","v":"Dane County"},"Additional Services","O"]
[{"$f":"IF(COUNTIF($A$9:A104,A104)<24,A104,A104+1)","v":5},{"$f":"VLOOKUP(A105,'Counties and Regions'!$G$3:$J$74,4,FALSE)","v":"Southern"},{"$f":"VLOOKUP(A105,'Counties and Regions'!$G$3:$J$74,3,FALSE)","v":"Dodge County"},"Hospital Inpatient","F"]
[{"$f":"IF(COUNTIF($A$9:A105,A105)<24,A105,A105+1)","v":5},{"$f":"VLOOKUP(A106,'Counties and Regions'!$G$3:$J$74,4,FALSE)","v":"Southern"},{"$f":"VLOOKUP(A106,'Counties and Regions'!$G$3:$J$74,3,FALSE)","v":"Dodge County"},"Hospital Inpatient","D"]
[{"$f":"IF(COUNTIF($A$9:A106,A106)<24,A106,A106+1)","v":5},{"$f":"VLOOKUP(A107,'Counties and Regions'!$G$3:$J$74,4,FALSE)","v":"Southern"},{"$f":"VLOOKUP(A107,'Counties and Regions'!$G$3:$J$74,3,FALSE)","v":"Dodge County"},"Hospital Inpatient","B"]
[{"$f":"IF(COUNTIF($A$9:A107,A107)<24,A107,A107+1)","v":5},{"$f":"VLOOKUP(A108,'Counties and Regions'!$G$3:$J$74,4,FALSE)","v":"Southern"},{"$f":"VLOOKUP(A108,'Counties and Regions'!$G$3:$J$74,3,FALSE)","v":"Dodge County"},"Hospital Inpatient","O"]
[{"$f":"IF(COUNTIF($A$9:A108,A108)<24,A108,A108+1)","v":5},{"$f":"VLOOKUP(A109,'Counties and Regions'!$G$3:$J$74,4,FALSE)","v":"Southern"},{"$f":"VLOOKUP(A109,'Counties and Regions'!$G$3:$J$74,3,FALSE)","v":"Dodge County"},"Hospital Outpatient","F"]
[{"$f":"IF(COUNTIF($A$9:A109,A109)<24,A109,A109+1)","v":5},{"$f":"VLOOKUP(A110,'Counties and Regions'!$G$3:$J$74,4,FALSE)","v":"Southern"},{"$f":"VLOOKUP(A110,'Counties and Regions'!$G$3:$J$74,3,FALSE)","v":"Dodge County"},"Hospital Outpatient","D"]
[{"$f":"IF(COUNTIF($A$9:A110,A110)<24,A110,A110+1)","v":5},{"$f":"VLOOKUP(A111,'Counties and Regions'!$G$3:$J$74,4,FALSE)","v":"Southern"},{"$f":"VLOOKUP(A111,'Counties and Regions'!$G$3:$J$74,3,FALSE)","v":"Dodge County"},"Hospital Outpatient","B"]
[{"$f":"IF(COUNTIF($A$9:A111,A111)<24,A111,A111+1)","v":5},{"$f":"VLOOKUP(A112,'Counties and Regions'!$G$3:$J$74,4,FALSE)","v":"Southern"},{"$f":"VLOOKUP(A112,'Counties and Regions'!$G$3:$J$74,3,FALSE)","v":"Dodge County"},"Hospital Outpatient","O"]
[{"$f":"IF(COUNTIF($A$9:A112,A112)<24,A112,A112+1)","v":5},{"$f":"VLOOKUP(A113,'Counties and Regions'!$G$3:$J$74,4,FALSE)","v":"Southern"},{"$f":"VLOOKUP(A113,'Counties and Regions'!$G$3:$J$74,3,FALSE)","v":"Dodge County"},"Other Facility","F"]
[{"$f":"IF(COUNTIF($A$9:A113,A113)<24,A113,A113+1)","v":5},{"$f":"VLOOKUP(A114,'Counties and Regions'!$G$3:$J$74,4,FALSE)","v":"Southern"},{"$f":"VLOOKUP(A114,'Counties and Regions'!$G$3:$J$74,3,FALSE)","v":"Dodge County"},"Other Facility","D"]
[{"$f":"IF(COUNTIF($A$9:A114,A114)<24,A114,A114+1)","v":5},{"$f":"VLOOKUP(A115,'Counties and Regions'!$G$3:$J$74,4,FALSE)","v":"Southern"},{"$f":"VLOOKUP(A115,'Counties and Regions'!$G$3:$J$74,3,FALSE)","v":"Dodge County"},"Other Facility","B"]
[{"$f":"IF(COUNTIF($A$9:A115,A115)<24,A115,A115+1)","v":5},{"$f":"VLOOKUP(A116,'Counties and Regions'!$G$3:$J$74,4,FALSE)","v":"Southern"},{"$f":"VLOOKUP(A116,'Counties and Regions'!$G$3:$J$74,3,FALSE)","v":"Dodge County"},"Other Facility","O"]
[{"$f":"IF(COUNTIF($A$9:A116,A116)<24,A116,A116+1)","v":5},{"$f":"VLOOKUP(A117,'Counties and Regions'!$G$3:$J$74,4,FALSE)","v":"Southern"},{"$f":"VLOOKUP(A117,'Counties and Regions'!$G$3:$J$74,3,FALSE)","v":"Dodge County"},"Physician Services","F"]
[{"$f":"IF(COUNTIF($A$9:A117,A117)<24,A117,A117+1)","v":5},{"$f":"VLOOKUP(A118,'Counties and Regions'!$G$3:$J$74,4,FALSE)","v":"Southern"},{"$f":"VLOOKUP(A118,'Counties and Regions'!$G$3:$J$74,3,FALSE)","v":"Dodge County"},"Physician Services","D"]
[{"$f":"IF(COUNTIF($A$9:A118,A118)<24,A118,A118+1)","v":5},{"$f":"VLOOKUP(A119,'Counties and Regions'!$G$3:$J$74,4,FALSE)","v":"Southern"},{"$f":"VLOOKUP(A119,'Counties and Regions'!$G$3:$J$74,3,FALSE)","v":"Dodge County"},"Physician Services","B"]
[{"$f":"IF(COUNTIF($A$9:A119,A119)<24,A119,A119+1)","v":5},{"$f":"VLOOKUP(A120,'Counties and Regions'!$G$3:$J$74,4,FALSE)","v":"Southern"},{"$f":"VLOOKUP(A120,'Counties and Regions'!$G$3:$J$74,3,FALSE)","v":"Dodge County"},"Physician Services","O"]
[{"$f":"IF(COUNTIF($A$9:A120,A120)<24,A120,A120+1)","v":5},{"$f":"VLOOKUP(A121,'Counties and Regions'!$G$3:$J$74,4,FALSE)","v":"Southern"},{"$f":"VLOOKUP(A121,'Counties and Regions'!$G$3:$J$74,3,FALSE)","v":"Dodge County"},"Other Services","F"]
[{"$f":"IF(COUNTIF($A$9:A121,A121)<24,A121,A121+1)","v":5},{"$f":"VLOOKUP(A122,'Counties and Regions'!$G$3:$J$74,4,FALSE)","v":"Southern"},{"$f":"VLOOKUP(A122,'Counties and Regions'!$G$3:$J$74,3,FALSE)","v":"Dodge County"},"Other Services","D"]
[{"$f":"IF(COUNTIF($A$9:A122,A122)<24,A122,A122+1)","v":5},{"$f":"VLOOKUP(A123,'Counties and Regions'!$G$3:$J$74,4,FALSE)","v":"Southern"},{"$f":"VLOOKUP(A123,'Counties and Regions'!$G$3:$J$74,3,FALSE)","v":"Dodge County"},"Other Services","B"]
[{"$f":"IF(COUNTIF($A$9:A123,A123)<24,A123,A123+1)","v":5},{"$f":"VLOOKUP(A124,'Counties and Regions'!$G$3:$J$74,4,FALSE)","v":"Southern"},{"$f":"VLOOKUP(A124,'Counties and Regions'!$G$3:$J$74,3,FALSE)","v":"Dodge County"},"Other Services","O"]
[{"$f":"IF(COUNTIF($A$9:A124,A124)<24,A124,A124+1)","v":5},{"$f":"VLOOKUP(A125,'Counties and Regions'!$G$3:$J$74,4,FALSE)","v":"Southern"},{"$f":"VLOOKUP(A125,'Counties and Regions'!$G$3:$J$74,3,FALSE)","v":"Dodge County"},"Additional Services","F"]
[{"$f":"IF(COUNTIF($A$9:A125,A125)<24,A125,A125+1)","v":5},{"$f":"VLOOKUP(A126,'Counties and Regions'!$G$3:$J$74,4,FALSE)","v":"Southern"},{"$f":"VLOOKUP(A126,'Counties and Regions'!$G$3:$J$74,3,FALSE)","v":"Dodge County"},"Additional Services","D"]
[{"$f":"IF(COUNTIF($A$9:A126,A126)<24,A126,A126+1)","v":5},{"$f":"VLOOKUP(A127,'Counties and Regions'!$G$3:$J$74,4,FALSE)","v":"Southern"},{"$f":"VLOOKUP(A127,'Counties and Regions'!$G$3:$J$74,3,FALSE)","v":"Dodge County"},"Additional Services","B"]
[{"$f":"IF(COUNTIF($A$9:A127,A127)<24,A127,A127+1)","v":5},{"$f":"VLOOKUP(A128,'Counties and Regions'!$G$3:$J$74,4,FALSE)","v":"Southern"},{"$f":"VLOOKUP(A128,'Counties and Regions'!$G$3:$J$74,3,FALSE)","v":"Dodge County"},"Additional Services","O"]
[{"$f":"IF(COUNTIF($A$9:A128,A128)<24,A128,A128+1)","v":6},{"$f":"VLOOKUP(A129,'Counties and Regions'!$G$3:$J$74,4,FALSE)","v":"Southern"},{"$f":"VLOOKUP(A129,'Counties and Regions'!$G$3:$J$74,3,FALSE)","v":"Grant County"},"Hospital Inpatient","F"]
[{"$f":"IF(COUNTIF($A$9:A129,A129)<24,A129,A129+1)","v":6},{"$f":"VLOOKUP(A130,'Counties and Regions'!$G$3:$J$74,4,FALSE)","v":"Southern"},{"$f":"VLOOKUP(A130,'Counties and Regions'!$G$3:$J$74,3,FALSE)","v":"Grant County"},"Hospital Inpatient","D"]
[{"$f":"IF(COUNTIF($A$9:A130,A130)<24,A130,A130+1)","v":6},{"$f":"VLOOKUP(A131,'Counties and Regions'!$G$3:$J$74,4,FALSE)","v":"Southern"},{"$f":"VLOOKUP(A131,'Counties and Regions'!$G$3:$J$74,3,FALSE)","v":"Grant County"},"Hospital Inpatient","B"]
[{"$f":"IF(COUNTIF($A$9:A131,A131)<24,A131,A131+1)","v":6},{"$f":"VLOOKUP(A132,'Counties and Regions'!$G$3:$J$74,4,FALSE)","v":"Southern"},{"$f":"VLOOKUP(A132,'Counties and Regions'!$G$3:$J$74,3,FALSE)","v":"Grant County"},"Hospital Inpatient","O"]
[{"$f":"IF(COUNTIF($A$9:A132,A132)<24,A132,A132+1)","v":6},{"$f":"VLOOKUP(A133,'Counties and Regions'!$G$3:$J$74,4,FALSE)","v":"Southern"},{"$f":"VLOOKUP(A133,'Counties and Regions'!$G$3:$J$74,3,FALSE)","v":"Grant County"},"Hospital Outpatient","F"]
[{"$f":"IF(COUNTIF($A$9:A133,A133)<24,A133,A133+1)","v":6},{"$f":"VLOOKUP(A134,'Counties and Regions'!$G$3:$J$74,4,FALSE)","v":"Southern"},{"$f":"VLOOKUP(A134,'Counties and Regions'!$G$3:$J$74,3,FALSE)","v":"Grant County"},"Hospital Outpatient","D"]
[{"$f":"IF(COUNTIF($A$9:A134,A134)<24,A134,A134+1)","v":6},{"$f":"VLOOKUP(A135,'Counties and Regions'!$G$3:$J$74,4,FALSE)","v":"Southern"},{"$f":"VLOOKUP(A135,'Counties and Regions'!$G$3:$J$74,3,FALSE)","v":"Grant County"},"Hospital Outpatient","B"]
[{"$f":"IF(COUNTIF($A$9:A135,A135)<24,A135,A135+1)","v":6},{"$f":"VLOOKUP(A136,'Counties and Regions'!$G$3:$J$74,4,FALSE)","v":"Southern"},{"$f":"VLOOKUP(A136,'Counties and Regions'!$G$3:$J$74,3,FALSE)","v":"Grant County"},"Hospital Outpatient","O"]
[{"$f":"IF(COUNTIF($A$9:A136,A136)<24,A136,A136+1)","v":6},{"$f":"VLOOKUP(A137,'Counties and Regions'!$G$3:$J$74,4,FALSE)","v":"Southern"},{"$f":"VLOOKUP(A137,'Counties and Regions'!$G$3:$J$74,3,FALSE)","v":"Grant County"},"Other Facility","F"]
[{"$f":"IF(COUNTIF($A$9:A137,A137)<24,A137,A137+1)","v":6},{"$f":"VLOOKUP(A138,'Counties and Regions'!$G$3:$J$74,4,FALSE)","v":"Southern"},{"$f":"VLOOKUP(A138,'Counties and Regions'!$G$3:$J$74,3,FALSE)","v":"Grant County"},"Other Facility","D"]
[{"$f":"IF(COUNTIF($A$9:A138,A138)<24,A138,A138+1)","v":6},{"$f":"VLOOKUP(A139,'Counties and Regions'!$G$3:$J$74,4,FALSE)","v":"Southern"},{"$f":"VLOOKUP(A139,'Counties and Regions'!$G$3:$J$74,3,FALSE)","v":"Grant County"},"Other Facility","B"]
[{"$f":"IF(COUNTIF($A$9:A139,A139)<24,A139,A139+1)","v":6},{"$f":"VLOOKUP(A140,'Counties and Regions'!$G$3:$J$74,4,FALSE)","v":"Southern"},{"$f":"VLOOKUP(A140,'Counties and Regions'!$G$3:$J$74,3,FALSE)","v":"Grant County"},"Other Facility","O"]
[{"$f":"IF(COUNTIF($A$9:A140,A140)<24,A140,A140+1)","v":6},{"$f":"VLOOKUP(A141,'Counties and Regions'!$G$3:$J$74,4,FALSE)","v":"Southern"},{"$f":"VLOOKUP(A141,'Counties and Regions'!$G$3:$J$74,3,FALSE)","v":"Grant County"},"Physician Services","F"]
[{"$f":"IF(COUNTIF($A$9:A141,A141)<24,A141,A141+1)","v":6},{"$f":"VLOOKUP(A142,'Counties and Regions'!$G$3:$J$74,4,FALSE)","v":"Southern"},{"$f":"VLOOKUP(A142,'Counties and Regions'!$G$3:$J$74,3,FALSE)","v":"Grant County"},"Physician Services","D"]
[{"$f":"IF(COUNTIF($A$9:A142,A142)<24,A142,A142+1)","v":6},{"$f":"VLOOKUP(A143,'Counties and Regions'!$G$3:$J$74,4,FALSE)","v":"Southern"},{"$f":"VLOOKUP(A143,'Counties and Regions'!$G$3:$J$74,3,FALSE)","v":"Grant County"},"Physician Services","B"]
[{"$f":"IF(COUNTIF($A$9:A143,A143)<24,A143,A143+1)","v":6},{"$f":"VLOOKUP(A144,'Counties and Regions'!$G$3:$J$74,4,FALSE)","v":"Southern"},{"$f":"VLOOKUP(A144,'Counties and Regions'!$G$3:$J$74,3,FALSE)","v":"Grant County"},"Physician Services","O"]
[{"$f":"IF(COUNTIF($A$9:A144,A144)<24,A144,A144+1)","v":6},{"$f":"VLOOKUP(A145,'Counties and Regions'!$G$3:$J$74,4,FALSE)","v":"Southern"},{"$f":"VLOOKUP(A145,'Counties and Regions'!$G$3:$J$74,3,FALSE)","v":"Grant County"},"Other Services","F"]
[{"$f":"IF(COUNTIF($A$9:A145,A145)<24,A145,A145+1)","v":6},{"$f":"VLOOKUP(A146,'Counties and Regions'!$G$3:$J$74,4,FALSE)","v":"Southern"},{"$f":"VLOOKUP(A146,'Counties and Regions'!$G$3:$J$74,3,FALSE)","v":"Grant County"},"Other Services","D"]
[{"$f":"IF(COUNTIF($A$9:A146,A146)<24,A146,A146+1)","v":6},{"$f":"VLOOKUP(A147,'Counties and Regions'!$G$3:$J$74,4,FALSE)","v":"Southern"},{"$f":"VLOOKUP(A147,'Counties and Regions'!$G$3:$J$74,3,FALSE)","v":"Grant County"},"Other Services","B"]
[{"$f":"IF(COUNTIF($A$9:A147,A147)<24,A147,A147+1)","v":6},{"$f":"VLOOKUP(A148,'Counties and Regions'!$G$3:$J$74,4,FALSE)","v":"Southern"},{"$f":"VLOOKUP(A148,'Counties and Regions'!$G$3:$J$74,3,FALSE)","v":"Grant County"},"Other Services","O"]
[{"$f":"IF(COUNTIF($A$9:A148,A148)<24,A148,A148+1)","v":6},{"$f":"VLOOKUP(A149,'Counties and Regions'!$G$3:$J$74,4,FALSE)","v":"Southern"},{"$f":"VLOOKUP(A149,'Counties and Regions'!$G$3:$J$74,3,FALSE)","v":"Grant County"},"Additional Services","F"]
[{"$f":"IF(COUNTIF($A$9:A149,A149)<24,A149,A149+1)","v":6},{"$f":"VLOOKUP(A150,'Counties and Regions'!$G$3:$J$74,4,FALSE)","v":"Southern"},{"$f":"VLOOKUP(A150,'Counties and Regions'!$G$3:$J$74,3,FALSE)","v":"Grant County"},"Additional Services","D"]
[{"$f":"IF(COUNTIF($A$9:A150,A150)<24,A150,A150+1)","v":6},{"$f":"VLOOKUP(A151,'Counties and Regions'!$G$3:$J$74,4,FALSE)","v":"Southern"},{"$f":"VLOOKUP(A151,'Counties and Regions'!$G$3:$J$74,3,FALSE)","v":"Grant County"},"Additional Services","B"]
[{"$f":"IF(COUNTIF($A$9:A151,A151)<24,A151,A151+1)","v":6},{"$f":"VLOOKUP(A152,'Counties and Regions'!$G$3:$J$74,4,FALSE)","v":"Southern"},{"$f":"VLOOKUP(A152,'Counties and Regions'!$G$3:$J$74,3,FALSE)","v":"Grant County"},"Additional Services","O"]
[{"$f":"IF(COUNTIF($A$9:A152,A152)<24,A152,A152+1)","v":7},{"$f":"VLOOKUP(A153,'Counties and Regions'!$G$3:$J$74,4,FALSE)","v":"Southern"},{"$f":"VLOOKUP(A153,'Counties and Regions'!$G$3:$J$74,3,FALSE)","v":"Green County"},"Hospital Inpatient","F"]
[{"$f":"IF(COUNTIF($A$9:A153,A153)<24,A153,A153+1)","v":7},{"$f":"VLOOKUP(A154,'Counties and Regions'!$G$3:$J$74,4,FALSE)","v":"Southern"},{"$f":"VLOOKUP(A154,'Counties and Regions'!$G$3:$J$74,3,FALSE)","v":"Green County"},"Hospital Inpatient","D"]
[{"$f":"IF(COUNTIF($A$9:A154,A154)<24,A154,A154+1)","v":7},{"$f":"VLOOKUP(A155,'Counties and Regions'!$G$3:$J$74,4,FALSE)","v":"Southern"},{"$f":"VLOOKUP(A155,'Counties and Regions'!$G$3:$J$74,3,FALSE)","v":"Green County"},"Hospital Inpatient","B"]
[{"$f":"IF(COUNTIF($A$9:A155,A155)<24,A155,A155+1)","v":7},{"$f":"VLOOKUP(A156,'Counties and Regions'!$G$3:$J$74,4,FALSE)","v":"Southern"},{"$f":"VLOOKUP(A156,'Counties and Regions'!$G$3:$J$74,3,FALSE)","v":"Green County"},"Hospital Inpatient","O"]
[{"$f":"IF(COUNTIF($A$9:A156,A156)<24,A156,A156+1)","v":7},{"$f":"VLOOKUP(A157,'Counties and Regions'!$G$3:$J$74,4,FALSE)","v":"Southern"},{"$f":"VLOOKUP(A157,'Counties and Regions'!$G$3:$J$74,3,FALSE)","v":"Green County"},"Hospital Outpatient","F"]
[{"$f":"IF(COUNTIF($A$9:A157,A157)<24,A157,A157+1)","v":7},{"$f":"VLOOKUP(A158,'Counties and Regions'!$G$3:$J$74,4,FALSE)","v":"Southern"},{"$f":"VLOOKUP(A158,'Counties and Regions'!$G$3:$J$74,3,FALSE)","v":"Green County"},"Hospital Outpatient","D"]
[{"$f":"IF(COUNTIF($A$9:A158,A158)<24,A158,A158+1)","v":7},{"$f":"VLOOKUP(A159,'Counties and Regions'!$G$3:$J$74,4,FALSE)","v":"Southern"},{"$f":"VLOOKUP(A159,'Counties and Regions'!$G$3:$J$74,3,FALSE)","v":"Green County"},"Hospital Outpatient","B"]
[{"$f":"IF(COUNTIF($A$9:A159,A159)<24,A159,A159+1)","v":7},{"$f":"VLOOKUP(A160,'Counties and Regions'!$G$3:$J$74,4,FALSE)","v":"Southern"},{"$f":"VLOOKUP(A160,'Counties and Regions'!$G$3:$J$74,3,FALSE)","v":"Green County"},"Hospital Outpatient","O"]
[{"$f":"IF(COUNTIF($A$9:A160,A160)<24,A160,A160+1)","v":7},{"$f":"VLOOKUP(A161,'Counties and Regions'!$G$3:$J$74,4,FALSE)","v":"Southern"},{"$f":"VLOOKUP(A161,'Counties and Regions'!$G$3:$J$74,3,FALSE)","v":"Green County"},"Other Facility","F"]
[{"$f":"IF(COUNTIF($A$9:A161,A161)<24,A161,A161+1)","v":7},{"$f":"VLOOKUP(A162,'Counties and Regions'!$G$3:$J$74,4,FALSE)","v":"Southern"},{"$f":"VLOOKUP(A162,'Counties and Regions'!$G$3:$J$74,3,FALSE)","v":"Green County"},"Other Facility","D"]
[{"$f":"IF(COUNTIF($A$9:A162,A162)<24,A162,A162+1)","v":7},{"$f":"VLOOKUP(A163,'Counties and Regions'!$G$3:$J$74,4,FALSE)","v":"Southern"},{"$f":"VLOOKUP(A163,'Counties and Regions'!$G$3:$J$74,3,FALSE)","v":"Green County"},"Other Facility","B"]
[{"$f":"IF(COUNTIF($A$9:A163,A163)<24,A163,A163+1)","v":7},{"$f":"VLOOKUP(A164,'Counties and Regions'!$G$3:$J$74,4,FALSE)","v":"Southern"},{"$f":"VLOOKUP(A164,'Counties and Regions'!$G$3:$J$74,3,FALSE)","v":"Green County"},"Other Facility","O"]
[{"$f":"IF(COUNTIF($A$9:A164,A164)<24,A164,A164+1)","v":7},{"$f":"VLOOKUP(A165,'Counties and Regions'!$G$3:$J$74,4,FALSE)","v":"Southern"},{"$f":"VLOOKUP(A165,'Counties and Regions'!$G$3:$J$74,3,FALSE)","v":"Green County"},"Physician Services","F"]
[{"$f":"IF(COUNTIF($A$9:A165,A165)<24,A165,A165+1)","v":7},{"$f":"VLOOKUP(A166,'Counties and Regions'!$G$3:$J$74,4,FALSE)","v":"Southern"},{"$f":"VLOOKUP(A166,'Counties and Regions'!$G$3:$J$74,3,FALSE)","v":"Green County"},"Physician Services","D"]
[{"$f":"IF(COUNTIF($A$9:A166,A166)<24,A166,A166+1)","v":7},{"$f":"VLOOKUP(A167,'Counties and Regions'!$G$3:$J$74,4,FALSE)","v":"Southern"},{"$f":"VLOOKUP(A167,'Counties and Regions'!$G$3:$J$74,3,FALSE)","v":"Green County"},"Physician Services","B"]
[{"$f":"IF(COUNTIF($A$9:A167,A167)<24,A167,A167+1)","v":7},{"$f":"VLOOKUP(A168,'Counties and Regions'!$G$3:$J$74,4,FALSE)","v":"Southern"},{"$f":"VLOOKUP(A168,'Counties and Regions'!$G$3:$J$74,3,FALSE)","v":"Green County"},"Physician Services","O"]
[{"$f":"IF(COUNTIF($A$9:A168,A168)<24,A168,A168+1)","v":7},{"$f":"VLOOKUP(A169,'Counties and Regions'!$G$3:$J$74,4,FALSE)","v":"Southern"},{"$f":"VLOOKUP(A169,'Counties and Regions'!$G$3:$J$74,3,FALSE)","v":"Green County"},"Other Services","F"]
[{"$f":"IF(COUNTIF($A$9:A169,A169)<24,A169,A169+1)","v":7},{"$f":"VLOOKUP(A170,'Counties and Regions'!$G$3:$J$74,4,FALSE)","v":"Southern"},{"$f":"VLOOKUP(A170,'Counties and Regions'!$G$3:$J$74,3,FALSE)","v":"Green County"},"Other Services","D"]
[{"$f":"IF(COUNTIF($A$9:A170,A170)<24,A170,A170+1)","v":7},{"$f":"VLOOKUP(A171,'Counties and Regions'!$G$3:$J$74,4,FALSE)","v":"Southern"},{"$f":"VLOOKUP(A171,'Counties and Regions'!$G$3:$J$74,3,FALSE)","v":"Green County"},"Other Services","B"]
[{"$f":"IF(COUNTIF($A$9:A171,A171)<24,A171,A171+1)","v":7},{"$f":"VLOOKUP(A172,'Counties and Regions'!$G$3:$J$74,4,FALSE)","v":"Southern"},{"$f":"VLOOKUP(A172,'Counties and Regions'!$G$3:$J$74,3,FALSE)","v":"Green County"},"Other Services","O"]
[{"$f":"IF(COUNTIF($A$9:A172,A172)<24,A172,A172+1)","v":7},{"$f":"VLOOKUP(A173,'Counties and Regions'!$G$3:$J$74,4,FALSE)","v":"Southern"},{"$f":"VLOOKUP(A173,'Counties and Regions'!$G$3:$J$74,3,FALSE)","v":"Green County"},"Additional Services","F"]
[{"$f":"IF(COUNTIF($A$9:A173,A173)<24,A173,A173+1)","v":7},{"$f":"VLOOKUP(A174,'Counties and Regions'!$G$3:$J$74,4,FALSE)","v":"Southern"},{"$f":"VLOOKUP(A174,'Counties and Regions'!$G$3:$J$74,3,FALSE)","v":"Green County"},"Additional Services","D"]
[{"$f":"IF(COUNTIF($A$9:A174,A174)<24,A174,A174+1)","v":7},{"$f":"VLOOKUP(A175,'Counties and Regions'!$G$3:$J$74,4,FALSE)","v":"Southern"},{"$f":"VLOOKUP(A175,'Counties and Regions'!$G$3:$J$74,3,FALSE)","v":"Green County"},"Additional Services","B"]
[{"$f":"IF(COUNTIF($A$9:A175,A175)<24,A175,A175+1)","v":7},{"$f":"VLOOKUP(A176,'Counties and Regions'!$G$3:$J$74,4,FALSE)","v":"Southern"},{"$f":"VLOOKUP(A176,'Counties and Regions'!$G$3:$J$74,3,FALSE)","v":"Green County"},"Additional Services","O"]
[{"$f":"IF(COUNTIF($A$9:A176,A176)<24,A176,A176+1)","v":8},{"$f":"VLOOKUP(A177,'Counties and Regions'!$G$3:$J$74,4,FALSE)","v":"Southern"},{"$f":"VLOOKUP(A177,'Counties and Regions'!$G$3:$J$74,3,FALSE)","v":"Iowa County"},"Hospital Inpatient","F"]
[{"$f":"IF(COUNTIF($A$9:A177,A177)<24,A177,A177+1)","v":8},{"$f":"VLOOKUP(A178,'Counties and Regions'!$G$3:$J$74,4,FALSE)","v":"Southern"},{"$f":"VLOOKUP(A178,'Counties and Regions'!$G$3:$J$74,3,FALSE)","v":"Iowa County"},"Hospital Inpatient","D"]
[{"$f":"IF(COUNTIF($A$9:A178,A178)<24,A178,A178+1)","v":8},{"$f":"VLOOKUP(A179,'Counties and Regions'!$G$3:$J$74,4,FALSE)","v":"Southern"},{"$f":"VLOOKUP(A179,'Counties and Regions'!$G$3:$J$74,3,FALSE)","v":"Iowa County"},"Hospital Inpatient","B"]
[{"$f":"IF(COUNTIF($A$9:A179,A179)<24,A179,A179+1)","v":8},{"$f":"VLOOKUP(A180,'Counties and Regions'!$G$3:$J$74,4,FALSE)","v":"Southern"},{"$f":"VLOOKUP(A180,'Counties and Regions'!$G$3:$J$74,3,FALSE)","v":"Iowa County"},"Hospital Inpatient","O"]
[{"$f":"IF(COUNTIF($A$9:A180,A180)<24,A180,A180+1)","v":8},{"$f":"VLOOKUP(A181,'Counties and Regions'!$G$3:$J$74,4,FALSE)","v":"Southern"},{"$f":"VLOOKUP(A181,'Counties and Regions'!$G$3:$J$74,3,FALSE)","v":"Iowa County"},"Hospital Outpatient","F"]
[{"$f":"IF(COUNTIF($A$9:A181,A181)<24,A181,A181+1)","v":8},{"$f":"VLOOKUP(A182,'Counties and Regions'!$G$3:$J$74,4,FALSE)","v":"Southern"},{"$f":"VLOOKUP(A182,'Counties and Regions'!$G$3:$J$74,3,FALSE)","v":"Iowa County"},"Hospital Outpatient","D"]
[{"$f":"IF(COUNTIF($A$9:A182,A182)<24,A182,A182+1)","v":8},{"$f":"VLOOKUP(A183,'Counties and Regions'!$G$3:$J$74,4,FALSE)","v":"Southern"},{"$f":"VLOOKUP(A183,'Counties and Regions'!$G$3:$J$74,3,FALSE)","v":"Iowa County"},"Hospital Outpatient","B"]
[{"$f":"IF(COUNTIF($A$9:A183,A183)<24,A183,A183+1)","v":8},{"$f":"VLOOKUP(A184,'Counties and Regions'!$G$3:$J$74,4,FALSE)","v":"Southern"},{"$f":"VLOOKUP(A184,'Counties and Regions'!$G$3:$J$74,3,FALSE)","v":"Iowa County"},"Hospital Outpatient","O"]
[{"$f":"IF(COUNTIF($A$9:A184,A184)<24,A184,A184+1)","v":8},{"$f":"VLOOKUP(A185,'Counties and Regions'!$G$3:$J$74,4,FALSE)","v":"Southern"},{"$f":"VLOOKUP(A185,'Counties and Regions'!$G$3:$J$74,3,FALSE)","v":"Iowa County"},"Other Facility","F"]
[{"$f":"IF(COUNTIF($A$9:A185,A185)<24,A185,A185+1)","v":8},{"$f":"VLOOKUP(A186,'Counties and Regions'!$G$3:$J$74,4,FALSE)","v":"Southern"},{"$f":"VLOOKUP(A186,'Counties and Regions'!$G$3:$J$74,3,FALSE)","v":"Iowa County"},"Other Facility","D"]
[{"$f":"IF(COUNTIF($A$9:A186,A186)<24,A186,A186+1)","v":8},{"$f":"VLOOKUP(A187,'Counties and Regions'!$G$3:$J$74,4,FALSE)","v":"Southern"},{"$f":"VLOOKUP(A187,'Counties and Regions'!$G$3:$J$74,3,FALSE)","v":"Iowa County"},"Other Facility","B"]
[{"$f":"IF(COUNTIF($A$9:A187,A187)<24,A187,A187+1)","v":8},{"$f":"VLOOKUP(A188,'Counties and Regions'!$G$3:$J$74,4,FALSE)","v":"Southern"},{"$f":"VLOOKUP(A188,'Counties and Regions'!$G$3:$J$74,3,FALSE)","v":"Iowa County"},"Other Facility","O"]
[{"$f":"IF(COUNTIF($A$9:A188,A188)<24,A188,A188+1)","v":8},{"$f":"VLOOKUP(A189,'Counties and Regions'!$G$3:$J$74,4,FALSE)","v":"Southern"},{"$f":"VLOOKUP(A189,'Counties and Regions'!$G$3:$J$74,3,FALSE)","v":"Iowa County"},"Physician Services","F"]
[{"$f":"IF(COUNTIF($A$9:A189,A189)<24,A189,A189+1)","v":8},{"$f":"VLOOKUP(A190,'Counties and Regions'!$G$3:$J$74,4,FALSE)","v":"Southern"},{"$f":"VLOOKUP(A190,'Counties and Regions'!$G$3:$J$74,3,FALSE)","v":"Iowa County"},"Physician Services","D"]
[{"$f":"IF(COUNTIF($A$9:A190,A190)<24,A190,A190+1)","v":8},{"$f":"VLOOKUP(A191,'Counties and Regions'!$G$3:$J$74,4,FALSE)","v":"Southern"},{"$f":"VLOOKUP(A191,'Counties and Regions'!$G$3:$J$74,3,FALSE)","v":"Iowa County"},"Physician Services","B"]
[{"$f":"IF(COUNTIF($A$9:A191,A191)<24,A191,A191+1)","v":8},{"$f":"VLOOKUP(A192,'Counties and Regions'!$G$3:$J$74,4,FALSE)","v":"Southern"},{"$f":"VLOOKUP(A192,'Counties and Regions'!$G$3:$J$74,3,FALSE)","v":"Iowa County"},"Physician Services","O"]
[{"$f":"IF(COUNTIF($A$9:A192,A192)<24,A192,A192+1)","v":8},{"$f":"VLOOKUP(A193,'Counties and Regions'!$G$3:$J$74,4,FALSE)","v":"Southern"},{"$f":"VLOOKUP(A193,'Counties and Regions'!$G$3:$J$74,3,FALSE)","v":"Iowa County"},"Other Services","F"]
[{"$f":"IF(COUNTIF($A$9:A193,A193)<24,A193,A193+1)","v":8},{"$f":"VLOOKUP(A194,'Counties and Regions'!$G$3:$J$74,4,FALSE)","v":"Southern"},{"$f":"VLOOKUP(A194,'Counties and Regions'!$G$3:$J$74,3,FALSE)","v":"Iowa County"},"Other Services","D"]
[{"$f":"IF(COUNTIF($A$9:A194,A194)<24,A194,A194+1)","v":8},{"$f":"VLOOKUP(A195,'Counties and Regions'!$G$3:$J$74,4,FALSE)","v":"Southern"},{"$f":"VLOOKUP(A195,'Counties and Regions'!$G$3:$J$74,3,FALSE)","v":"Iowa County"},"Other Services","B"]
[{"$f":"IF(COUNTIF($A$9:A195,A195)<24,A195,A195+1)","v":8},{"$f":"VLOOKUP(A196,'Counties and Regions'!$G$3:$J$74,4,FALSE)","v":"Southern"},{"$f":"VLOOKUP(A196,'Counties and Regions'!$G$3:$J$74,3,FALSE)","v":"Iowa County"},"Other Services","O"]
[{"$f":"IF(COUNTIF($A$9:A196,A196)<24,A196,A196+1)","v":8},{"$f":"VLOOKUP(A197,'Counties and Regions'!$G$3:$J$74,4,FALSE)","v":"Southern"},{"$f":"VLOOKUP(A197,'Counties and Regions'!$G$3:$J$74,3,FALSE)","v":"Iowa County"},"Additional Services","F"]
[{"$f":"IF(COUNTIF($A$9:A197,A197)<24,A197,A197+1)","v":8},{"$f":"VLOOKUP(A198,'Counties and Regions'!$G$3:$J$74,4,FALSE)","v":"Southern"},{"$f":"VLOOKUP(A198,'Counties and Regions'!$G$3:$J$74,3,FALSE)","v":"Iowa County"},"Additional Services","D"]
[{"$f":"IF(COUNTIF($A$9:A198,A198)<24,A198,A198+1)","v":8},{"$f":"VLOOKUP(A199,'Counties and Regions'!$G$3:$J$74,4,FALSE)","v":"Southern"},{"$f":"VLOOKUP(A199,'Counties and Regions'!$G$3:$J$74,3,FALSE)","v":"Iowa County"},"Additional Services","B"]
[{"$f":"IF(COUNTIF($A$9:A199,A199)<24,A199,A199+1)","v":8},{"$f":"VLOOKUP(A200,'Counties and Regions'!$G$3:$J$74,4,FALSE)","v":"Southern"},{"$f":"VLOOKUP(A200,'Counties and Regions'!$G$3:$J$74,3,FALSE)","v":"Iowa County"},"Additional Services","O"]
[{"$f":"IF(COUNTIF($A$9:A200,A200)<24,A200,A200+1)","v":9},{"$f":"VLOOKUP(A201,'Counties and Regions'!$G$3:$J$74,4,FALSE)","v":"Southern"},{"$f":"VLOOKUP(A201,'Counties and Regions'!$G$3:$J$74,3,FALSE)","v":"Jefferson County"},"Hospital Inpatient","F"]
[{"$f":"IF(COUNTIF($A$9:A201,A201)<24,A201,A201+1)","v":9},{"$f":"VLOOKUP(A202,'Counties and Regions'!$G$3:$J$74,4,FALSE)","v":"Southern"},{"$f":"VLOOKUP(A202,'Counties and Regions'!$G$3:$J$74,3,FALSE)","v":"Jefferson County"},"Hospital Inpatient","D"]
[{"$f":"IF(COUNTIF($A$9:A202,A202)<24,A202,A202+1)","v":9},{"$f":"VLOOKUP(A203,'Counties and Regions'!$G$3:$J$74,4,FALSE)","v":"Southern"},{"$f":"VLOOKUP(A203,'Counties and Regions'!$G$3:$J$74,3,FALSE)","v":"Jefferson County"},"Hospital Inpatient","B"]
[{"$f":"IF(COUNTIF($A$9:A203,A203)<24,A203,A203+1)","v":9},{"$f":"VLOOKUP(A204,'Counties and Regions'!$G$3:$J$74,4,FALSE)","v":"Southern"},{"$f":"VLOOKUP(A204,'Counties and Regions'!$G$3:$J$74,3,FALSE)","v":"Jefferson County"},"Hospital Inpatient","O"]
[{"$f":"IF(COUNTIF($A$9:A204,A204)<24,A204,A204+1)","v":9},{"$f":"VLOOKUP(A205,'Counties and Regions'!$G$3:$J$74,4,FALSE)","v":"Southern"},{"$f":"VLOOKUP(A205,'Counties and Regions'!$G$3:$J$74,3,FALSE)","v":"Jefferson County"},"Hospital Outpatient","F"]
[{"$f":"IF(COUNTIF($A$9:A205,A205)<24,A205,A205+1)","v":9},{"$f":"VLOOKUP(A206,'Counties and Regions'!$G$3:$J$74,4,FALSE)","v":"Southern"},{"$f":"VLOOKUP(A206,'Counties and Regions'!$G$3:$J$74,3,FALSE)","v":"Jefferson County"},"Hospital Outpatient","D"]
[{"$f":"IF(COUNTIF($A$9:A206,A206)<24,A206,A206+1)","v":9},{"$f":"VLOOKUP(A207,'Counties and Regions'!$G$3:$J$74,4,FALSE)","v":"Southern"},{"$f":"VLOOKUP(A207,'Counties and Regions'!$G$3:$J$74,3,FALSE)","v":"Jefferson County"},"Hospital Outpatient","B"]
[{"$f":"IF(COUNTIF($A$9:A207,A207)<24,A207,A207+1)","v":9},{"$f":"VLOOKUP(A208,'Counties and Regions'!$G$3:$J$74,4,FALSE)","v":"Southern"},{"$f":"VLOOKUP(A208,'Counties and Regions'!$G$3:$J$74,3,FALSE)","v":"Jefferson County"},"Hospital Outpatient","O"]
[{"$f":"IF(COUNTIF($A$9:A208,A208)<24,A208,A208+1)","v":9},{"$f":"VLOOKUP(A209,'Counties and Regions'!$G$3:$J$74,4,FALSE)","v":"Southern"},{"$f":"VLOOKUP(A209,'Counties and Regions'!$G$3:$J$74,3,FALSE)","v":"Jefferson County"},"Other Facility","F"]
[{"$f":"IF(COUNTIF($A$9:A209,A209)<24,A209,A209+1)","v":9},{"$f":"VLOOKUP(A210,'Counties and Regions'!$G$3:$J$74,4,FALSE)","v":"Southern"},{"$f":"VLOOKUP(A210,'Counties and Regions'!$G$3:$J$74,3,FALSE)","v":"Jefferson County"},"Other Facility","D"]
[{"$f":"IF(COUNTIF($A$9:A210,A210)<24,A210,A210+1)","v":9},{"$f":"VLOOKUP(A211,'Counties and Regions'!$G$3:$J$74,4,FALSE)","v":"Southern"},{"$f":"VLOOKUP(A211,'Counties and Regions'!$G$3:$J$74,3,FALSE)","v":"Jefferson County"},"Other Facility","B"]
[{"$f":"IF(COUNTIF($A$9:A211,A211)<24,A211,A211+1)","v":9},{"$f":"VLOOKUP(A212,'Counties and Regions'!$G$3:$J$74,4,FALSE)","v":"Southern"},{"$f":"VLOOKUP(A212,'Counties and Regions'!$G$3:$J$74,3,FALSE)","v":"Jefferson County"},"Other Facility","O"]
[{"$f":"IF(COUNTIF($A$9:A212,A212)<24,A212,A212+1)","v":9},{"$f":"VLOOKUP(A213,'Counties and Regions'!$G$3:$J$74,4,FALSE)","v":"Southern"},{"$f":"VLOOKUP(A213,'Counties and Regions'!$G$3:$J$74,3,FALSE)","v":"Jefferson County"},"Physician Services","F"]
[{"$f":"IF(COUNTIF($A$9:A213,A213)<24,A213,A213+1)","v":9},{"$f":"VLOOKUP(A214,'Counties and Regions'!$G$3:$J$74,4,FALSE)","v":"Southern"},{"$f":"VLOOKUP(A214,'Counties and Regions'!$G$3:$J$74,3,FALSE)","v":"Jefferson County"},"Physician Services","D"]
[{"$f":"IF(COUNTIF($A$9:A214,A214)<24,A214,A214+1)","v":9},{"$f":"VLOOKUP(A215,'Counties and Regions'!$G$3:$J$74,4,FALSE)","v":"Southern"},{"$f":"VLOOKUP(A215,'Counties and Regions'!$G$3:$J$74,3,FALSE)","v":"Jefferson County"},"Physician Services","B"]
[{"$f":"IF(COUNTIF($A$9:A215,A215)<24,A215,A215+1)","v":9},{"$f":"VLOOKUP(A216,'Counties and Regions'!$G$3:$J$74,4,FALSE)","v":"Southern"},{"$f":"VLOOKUP(A216,'Counties and Regions'!$G$3:$J$74,3,FALSE)","v":"Jefferson County"},"Physician Services","O"]
[{"$f":"IF(COUNTIF($A$9:A216,A216)<24,A216,A216+1)","v":9},{"$f":"VLOOKUP(A217,'Counties and Regions'!$G$3:$J$74,4,FALSE)","v":"Southern"},{"$f":"VLOOKUP(A217,'Counties and Regions'!$G$3:$J$74,3,FALSE)","v":"Jefferson County"},"Other Services","F"]
[{"$f":"IF(COUNTIF($A$9:A217,A217)<24,A217,A217+1)","v":9},{"$f":"VLOOKUP(A218,'Counties and Regions'!$G$3:$J$74,4,FALSE)","v":"Southern"},{"$f":"VLOOKUP(A218,'Counties and Regions'!$G$3:$J$74,3,FALSE)","v":"Jefferson County"},"Other Services","D"]
[{"$f":"IF(COUNTIF($A$9:A218,A218)<24,A218,A218+1)","v":9},{"$f":"VLOOKUP(A219,'Counties and Regions'!$G$3:$J$74,4,FALSE)","v":"Southern"},{"$f":"VLOOKUP(A219,'Counties and Regions'!$G$3:$J$74,3,FALSE)","v":"Jefferson County"},"Other Services","B"]
[{"$f":"IF(COUNTIF($A$9:A219,A219)<24,A219,A219+1)","v":9},{"$f":"VLOOKUP(A220,'Counties and Regions'!$G$3:$J$74,4,FALSE)","v":"Southern"},{"$f":"VLOOKUP(A220,'Counties and Regions'!$G$3:$J$74,3,FALSE)","v":"Jefferson County"},"Other Services","O"]
[{"$f":"IF(COUNTIF($A$9:A220,A220)<24,A220,A220+1)","v":9},{"$f":"VLOOKUP(A221,'Counties and Regions'!$G$3:$J$74,4,FALSE)","v":"Southern"},{"$f":"VLOOKUP(A221,'Counties and Regions'!$G$3:$J$74,3,FALSE)","v":"Jefferson County"},"Additional Services","F"]
[{"$f":"IF(COUNTIF($A$9:A221,A221)<24,A221,A221+1)","v":9},{"$f":"VLOOKUP(A222,'Counties and Regions'!$G$3:$J$74,4,FALSE)","v":"Southern"},{"$f":"VLOOKUP(A222,'Counties and Regions'!$G$3:$J$74,3,FALSE)","v":"Jefferson County"},"Additional Services","D"]
[{"$f":"IF(COUNTIF($A$9:A222,A222)<24,A222,A222+1)","v":9},{"$f":"VLOOKUP(A223,'Counties and Regions'!$G$3:$J$74,4,FALSE)","v":"Southern"},{"$f":"VLOOKUP(A223,'Counties and Regions'!$G$3:$J$74,3,FALSE)","v":"Jefferson County"},"Additional Services","B"]
[{"$f":"IF(COUNTIF($A$9:A223,A223)<24,A223,A223+1)","v":9},{"$f":"VLOOKUP(A224,'Counties and Regions'!$G$3:$J$74,4,FALSE)","v":"Southern"},{"$f":"VLOOKUP(A224,'Counties and Regions'!$G$3:$J$74,3,FALSE)","v":"Jefferson County"},"Additional Services","O"]
[{"$f":"IF(COUNTIF($A$9:A224,A224)<24,A224,A224+1)","v":10},{"$f":"VLOOKUP(A225,'Counties and Regions'!$G$3:$J$74,4,FALSE)","v":"Southern"},{"$f":"VLOOKUP(A225,'Counties and Regions'!$G$3:$J$74,3,FALSE)","v":"Juneau County"},"Hospital Inpatient","F"]
[{"$f":"IF(COUNTIF($A$9:A225,A225)<24,A225,A225+1)","v":10},{"$f":"VLOOKUP(A226,'Counties and Regions'!$G$3:$J$74,4,FALSE)","v":"Southern"},{"$f":"VLOOKUP(A226,'Counties and Regions'!$G$3:$J$74,3,FALSE)","v":"Juneau County"},"Hospital Inpatient","D"]
[{"$f":"IF(COUNTIF($A$9:A226,A226)<24,A226,A226+1)","v":10},{"$f":"VLOOKUP(A227,'Counties and Regions'!$G$3:$J$74,4,FALSE)","v":"Southern"},{"$f":"VLOOKUP(A227,'Counties and Regions'!$G$3:$J$74,3,FALSE)","v":"Juneau County"},"Hospital Inpatient","B"]
[{"$f":"IF(COUNTIF($A$9:A227,A227)<24,A227,A227+1)","v":10},{"$f":"VLOOKUP(A228,'Counties and Regions'!$G$3:$J$74,4,FALSE)","v":"Southern"},{"$f":"VLOOKUP(A228,'Counties and Regions'!$G$3:$J$74,3,FALSE)","v":"Juneau County"},"Hospital Inpatient","O"]
[{"$f":"IF(COUNTIF($A$9:A228,A228)<24,A228,A228+1)","v":10},{"$f":"VLOOKUP(A229,'Counties and Regions'!$G$3:$J$74,4,FALSE)","v":"Southern"},{"$f":"VLOOKUP(A229,'Counties and Regions'!$G$3:$J$74,3,FALSE)","v":"Juneau County"},"Hospital Outpatient","F"]
[{"$f":"IF(COUNTIF($A$9:A229,A229)<24,A229,A229+1)","v":10},{"$f":"VLOOKUP(A230,'Counties and Regions'!$G$3:$J$74,4,FALSE)","v":"Southern"},{"$f":"VLOOKUP(A230,'Counties and Regions'!$G$3:$J$74,3,FALSE)","v":"Juneau County"},"Hospital Outpatient","D"]
[{"$f":"IF(COUNTIF($A$9:A230,A230)<24,A230,A230+1)","v":10},{"$f":"VLOOKUP(A231,'Counties and Regions'!$G$3:$J$74,4,FALSE)","v":"Southern"},{"$f":"VLOOKUP(A231,'Counties and Regions'!$G$3:$J$74,3,FALSE)","v":"Juneau County"},"Hospital Outpatient","B"]
[{"$f":"IF(COUNTIF($A$9:A231,A231)<24,A231,A231+1)","v":10},{"$f":"VLOOKUP(A232,'Counties and Regions'!$G$3:$J$74,4,FALSE)","v":"Southern"},{"$f":"VLOOKUP(A232,'Counties and Regions'!$G$3:$J$74,3,FALSE)","v":"Juneau County"},"Hospital Outpatient","O"]
[{"$f":"IF(COUNTIF($A$9:A232,A232)<24,A232,A232+1)","v":10},{"$f":"VLOOKUP(A233,'Counties and Regions'!$G$3:$J$74,4,FALSE)","v":"Southern"},{"$f":"VLOOKUP(A233,'Counties and Regions'!$G$3:$J$74,3,FALSE)","v":"Juneau County"},"Other Facility","F"]
[{"$f":"IF(COUNTIF($A$9:A233,A233)<24,A233,A233+1)","v":10},{"$f":"VLOOKUP(A234,'Counties and Regions'!$G$3:$J$74,4,FALSE)","v":"Southern"},{"$f":"VLOOKUP(A234,'Counties and Regions'!$G$3:$J$74,3,FALSE)","v":"Juneau County"},"Other Facility","D"]
[{"$f":"IF(COUNTIF($A$9:A234,A234)<24,A234,A234+1)","v":10},{"$f":"VLOOKUP(A235,'Counties and Regions'!$G$3:$J$74,4,FALSE)","v":"Southern"},{"$f":"VLOOKUP(A235,'Counties and Regions'!$G$3:$J$74,3,FALSE)","v":"Juneau County"},"Other Facility","B"]
[{"$f":"IF(COUNTIF($A$9:A235,A235)<24,A235,A235+1)","v":10},{"$f":"VLOOKUP(A236,'Counties and Regions'!$G$3:$J$74,4,FALSE)","v":"Southern"},{"$f":"VLOOKUP(A236,'Counties and Regions'!$G$3:$J$74,3,FALSE)","v":"Juneau County"},"Other Facility","O"]
[{"$f":"IF(COUNTIF($A$9:A236,A236)<24,A236,A236+1)","v":10},{"$f":"VLOOKUP(A237,'Counties and Regions'!$G$3:$J$74,4,FALSE)","v":"Southern"},{"$f":"VLOOKUP(A237,'Counties and Regions'!$G$3:$J$74,3,FALSE)","v":"Juneau County"},"Physician Services","F"]
[{"$f":"IF(COUNTIF($A$9:A237,A237)<24,A237,A237+1)","v":10},{"$f":"VLOOKUP(A238,'Counties and Regions'!$G$3:$J$74,4,FALSE)","v":"Southern"},{"$f":"VLOOKUP(A238,'Counties and Regions'!$G$3:$J$74,3,FALSE)","v":"Juneau County"},"Physician Services","D"]
[{"$f":"IF(COUNTIF($A$9:A238,A238)<24,A238,A238+1)","v":10},{"$f":"VLOOKUP(A239,'Counties and Regions'!$G$3:$J$74,4,FALSE)","v":"Southern"},{"$f":"VLOOKUP(A239,'Counties and Regions'!$G$3:$J$74,3,FALSE)","v":"Juneau County"},"Physician Services","B"]
[{"$f":"IF(COUNTIF($A$9:A239,A239)<24,A239,A239+1)","v":10},{"$f":"VLOOKUP(A240,'Counties and Regions'!$G$3:$J$74,4,FALSE)","v":"Southern"},{"$f":"VLOOKUP(A240,'Counties and Regions'!$G$3:$J$74,3,FALSE)","v":"Juneau County"},"Physician Services","O"]
[{"$f":"IF(COUNTIF($A$9:A240,A240)<24,A240,A240+1)","v":10},{"$f":"VLOOKUP(A241,'Counties and Regions'!$G$3:$J$74,4,FALSE)","v":"Southern"},{"$f":"VLOOKUP(A241,'Counties and Regions'!$G$3:$J$74,3,FALSE)","v":"Juneau County"},"Other Services","F"]
[{"$f":"IF(COUNTIF($A$9:A241,A241)<24,A241,A241+1)","v":10},{"$f":"VLOOKUP(A242,'Counties and Regions'!$G$3:$J$74,4,FALSE)","v":"Southern"},{"$f":"VLOOKUP(A242,'Counties and Regions'!$G$3:$J$74,3,FALSE)","v":"Juneau County"},"Other Services","D"]
[{"$f":"IF(COUNTIF($A$9:A242,A242)<24,A242,A242+1)","v":10},{"$f":"VLOOKUP(A243,'Counties and Regions'!$G$3:$J$74,4,FALSE)","v":"Southern"},{"$f":"VLOOKUP(A243,'Counties and Regions'!$G$3:$J$74,3,FALSE)","v":"Juneau County"},"Other Services","B"]
[{"$f":"IF(COUNTIF($A$9:A243,A243)<24,A243,A243+1)","v":10},{"$f":"VLOOKUP(A244,'Counties and Regions'!$G$3:$J$74,4,FALSE)","v":"Southern"},{"$f":"VLOOKUP(A244,'Counties and Regions'!$G$3:$J$74,3,FALSE)","v":"Juneau County"},"Other Services","O"]
[{"$f":"IF(COUNTIF($A$9:A244,A244)<24,A244,A244+1)","v":10},{"$f":"VLOOKUP(A245,'Counties and Regions'!$G$3:$J$74,4,FALSE)","v":"Southern"},{"$f":"VLOOKUP(A245,'Counties and Regions'!$G$3:$J$74,3,FALSE)","v":"Juneau County"},"Additional Services","F"]
[{"$f":"IF(COUNTIF($A$9:A245,A245)<24,A245,A245+1)","v":10},{"$f":"VLOOKUP(A246,'Counties and Regions'!$G$3:$J$74,4,FALSE)","v":"Southern"},{"$f":"VLOOKUP(A246,'Counties and Regions'!$G$3:$J$74,3,FALSE)","v":"Juneau County"},"Additional Services","D"]
[{"$f":"IF(COUNTIF($A$9:A246,A246)<24,A246,A246+1)","v":10},{"$f":"VLOOKUP(A247,'Counties and Regions'!$G$3:$J$74,4,FALSE)","v":"Southern"},{"$f":"VLOOKUP(A247,'Counties and Regions'!$G$3:$J$74,3,FALSE)","v":"Juneau County"},"Additional Services","B"]
[{"$f":"IF(COUNTIF($A$9:A247,A247)<24,A247,A247+1)","v":10},{"$f":"VLOOKUP(A248,'Counties and Regions'!$G$3:$J$74,4,FALSE)","v":"Southern"},{"$f":"VLOOKUP(A248,'Counties and Regions'!$G$3:$J$74,3,FALSE)","v":"Juneau County"},"Additional Services","O"]
[{"$f":"IF(COUNTIF($A$9:A248,A248)<24,A248,A248+1)","v":11},{"$f":"VLOOKUP(A249,'Counties and Regions'!$G$3:$J$74,4,FALSE)","v":"Southern"},{"$f":"VLOOKUP(A249,'Counties and Regions'!$G$3:$J$74,3,FALSE)","v":"Lafayette County"},"Hospital Inpatient","F"]
[{"$f":"IF(COUNTIF($A$9:A249,A249)<24,A249,A249+1)","v":11},{"$f":"VLOOKUP(A250,'Counties and Regions'!$G$3:$J$74,4,FALSE)","v":"Southern"},{"$f":"VLOOKUP(A250,'Counties and Regions'!$G$3:$J$74,3,FALSE)","v":"Lafayette County"},"Hospital Inpatient","D"]
[{"$f":"IF(COUNTIF($A$9:A250,A250)<24,A250,A250+1)","v":11},{"$f":"VLOOKUP(A251,'Counties and Regions'!$G$3:$J$74,4,FALSE)","v":"Southern"},{"$f":"VLOOKUP(A251,'Counties and Regions'!$G$3:$J$74,3,FALSE)","v":"Lafayette County"},"Hospital Inpatient","B"]
[{"$f":"IF(COUNTIF($A$9:A251,A251)<24,A251,A251+1)","v":11},{"$f":"VLOOKUP(A252,'Counties and Regions'!$G$3:$J$74,4,FALSE)","v":"Southern"},{"$f":"VLOOKUP(A252,'Counties and Regions'!$G$3:$J$74,3,FALSE)","v":"Lafayette County"},"Hospital Inpatient","O"]
[{"$f":"IF(COUNTIF($A$9:A252,A252)<24,A252,A252+1)","v":11},{"$f":"VLOOKUP(A253,'Counties and Regions'!$G$3:$J$74,4,FALSE)","v":"Southern"},{"$f":"VLOOKUP(A253,'Counties and Regions'!$G$3:$J$74,3,FALSE)","v":"Lafayette County"},"Hospital Outpatient","F"]
[{"$f":"IF(COUNTIF($A$9:A253,A253)<24,A253,A253+1)","v":11},{"$f":"VLOOKUP(A254,'Counties and Regions'!$G$3:$J$74,4,FALSE)","v":"Southern"},{"$f":"VLOOKUP(A254,'Counties and Regions'!$G$3:$J$74,3,FALSE)","v":"Lafayette County"},"Hospital Outpatient","D"]
[{"$f":"IF(COUNTIF($A$9:A254,A254)<24,A254,A254+1)","v":11},{"$f":"VLOOKUP(A255,'Counties and Regions'!$G$3:$J$74,4,FALSE)","v":"Southern"},{"$f":"VLOOKUP(A255,'Counties and Regions'!$G$3:$J$74,3,FALSE)","v":"Lafayette County"},"Hospital Outpatient","B"]
[{"$f":"IF(COUNTIF($A$9:A255,A255)<24,A255,A255+1)","v":11},{"$f":"VLOOKUP(A256,'Counties and Regions'!$G$3:$J$74,4,FALSE)","v":"Southern"},{"$f":"VLOOKUP(A256,'Counties and Regions'!$G$3:$J$74,3,FALSE)","v":"Lafayette County"},"Hospital Outpatient","O"]
[{"$f":"IF(COUNTIF($A$9:A256,A256)<24,A256,A256+1)","v":11},{"$f":"VLOOKUP(A257,'Counties and Regions'!$G$3:$J$74,4,FALSE)","v":"Southern"},{"$f":"VLOOKUP(A257,'Counties and Regions'!$G$3:$J$74,3,FALSE)","v":"Lafayette County"},"Other Facility","F"]
[{"$f":"IF(COUNTIF($A$9:A257,A257)<24,A257,A257+1)","v":11},{"$f":"VLOOKUP(A258,'Counties and Regions'!$G$3:$J$74,4,FALSE)","v":"Southern"},{"$f":"VLOOKUP(A258,'Counties and Regions'!$G$3:$J$74,3,FALSE)","v":"Lafayette County"},"Other Facility","D"]
[{"$f":"IF(COUNTIF($A$9:A258,A258)<24,A258,A258+1)","v":11},{"$f":"VLOOKUP(A259,'Counties and Regions'!$G$3:$J$74,4,FALSE)","v":"Southern"},{"$f":"VLOOKUP(A259,'Counties and Regions'!$G$3:$J$74,3,FALSE)","v":"Lafayette County"},"Other Facility","B"]
[{"$f":"IF(COUNTIF($A$9:A259,A259)<24,A259,A259+1)","v":11},{"$f":"VLOOKUP(A260,'Counties and Regions'!$G$3:$J$74,4,FALSE)","v":"Southern"},{"$f":"VLOOKUP(A260,'Counties and Regions'!$G$3:$J$74,3,FALSE)","v":"Lafayette County"},"Other Facility","O"]
[{"$f":"IF(COUNTIF($A$9:A260,A260)<24,A260,A260+1)","v":11},{"$f":"VLOOKUP(A261,'Counties and Regions'!$G$3:$J$74,4,FALSE)","v":"Southern"},{"$f":"VLOOKUP(A261,'Counties and Regions'!$G$3:$J$74,3,FALSE)","v":"Lafayette County"},"Physician Services","F"]
[{"$f":"IF(COUNTIF($A$9:A261,A261)<24,A261,A261+1)","v":11},{"$f":"VLOOKUP(A262,'Counties and Regions'!$G$3:$J$74,4,FALSE)","v":"Southern"},{"$f":"VLOOKUP(A262,'Counties and Regions'!$G$3:$J$74,3,FALSE)","v":"Lafayette County"},"Physician Services","D"]
[{"$f":"IF(COUNTIF($A$9:A262,A262)<24,A262,A262+1)","v":11},{"$f":"VLOOKUP(A263,'Counties and Regions'!$G$3:$J$74,4,FALSE)","v":"Southern"},{"$f":"VLOOKUP(A263,'Counties and Regions'!$G$3:$J$74,3,FALSE)","v":"Lafayette County"},"Physician Services","B"]
[{"$f":"IF(COUNTIF($A$9:A263,A263)<24,A263,A263+1)","v":11},{"$f":"VLOOKUP(A264,'Counties and Regions'!$G$3:$J$74,4,FALSE)","v":"Southern"},{"$f":"VLOOKUP(A264,'Counties and Regions'!$G$3:$J$74,3,FALSE)","v":"Lafayette County"},"Physician Services","O"]
[{"$f":"IF(COUNTIF($A$9:A264,A264)<24,A264,A264+1)","v":11},{"$f":"VLOOKUP(A265,'Counties and Regions'!$G$3:$J$74,4,FALSE)","v":"Southern"},{"$f":"VLOOKUP(A265,'Counties and Regions'!$G$3:$J$74,3,FALSE)","v":"Lafayette County"},"Other Services","F"]
[{"$f":"IF(COUNTIF($A$9:A265,A265)<24,A265,A265+1)","v":11},{"$f":"VLOOKUP(A266,'Counties and Regions'!$G$3:$J$74,4,FALSE)","v":"Southern"},{"$f":"VLOOKUP(A266,'Counties and Regions'!$G$3:$J$74,3,FALSE)","v":"Lafayette County"},"Other Services","D"]
[{"$f":"IF(COUNTIF($A$9:A266,A266)<24,A266,A266+1)","v":11},{"$f":"VLOOKUP(A267,'Counties and Regions'!$G$3:$J$74,4,FALSE)","v":"Southern"},{"$f":"VLOOKUP(A267,'Counties and Regions'!$G$3:$J$74,3,FALSE)","v":"Lafayette County"},"Other Services","B"]
[{"$f":"IF(COUNTIF($A$9:A267,A267)<24,A267,A267+1)","v":11},{"$f":"VLOOKUP(A268,'Counties and Regions'!$G$3:$J$74,4,FALSE)","v":"Southern"},{"$f":"VLOOKUP(A268,'Counties and Regions'!$G$3:$J$74,3,FALSE)","v":"Lafayette County"},"Other Services","O"]
[{"$f":"IF(COUNTIF($A$9:A268,A268)<24,A268,A268+1)","v":11},{"$f":"VLOOKUP(A269,'Counties and Regions'!$G$3:$J$74,4,FALSE)","v":"Southern"},{"$f":"VLOOKUP(A269,'Counties and Regions'!$G$3:$J$74,3,FALSE)","v":"Lafayette County"},"Additional Services","F"]
[{"$f":"IF(COUNTIF($A$9:A269,A269)<24,A269,A269+1)","v":11},{"$f":"VLOOKUP(A270,'Counties and Regions'!$G$3:$J$74,4,FALSE)","v":"Southern"},{"$f":"VLOOKUP(A270,'Counties and Regions'!$G$3:$J$74,3,FALSE)","v":"Lafayette County"},"Additional Services","D"]
[{"$f":"IF(COUNTIF($A$9:A270,A270)<24,A270,A270+1)","v":11},{"$f":"VLOOKUP(A271,'Counties and Regions'!$G$3:$J$74,4,FALSE)","v":"Southern"},{"$f":"VLOOKUP(A271,'Counties and Regions'!$G$3:$J$74,3,FALSE)","v":"Lafayette County"},"Additional Services","B"]
[{"$f":"IF(COUNTIF($A$9:A271,A271)<24,A271,A271+1)","v":11},{"$f":"VLOOKUP(A272,'Counties and Regions'!$G$3:$J$74,4,FALSE)","v":"Southern"},{"$f":"VLOOKUP(A272,'Counties and Regions'!$G$3:$J$74,3,FALSE)","v":"Lafayette County"},"Additional Services","O"]
[{"$f":"IF(COUNTIF($A$9:A272,A272)<24,A272,A272+1)","v":12},{"$f":"VLOOKUP(A273,'Counties and Regions'!$G$3:$J$74,4,FALSE)","v":"Southern"},{"$f":"VLOOKUP(A273,'Counties and Regions'!$G$3:$J$74,3,FALSE)","v":"La Crosse County"},"Hospital Inpatient","F"]
[{"$f":"IF(COUNTIF($A$9:A273,A273)<24,A273,A273+1)","v":12},{"$f":"VLOOKUP(A274,'Counties and Regions'!$G$3:$J$74,4,FALSE)","v":"Southern"},{"$f":"VLOOKUP(A274,'Counties and Regions'!$G$3:$J$74,3,FALSE)","v":"La Crosse County"},"Hospital Inpatient","D"]
[{"$f":"IF(COUNTIF($A$9:A274,A274)<24,A274,A274+1)","v":12},{"$f":"VLOOKUP(A275,'Counties and Regions'!$G$3:$J$74,4,FALSE)","v":"Southern"},{"$f":"VLOOKUP(A275,'Counties and Regions'!$G$3:$J$74,3,FALSE)","v":"La Crosse County"},"Hospital Inpatient","B"]
[{"$f":"IF(COUNTIF($A$9:A275,A275)<24,A275,A275+1)","v":12},{"$f":"VLOOKUP(A276,'Counties and Regions'!$G$3:$J$74,4,FALSE)","v":"Southern"},{"$f":"VLOOKUP(A276,'Counties and Regions'!$G$3:$J$74,3,FALSE)","v":"La Crosse County"},"Hospital Inpatient","O"]
[{"$f":"IF(COUNTIF($A$9:A276,A276)<24,A276,A276+1)","v":12},{"$f":"VLOOKUP(A277,'Counties and Regions'!$G$3:$J$74,4,FALSE)","v":"Southern"},{"$f":"VLOOKUP(A277,'Counties and Regions'!$G$3:$J$74,3,FALSE)","v":"La Crosse County"},"Hospital Outpatient","F"]
[{"$f":"IF(COUNTIF($A$9:A277,A277)<24,A277,A277+1)","v":12},{"$f":"VLOOKUP(A278,'Counties and Regions'!$G$3:$J$74,4,FALSE)","v":"Southern"},{"$f":"VLOOKUP(A278,'Counties and Regions'!$G$3:$J$74,3,FALSE)","v":"La Crosse County"},"Hospital Outpatient","D"]
[{"$f":"IF(COUNTIF($A$9:A278,A278)<24,A278,A278+1)","v":12},{"$f":"VLOOKUP(A279,'Counties and Regions'!$G$3:$J$74,4,FALSE)","v":"Southern"},{"$f":"VLOOKUP(A279,'Counties and Regions'!$G$3:$J$74,3,FALSE)","v":"La Crosse County"},"Hospital Outpatient","B"]
[{"$f":"IF(COUNTIF($A$9:A279,A279)<24,A279,A279+1)","v":12},{"$f":"VLOOKUP(A280,'Counties and Regions'!$G$3:$J$74,4,FALSE)","v":"Southern"},{"$f":"VLOOKUP(A280,'Counties and Regions'!$G$3:$J$74,3,FALSE)","v":"La Crosse County"},"Hospital Outpatient","O"]
[{"$f":"IF(COUNTIF($A$9:A280,A280)<24,A280,A280+1)","v":12},{"$f":"VLOOKUP(A281,'Counties and Regions'!$G$3:$J$74,4,FALSE)","v":"Southern"},{"$f":"VLOOKUP(A281,'Counties and Regions'!$G$3:$J$74,3,FALSE)","v":"La Crosse County"},"Other Facility","F"]
[{"$f":"IF(COUNTIF($A$9:A281,A281)<24,A281,A281+1)","v":12},{"$f":"VLOOKUP(A282,'Counties and Regions'!$G$3:$J$74,4,FALSE)","v":"Southern"},{"$f":"VLOOKUP(A282,'Counties and Regions'!$G$3:$J$74,3,FALSE)","v":"La Crosse County"},"Other Facility","D"]
[{"$f":"IF(COUNTIF($A$9:A282,A282)<24,A282,A282+1)","v":12},{"$f":"VLOOKUP(A283,'Counties and Regions'!$G$3:$J$74,4,FALSE)","v":"Southern"},{"$f":"VLOOKUP(A283,'Counties and Regions'!$G$3:$J$74,3,FALSE)","v":"La Crosse County"},"Other Facility","B"]
[{"$f":"IF(COUNTIF($A$9:A283,A283)<24,A283,A283+1)","v":12},{"$f":"VLOOKUP(A284,'Counties and Regions'!$G$3:$J$74,4,FALSE)","v":"Southern"},{"$f":"VLOOKUP(A284,'Counties and Regions'!$G$3:$J$74,3,FALSE)","v":"La Crosse County"},"Other Facility","O"]
[{"$f":"IF(COUNTIF($A$9:A284,A284)<24,A284,A284+1)","v":12},{"$f":"VLOOKUP(A285,'Counties and Regions'!$G$3:$J$74,4,FALSE)","v":"Southern"},{"$f":"VLOOKUP(A285,'Counties and Regions'!$G$3:$J$74,3,FALSE)","v":"La Crosse County"},"Physician Services","F"]
[{"$f":"IF(COUNTIF($A$9:A285,A285)<24,A285,A285+1)","v":12},{"$f":"VLOOKUP(A286,'Counties and Regions'!$G$3:$J$74,4,FALSE)","v":"Southern"},{"$f":"VLOOKUP(A286,'Counties and Regions'!$G$3:$J$74,3,FALSE)","v":"La Crosse County"},"Physician Services","D"]
[{"$f":"IF(COUNTIF($A$9:A286,A286)<24,A286,A286+1)","v":12},{"$f":"VLOOKUP(A287,'Counties and Regions'!$G$3:$J$74,4,FALSE)","v":"Southern"},{"$f":"VLOOKUP(A287,'Counties and Regions'!$G$3:$J$74,3,FALSE)","v":"La Crosse County"},"Physician Services","B"]
[{"$f":"IF(COUNTIF($A$9:A287,A287)<24,A287,A287+1)","v":12},{"$f":"VLOOKUP(A288,'Counties and Regions'!$G$3:$J$74,4,FALSE)","v":"Southern"},{"$f":"VLOOKUP(A288,'Counties and Regions'!$G$3:$J$74,3,FALSE)","v":"La Crosse County"},"Physician Services","O"]
[{"$f":"IF(COUNTIF($A$9:A288,A288)<24,A288,A288+1)","v":12},{"$f":"VLOOKUP(A289,'Counties and Regions'!$G$3:$J$74,4,FALSE)","v":"Southern"},{"$f":"VLOOKUP(A289,'Counties and Regions'!$G$3:$J$74,3,FALSE)","v":"La Crosse County"},"Other Services","F"]
[{"$f":"IF(COUNTIF($A$9:A289,A289)<24,A289,A289+1)","v":12},{"$f":"VLOOKUP(A290,'Counties and Regions'!$G$3:$J$74,4,FALSE)","v":"Southern"},{"$f":"VLOOKUP(A290,'Counties and Regions'!$G$3:$J$74,3,FALSE)","v":"La Crosse County"},"Other Services","D"]
[{"$f":"IF(COUNTIF($A$9:A290,A290)<24,A290,A290+1)","v":12},{"$f":"VLOOKUP(A291,'Counties and Regions'!$G$3:$J$74,4,FALSE)","v":"Southern"},{"$f":"VLOOKUP(A291,'Counties and Regions'!$G$3:$J$74,3,FALSE)","v":"La Crosse County"},"Other Services","B"]
[{"$f":"IF(COUNTIF($A$9:A291,A291)<24,A291,A291+1)","v":12},{"$f":"VLOOKUP(A292,'Counties and Regions'!$G$3:$J$74,4,FALSE)","v":"Southern"},{"$f":"VLOOKUP(A292,'Counties and Regions'!$G$3:$J$74,3,FALSE)","v":"La Crosse County"},"Other Services","O"]
[{"$f":"IF(COUNTIF($A$9:A292,A292)<24,A292,A292+1)","v":12},{"$f":"VLOOKUP(A293,'Counties and Regions'!$G$3:$J$74,4,FALSE)","v":"Southern"},{"$f":"VLOOKUP(A293,'Counties and Regions'!$G$3:$J$74,3,FALSE)","v":"La Crosse County"},"Additional Services","F"]
[{"$f":"IF(COUNTIF($A$9:A293,A293)<24,A293,A293+1)","v":12},{"$f":"VLOOKUP(A294,'Counties and Regions'!$G$3:$J$74,4,FALSE)","v":"Southern"},{"$f":"VLOOKUP(A294,'Counties and Regions'!$G$3:$J$74,3,FALSE)","v":"La Crosse County"},"Additional Services","D"]
[{"$f":"IF(COUNTIF($A$9:A294,A294)<24,A294,A294+1)","v":12},{"$f":"VLOOKUP(A295,'Counties and Regions'!$G$3:$J$74,4,FALSE)","v":"Southern"},{"$f":"VLOOKUP(A295,'Counties and Regions'!$G$3:$J$74,3,FALSE)","v":"La Crosse County"},"Additional Services","B"]
[{"$f":"IF(COUNTIF($A$9:A295,A295)<24,A295,A295+1)","v":12},{"$f":"VLOOKUP(A296,'Counties and Regions'!$G$3:$J$74,4,FALSE)","v":"Southern"},{"$f":"VLOOKUP(A296,'Counties and Regions'!$G$3:$J$74,3,FALSE)","v":"La Crosse County"},"Additional Services","O"]
[{"$f":"IF(COUNTIF($A$9:A296,A296)<24,A296,A296+1)","v":13},{"$f":"VLOOKUP(A297,'Counties and Regions'!$G$3:$J$74,4,FALSE)","v":"Southern"},{"$f":"VLOOKUP(A297,'Counties and Regions'!$G$3:$J$74,3,FALSE)","v":"Monroe County"},"Hospital Inpatient","F"]
[{"$f":"IF(COUNTIF($A$9:A297,A297)<24,A297,A297+1)","v":13},{"$f":"VLOOKUP(A298,'Counties and Regions'!$G$3:$J$74,4,FALSE)","v":"Southern"},{"$f":"VLOOKUP(A298,'Counties and Regions'!$G$3:$J$74,3,FALSE)","v":"Monroe County"},"Hospital Inpatient","D"]
[{"$f":"IF(COUNTIF($A$9:A298,A298)<24,A298,A298+1)","v":13},{"$f":"VLOOKUP(A299,'Counties and Regions'!$G$3:$J$74,4,FALSE)","v":"Southern"},{"$f":"VLOOKUP(A299,'Counties and Regions'!$G$3:$J$74,3,FALSE)","v":"Monroe County"},"Hospital Inpatient","B"]
[{"$f":"IF(COUNTIF($A$9:A299,A299)<24,A299,A299+1)","v":13},{"$f":"VLOOKUP(A300,'Counties and Regions'!$G$3:$J$74,4,FALSE)","v":"Southern"},{"$f":"VLOOKUP(A300,'Counties and Regions'!$G$3:$J$74,3,FALSE)","v":"Monroe County"},"Hospital Inpatient","O"]
[{"$f":"IF(COUNTIF($A$9:A300,A300)<24,A300,A300+1)","v":13},{"$f":"VLOOKUP(A301,'Counties and Regions'!$G$3:$J$74,4,FALSE)","v":"Southern"},{"$f":"VLOOKUP(A301,'Counties and Regions'!$G$3:$J$74,3,FALSE)","v":"Monroe County"},"Hospital Outpatient","F"]
[{"$f":"IF(COUNTIF($A$9:A301,A301)<24,A301,A301+1)","v":13},{"$f":"VLOOKUP(A302,'Counties and Regions'!$G$3:$J$74,4,FALSE)","v":"Southern"},{"$f":"VLOOKUP(A302,'Counties and Regions'!$G$3:$J$74,3,FALSE)","v":"Monroe County"},"Hospital Outpatient","D"]
[{"$f":"IF(COUNTIF($A$9:A302,A302)<24,A302,A302+1)","v":13},{"$f":"VLOOKUP(A303,'Counties and Regions'!$G$3:$J$74,4,FALSE)","v":"Southern"},{"$f":"VLOOKUP(A303,'Counties and Regions'!$G$3:$J$74,3,FALSE)","v":"Monroe County"},"Hospital Outpatient","B"]
[{"$f":"IF(COUNTIF($A$9:A303,A303)<24,A303,A303+1)","v":13},{"$f":"VLOOKUP(A304,'Counties and Regions'!$G$3:$J$74,4,FALSE)","v":"Southern"},{"$f":"VLOOKUP(A304,'Counties and Regions'!$G$3:$J$74,3,FALSE)","v":"Monroe County"},"Hospital Outpatient","O"]
[{"$f":"IF(COUNTIF($A$9:A304,A304)<24,A304,A304+1)","v":13},{"$f":"VLOOKUP(A305,'Counties and Regions'!$G$3:$J$74,4,FALSE)","v":"Southern"},{"$f":"VLOOKUP(A305,'Counties and Regions'!$G$3:$J$74,3,FALSE)","v":"Monroe County"},"Other Facility","F"]
[{"$f":"IF(COUNTIF($A$9:A305,A305)<24,A305,A305+1)","v":13},{"$f":"VLOOKUP(A306,'Counties and Regions'!$G$3:$J$74,4,FALSE)","v":"Southern"},{"$f":"VLOOKUP(A306,'Counties and Regions'!$G$3:$J$74,3,FALSE)","v":"Monroe County"},"Other Facility","D"]
[{"$f":"IF(COUNTIF($A$9:A306,A306)<24,A306,A306+1)","v":13},{"$f":"VLOOKUP(A307,'Counties and Regions'!$G$3:$J$74,4,FALSE)","v":"Southern"},{"$f":"VLOOKUP(A307,'Counties and Regions'!$G$3:$J$74,3,FALSE)","v":"Monroe County"},"Other Facility","B"]
[{"$f":"IF(COUNTIF($A$9:A307,A307)<24,A307,A307+1)","v":13},{"$f":"VLOOKUP(A308,'Counties and Regions'!$G$3:$J$74,4,FALSE)","v":"Southern"},{"$f":"VLOOKUP(A308,'Counties and Regions'!$G$3:$J$74,3,FALSE)","v":"Monroe County"},"Other Facility","O"]
[{"$f":"IF(COUNTIF($A$9:A308,A308)<24,A308,A308+1)","v":13},{"$f":"VLOOKUP(A309,'Counties and Regions'!$G$3:$J$74,4,FALSE)","v":"Southern"},{"$f":"VLOOKUP(A309,'Counties and Regions'!$G$3:$J$74,3,FALSE)","v":"Monroe County"},"Physician Services","F"]
[{"$f":"IF(COUNTIF($A$9:A309,A309)<24,A309,A309+1)","v":13},{"$f":"VLOOKUP(A310,'Counties and Regions'!$G$3:$J$74,4,FALSE)","v":"Southern"},{"$f":"VLOOKUP(A310,'Counties and Regions'!$G$3:$J$74,3,FALSE)","v":"Monroe County"},"Physician Services","D"]
[{"$f":"IF(COUNTIF($A$9:A310,A310)<24,A310,A310+1)","v":13},{"$f":"VLOOKUP(A311,'Counties and Regions'!$G$3:$J$74,4,FALSE)","v":"Southern"},{"$f":"VLOOKUP(A311,'Counties and Regions'!$G$3:$J$74,3,FALSE)","v":"Monroe County"},"Physician Services","B"]
[{"$f":"IF(COUNTIF($A$9:A311,A311)<24,A311,A311+1)","v":13},{"$f":"VLOOKUP(A312,'Counties and Regions'!$G$3:$J$74,4,FALSE)","v":"Southern"},{"$f":"VLOOKUP(A312,'Counties and Regions'!$G$3:$J$74,3,FALSE)","v":"Monroe County"},"Physician Services","O"]
[{"$f":"IF(COUNTIF($A$9:A312,A312)<24,A312,A312+1)","v":13},{"$f":"VLOOKUP(A313,'Counties and Regions'!$G$3:$J$74,4,FALSE)","v":"Southern"},{"$f":"VLOOKUP(A313,'Counties and Regions'!$G$3:$J$74,3,FALSE)","v":"Monroe County"},"Other Services","F"]
[{"$f":"IF(COUNTIF($A$9:A313,A313)<24,A313,A313+1)","v":13},{"$f":"VLOOKUP(A314,'Counties and Regions'!$G$3:$J$74,4,FALSE)","v":"Southern"},{"$f":"VLOOKUP(A314,'Counties and Regions'!$G$3:$J$74,3,FALSE)","v":"Monroe County"},"Other Services","D"]
[{"$f":"IF(COUNTIF($A$9:A314,A314)<24,A314,A314+1)","v":13},{"$f":"VLOOKUP(A315,'Counties and Regions'!$G$3:$J$74,4,FALSE)","v":"Southern"},{"$f":"VLOOKUP(A315,'Counties and Regions'!$G$3:$J$74,3,FALSE)","v":"Monroe County"},"Other Services","B"]
[{"$f":"IF(COUNTIF($A$9:A315,A315)<24,A315,A315+1)","v":13},{"$f":"VLOOKUP(A316,'Counties and Regions'!$G$3:$J$74,4,FALSE)","v":"Southern"},{"$f":"VLOOKUP(A316,'Counties and Regions'!$G$3:$J$74,3,FALSE)","v":"Monroe County"},"Other Services","O"]
[{"$f":"IF(COUNTIF($A$9:A316,A316)<24,A316,A316+1)","v":13},{"$f":"VLOOKUP(A317,'Counties and Regions'!$G$3:$J$74,4,FALSE)","v":"Southern"},{"$f":"VLOOKUP(A317,'Counties and Regions'!$G$3:$J$74,3,FALSE)","v":"Monroe County"},"Additional Services","F"]
[{"$f":"IF(COUNTIF($A$9:A317,A317)<24,A317,A317+1)","v":13},{"$f":"VLOOKUP(A318,'Counties and Regions'!$G$3:$J$74,4,FALSE)","v":"Southern"},{"$f":"VLOOKUP(A318,'Counties and Regions'!$G$3:$J$74,3,FALSE)","v":"Monroe County"},"Additional Services","D"]
[{"$f":"IF(COUNTIF($A$9:A318,A318)<24,A318,A318+1)","v":13},{"$f":"VLOOKUP(A319,'Counties and Regions'!$G$3:$J$74,4,FALSE)","v":"Southern"},{"$f":"VLOOKUP(A319,'Counties and Regions'!$G$3:$J$74,3,FALSE)","v":"Monroe County"},"Additional Services","B"]
[{"$f":"IF(COUNTIF($A$9:A319,A319)<24,A319,A319+1)","v":13},{"$f":"VLOOKUP(A320,'Counties and Regions'!$G$3:$J$74,4,FALSE)","v":"Southern"},{"$f":"VLOOKUP(A320,'Counties and Regions'!$G$3:$J$74,3,FALSE)","v":"Monroe County"},"Additional Services","O"]
[{"$f":"IF(COUNTIF($A$9:A320,A320)<24,A320,A320+1)","v":14},{"$f":"VLOOKUP(A321,'Counties and Regions'!$G$3:$J$74,4,FALSE)","v":"Southern"},{"$f":"VLOOKUP(A321,'Counties and Regions'!$G$3:$J$74,3,FALSE)","v":"Richland County"},"Hospital Inpatient","F"]
[{"$f":"IF(COUNTIF($A$9:A321,A321)<24,A321,A321+1)","v":14},{"$f":"VLOOKUP(A322,'Counties and Regions'!$G$3:$J$74,4,FALSE)","v":"Southern"},{"$f":"VLOOKUP(A322,'Counties and Regions'!$G$3:$J$74,3,FALSE)","v":"Richland County"},"Hospital Inpatient","D"]
[{"$f":"IF(COUNTIF($A$9:A322,A322)<24,A322,A322+1)","v":14},{"$f":"VLOOKUP(A323,'Counties and Regions'!$G$3:$J$74,4,FALSE)","v":"Southern"},{"$f":"VLOOKUP(A323,'Counties and Regions'!$G$3:$J$74,3,FALSE)","v":"Richland County"},"Hospital Inpatient","B"]
[{"$f":"IF(COUNTIF($A$9:A323,A323)<24,A323,A323+1)","v":14},{"$f":"VLOOKUP(A324,'Counties and Regions'!$G$3:$J$74,4,FALSE)","v":"Southern"},{"$f":"VLOOKUP(A324,'Counties and Regions'!$G$3:$J$74,3,FALSE)","v":"Richland County"},"Hospital Inpatient","O"]
[{"$f":"IF(COUNTIF($A$9:A324,A324)<24,A324,A324+1)","v":14},{"$f":"VLOOKUP(A325,'Counties and Regions'!$G$3:$J$74,4,FALSE)","v":"Southern"},{"$f":"VLOOKUP(A325,'Counties and Regions'!$G$3:$J$74,3,FALSE)","v":"Richland County"},"Hospital Outpatient","F"]
[{"$f":"IF(COUNTIF($A$9:A325,A325)<24,A325,A325+1)","v":14},{"$f":"VLOOKUP(A326,'Counties and Regions'!$G$3:$J$74,4,FALSE)","v":"Southern"},{"$f":"VLOOKUP(A326,'Counties and Regions'!$G$3:$J$74,3,FALSE)","v":"Richland County"},"Hospital Outpatient","D"]
[{"$f":"IF(COUNTIF($A$9:A326,A326)<24,A326,A326+1)","v":14},{"$f":"VLOOKUP(A327,'Counties and Regions'!$G$3:$J$74,4,FALSE)","v":"Southern"},{"$f":"VLOOKUP(A327,'Counties and Regions'!$G$3:$J$74,3,FALSE)","v":"Richland County"},"Hospital Outpatient","B"]
[{"$f":"IF(COUNTIF($A$9:A327,A327)<24,A327,A327+1)","v":14},{"$f":"VLOOKUP(A328,'Counties and Regions'!$G$3:$J$74,4,FALSE)","v":"Southern"},{"$f":"VLOOKUP(A328,'Counties and Regions'!$G$3:$J$74,3,FALSE)","v":"Richland County"},"Hospital Outpatient","O"]
[{"$f":"IF(COUNTIF($A$9:A328,A328)<24,A328,A328+1)","v":14},{"$f":"VLOOKUP(A329,'Counties and Regions'!$G$3:$J$74,4,FALSE)","v":"Southern"},{"$f":"VLOOKUP(A329,'Counties and Regions'!$G$3:$J$74,3,FALSE)","v":"Richland County"},"Other Facility","F"]
[{"$f":"IF(COUNTIF($A$9:A329,A329)<24,A329,A329+1)","v":14},{"$f":"VLOOKUP(A330,'Counties and Regions'!$G$3:$J$74,4,FALSE)","v":"Southern"},{"$f":"VLOOKUP(A330,'Counties and Regions'!$G$3:$J$74,3,FALSE)","v":"Richland County"},"Other Facility","D"]
[{"$f":"IF(COUNTIF($A$9:A330,A330)<24,A330,A330+1)","v":14},{"$f":"VLOOKUP(A331,'Counties and Regions'!$G$3:$J$74,4,FALSE)","v":"Southern"},{"$f":"VLOOKUP(A331,'Counties and Regions'!$G$3:$J$74,3,FALSE)","v":"Richland County"},"Other Facility","B"]
[{"$f":"IF(COUNTIF($A$9:A331,A331)<24,A331,A331+1)","v":14},{"$f":"VLOOKUP(A332,'Counties and Regions'!$G$3:$J$74,4,FALSE)","v":"Southern"},{"$f":"VLOOKUP(A332,'Counties and Regions'!$G$3:$J$74,3,FALSE)","v":"Richland County"},"Other Facility","O"]
[{"$f":"IF(COUNTIF($A$9:A332,A332)<24,A332,A332+1)","v":14},{"$f":"VLOOKUP(A333,'Counties and Regions'!$G$3:$J$74,4,FALSE)","v":"Southern"},{"$f":"VLOOKUP(A333,'Counties and Regions'!$G$3:$J$74,3,FALSE)","v":"Richland County"},"Physician Services","F"]
[{"$f":"IF(COUNTIF($A$9:A333,A333)<24,A333,A333+1)","v":14},{"$f":"VLOOKUP(A334,'Counties and Regions'!$G$3:$J$74,4,FALSE)","v":"Southern"},{"$f":"VLOOKUP(A334,'Counties and Regions'!$G$3:$J$74,3,FALSE)","v":"Richland County"},"Physician Services","D"]
[{"$f":"IF(COUNTIF($A$9:A334,A334)<24,A334,A334+1)","v":14},{"$f":"VLOOKUP(A335,'Counties and Regions'!$G$3:$J$74,4,FALSE)","v":"Southern"},{"$f":"VLOOKUP(A335,'Counties and Regions'!$G$3:$J$74,3,FALSE)","v":"Richland County"},"Physician Services","B"]
[{"$f":"IF(COUNTIF($A$9:A335,A335)<24,A335,A335+1)","v":14},{"$f":"VLOOKUP(A336,'Counties and Regions'!$G$3:$J$74,4,FALSE)","v":"Southern"},{"$f":"VLOOKUP(A336,'Counties and Regions'!$G$3:$J$74,3,FALSE)","v":"Richland County"},"Physician Services","O"]
[{"$f":"IF(COUNTIF($A$9:A336,A336)<24,A336,A336+1)","v":14},{"$f":"VLOOKUP(A337,'Counties and Regions'!$G$3:$J$74,4,FALSE)","v":"Southern"},{"$f":"VLOOKUP(A337,'Counties and Regions'!$G$3:$J$74,3,FALSE)","v":"Richland County"},"Other Services","F"]
[{"$f":"IF(COUNTIF($A$9:A337,A337)<24,A337,A337+1)","v":14},{"$f":"VLOOKUP(A338,'Counties and Regions'!$G$3:$J$74,4,FALSE)","v":"Southern"},{"$f":"VLOOKUP(A338,'Counties and Regions'!$G$3:$J$74,3,FALSE)","v":"Richland County"},"Other Services","D"]
[{"$f":"IF(COUNTIF($A$9:A338,A338)<24,A338,A338+1)","v":14},{"$f":"VLOOKUP(A339,'Counties and Regions'!$G$3:$J$74,4,FALSE)","v":"Southern"},{"$f":"VLOOKUP(A339,'Counties and Regions'!$G$3:$J$74,3,FALSE)","v":"Richland County"},"Other Services","B"]
[{"$f":"IF(COUNTIF($A$9:A339,A339)<24,A339,A339+1)","v":14},{"$f":"VLOOKUP(A340,'Counties and Regions'!$G$3:$J$74,4,FALSE)","v":"Southern"},{"$f":"VLOOKUP(A340,'Counties and Regions'!$G$3:$J$74,3,FALSE)","v":"Richland County"},"Other Services","O"]
[{"$f":"IF(COUNTIF($A$9:A340,A340)<24,A340,A340+1)","v":14},{"$f":"VLOOKUP(A341,'Counties and Regions'!$G$3:$J$74,4,FALSE)","v":"Southern"},{"$f":"VLOOKUP(A341,'Counties and Regions'!$G$3:$J$74,3,FALSE)","v":"Richland County"},"Additional Services","F"]
[{"$f":"IF(COUNTIF($A$9:A341,A341)<24,A341,A341+1)","v":14},{"$f":"VLOOKUP(A342,'Counties and Regions'!$G$3:$J$74,4,FALSE)","v":"Southern"},{"$f":"VLOOKUP(A342,'Counties and Regions'!$G$3:$J$74,3,FALSE)","v":"Richland County"},"Additional Services","D"]
[{"$f":"IF(COUNTIF($A$9:A342,A342)<24,A342,A342+1)","v":14},{"$f":"VLOOKUP(A343,'Counties and Regions'!$G$3:$J$74,4,FALSE)","v":"Southern"},{"$f":"VLOOKUP(A343,'Counties and Regions'!$G$3:$J$74,3,FALSE)","v":"Richland County"},"Additional Services","B"]
[{"$f":"IF(COUNTIF($A$9:A343,A343)<24,A343,A343+1)","v":14},{"$f":"VLOOKUP(A344,'Counties and Regions'!$G$3:$J$74,4,FALSE)","v":"Southern"},{"$f":"VLOOKUP(A344,'Counties and Regions'!$G$3:$J$74,3,FALSE)","v":"Richland County"},"Additional Services","O"]
[{"$f":"IF(COUNTIF($A$9:A344,A344)<24,A344,A344+1)","v":15},{"$f":"VLOOKUP(A345,'Counties and Regions'!$G$3:$J$74,4,FALSE)","v":"Southern"},{"$f":"VLOOKUP(A345,'Counties and Regions'!$G$3:$J$74,3,FALSE)","v":"Rock County"},"Hospital Inpatient","F"]
[{"$f":"IF(COUNTIF($A$9:A345,A345)<24,A345,A345+1)","v":15},{"$f":"VLOOKUP(A346,'Counties and Regions'!$G$3:$J$74,4,FALSE)","v":"Southern"},{"$f":"VLOOKUP(A346,'Counties and Regions'!$G$3:$J$74,3,FALSE)","v":"Rock County"},"Hospital Inpatient","D"]
[{"$f":"IF(COUNTIF($A$9:A346,A346)<24,A346,A346+1)","v":15},{"$f":"VLOOKUP(A347,'Counties and Regions'!$G$3:$J$74,4,FALSE)","v":"Southern"},{"$f":"VLOOKUP(A347,'Counties and Regions'!$G$3:$J$74,3,FALSE)","v":"Rock County"},"Hospital Inpatient","B"]
[{"$f":"IF(COUNTIF($A$9:A347,A347)<24,A347,A347+1)","v":15},{"$f":"VLOOKUP(A348,'Counties and Regions'!$G$3:$J$74,4,FALSE)","v":"Southern"},{"$f":"VLOOKUP(A348,'Counties and Regions'!$G$3:$J$74,3,FALSE)","v":"Rock County"},"Hospital Inpatient","O"]
[{"$f":"IF(COUNTIF($A$9:A348,A348)<24,A348,A348+1)","v":15},{"$f":"VLOOKUP(A349,'Counties and Regions'!$G$3:$J$74,4,FALSE)","v":"Southern"},{"$f":"VLOOKUP(A349,'Counties and Regions'!$G$3:$J$74,3,FALSE)","v":"Rock County"},"Hospital Outpatient","F"]
[{"$f":"IF(COUNTIF($A$9:A349,A349)<24,A349,A349+1)","v":15},{"$f":"VLOOKUP(A350,'Counties and Regions'!$G$3:$J$74,4,FALSE)","v":"Southern"},{"$f":"VLOOKUP(A350,'Counties and Regions'!$G$3:$J$74,3,FALSE)","v":"Rock County"},"Hospital Outpatient","D"]
[{"$f":"IF(COUNTIF($A$9:A350,A350)<24,A350,A350+1)","v":15},{"$f":"VLOOKUP(A351,'Counties and Regions'!$G$3:$J$74,4,FALSE)","v":"Southern"},{"$f":"VLOOKUP(A351,'Counties and Regions'!$G$3:$J$74,3,FALSE)","v":"Rock County"},"Hospital Outpatient","B"]
[{"$f":"IF(COUNTIF($A$9:A351,A351)<24,A351,A351+1)","v":15},{"$f":"VLOOKUP(A352,'Counties and Regions'!$G$3:$J$74,4,FALSE)","v":"Southern"},{"$f":"VLOOKUP(A352,'Counties and Regions'!$G$3:$J$74,3,FALSE)","v":"Rock County"},"Hospital Outpatient","O"]
[{"$f":"IF(COUNTIF($A$9:A352,A352)<24,A352,A352+1)","v":15},{"$f":"VLOOKUP(A353,'Counties and Regions'!$G$3:$J$74,4,FALSE)","v":"Southern"},{"$f":"VLOOKUP(A353,'Counties and Regions'!$G$3:$J$74,3,FALSE)","v":"Rock County"},"Other Facility","F"]
[{"$f":"IF(COUNTIF($A$9:A353,A353)<24,A353,A353+1)","v":15},{"$f":"VLOOKUP(A354,'Counties and Regions'!$G$3:$J$74,4,FALSE)","v":"Southern"},{"$f":"VLOOKUP(A354,'Counties and Regions'!$G$3:$J$74,3,FALSE)","v":"Rock County"},"Other Facility","D"]
[{"$f":"IF(COUNTIF($A$9:A354,A354)<24,A354,A354+1)","v":15},{"$f":"VLOOKUP(A355,'Counties and Regions'!$G$3:$J$74,4,FALSE)","v":"Southern"},{"$f":"VLOOKUP(A355,'Counties and Regions'!$G$3:$J$74,3,FALSE)","v":"Rock County"},"Other Facility","B"]
[{"$f":"IF(COUNTIF($A$9:A355,A355)<24,A355,A355+1)","v":15},{"$f":"VLOOKUP(A356,'Counties and Regions'!$G$3:$J$74,4,FALSE)","v":"Southern"},{"$f":"VLOOKUP(A356,'Counties and Regions'!$G$3:$J$74,3,FALSE)","v":"Rock County"},"Other Facility","O"]
[{"$f":"IF(COUNTIF($A$9:A356,A356)<24,A356,A356+1)","v":15},{"$f":"VLOOKUP(A357,'Counties and Regions'!$G$3:$J$74,4,FALSE)","v":"Southern"},{"$f":"VLOOKUP(A357,'Counties and Regions'!$G$3:$J$74,3,FALSE)","v":"Rock County"},"Physician Services","F"]
[{"$f":"IF(COUNTIF($A$9:A357,A357)<24,A357,A357+1)","v":15},{"$f":"VLOOKUP(A358,'Counties and Regions'!$G$3:$J$74,4,FALSE)","v":"Southern"},{"$f":"VLOOKUP(A358,'Counties and Regions'!$G$3:$J$74,3,FALSE)","v":"Rock County"},"Physician Services","D"]
[{"$f":"IF(COUNTIF($A$9:A358,A358)<24,A358,A358+1)","v":15},{"$f":"VLOOKUP(A359,'Counties and Regions'!$G$3:$J$74,4,FALSE)","v":"Southern"},{"$f":"VLOOKUP(A359,'Counties and Regions'!$G$3:$J$74,3,FALSE)","v":"Rock County"},"Physician Services","B"]
[{"$f":"IF(COUNTIF($A$9:A359,A359)<24,A359,A359+1)","v":15},{"$f":"VLOOKUP(A360,'Counties and Regions'!$G$3:$J$74,4,FALSE)","v":"Southern"},{"$f":"VLOOKUP(A360,'Counties and Regions'!$G$3:$J$74,3,FALSE)","v":"Rock County"},"Physician Services","O"]
[{"$f":"IF(COUNTIF($A$9:A360,A360)<24,A360,A360+1)","v":15},{"$f":"VLOOKUP(A361,'Counties and Regions'!$G$3:$J$74,4,FALSE)","v":"Southern"},{"$f":"VLOOKUP(A361,'Counties and Regions'!$G$3:$J$74,3,FALSE)","v":"Rock County"},"Other Services","F"]
[{"$f":"IF(COUNTIF($A$9:A361,A361)<24,A361,A361+1)","v":15},{"$f":"VLOOKUP(A362,'Counties and Regions'!$G$3:$J$74,4,FALSE)","v":"Southern"},{"$f":"VLOOKUP(A362,'Counties and Regions'!$G$3:$J$74,3,FALSE)","v":"Rock County"},"Other Services","D"]
[{"$f":"IF(COUNTIF($A$9:A362,A362)<24,A362,A362+1)","v":15},{"$f":"VLOOKUP(A363,'Counties and Regions'!$G$3:$J$74,4,FALSE)","v":"Southern"},{"$f":"VLOOKUP(A363,'Counties and Regions'!$G$3:$J$74,3,FALSE)","v":"Rock County"},"Other Services","B"]
[{"$f":"IF(COUNTIF($A$9:A363,A363)<24,A363,A363+1)","v":15},{"$f":"VLOOKUP(A364,'Counties and Regions'!$G$3:$J$74,4,FALSE)","v":"Southern"},{"$f":"VLOOKUP(A364,'Counties and Regions'!$G$3:$J$74,3,FALSE)","v":"Rock County"},"Other Services","O"]
[{"$f":"IF(COUNTIF($A$9:A364,A364)<24,A364,A364+1)","v":15},{"$f":"VLOOKUP(A365,'Counties and Regions'!$G$3:$J$74,4,FALSE)","v":"Southern"},{"$f":"VLOOKUP(A365,'Counties and Regions'!$G$3:$J$74,3,FALSE)","v":"Rock County"},"Additional Services","F"]
[{"$f":"IF(COUNTIF($A$9:A365,A365)<24,A365,A365+1)","v":15},{"$f":"VLOOKUP(A366,'Counties and Regions'!$G$3:$J$74,4,FALSE)","v":"Southern"},{"$f":"VLOOKUP(A366,'Counties and Regions'!$G$3:$J$74,3,FALSE)","v":"Rock County"},"Additional Services","D"]
[{"$f":"IF(COUNTIF($A$9:A366,A366)<24,A366,A366+1)","v":15},{"$f":"VLOOKUP(A367,'Counties and Regions'!$G$3:$J$74,4,FALSE)","v":"Southern"},{"$f":"VLOOKUP(A367,'Counties and Regions'!$G$3:$J$74,3,FALSE)","v":"Rock County"},"Additional Services","B"]
[{"$f":"IF(COUNTIF($A$9:A367,A367)<24,A367,A367+1)","v":15},{"$f":"VLOOKUP(A368,'Counties and Regions'!$G$3:$J$74,4,FALSE)","v":"Southern"},{"$f":"VLOOKUP(A368,'Counties and Regions'!$G$3:$J$74,3,FALSE)","v":"Rock County"},"Additional Services","O"]
[{"$f":"IF(COUNTIF($A$9:A368,A368)<24,A368,A368+1)","v":16},{"$f":"VLOOKUP(A369,'Counties and Regions'!$G$3:$J$74,4,FALSE)","v":"Southern"},{"$f":"VLOOKUP(A369,'Counties and Regions'!$G$3:$J$74,3,FALSE)","v":"Sauk County"},"Hospital Inpatient","F"]
[{"$f":"IF(COUNTIF($A$9:A369,A369)<24,A369,A369+1)","v":16},{"$f":"VLOOKUP(A370,'Counties and Regions'!$G$3:$J$74,4,FALSE)","v":"Southern"},{"$f":"VLOOKUP(A370,'Counties and Regions'!$G$3:$J$74,3,FALSE)","v":"Sauk County"},"Hospital Inpatient","D"]
[{"$f":"IF(COUNTIF($A$9:A370,A370)<24,A370,A370+1)","v":16},{"$f":"VLOOKUP(A371,'Counties and Regions'!$G$3:$J$74,4,FALSE)","v":"Southern"},{"$f":"VLOOKUP(A371,'Counties and Regions'!$G$3:$J$74,3,FALSE)","v":"Sauk County"},"Hospital Inpatient","B"]
[{"$f":"IF(COUNTIF($A$9:A371,A371)<24,A371,A371+1)","v":16},{"$f":"VLOOKUP(A372,'Counties and Regions'!$G$3:$J$74,4,FALSE)","v":"Southern"},{"$f":"VLOOKUP(A372,'Counties and Regions'!$G$3:$J$74,3,FALSE)","v":"Sauk County"},"Hospital Inpatient","O"]
[{"$f":"IF(COUNTIF($A$9:A372,A372)<24,A372,A372+1)","v":16},{"$f":"VLOOKUP(A373,'Counties and Regions'!$G$3:$J$74,4,FALSE)","v":"Southern"},{"$f":"VLOOKUP(A373,'Counties and Regions'!$G$3:$J$74,3,FALSE)","v":"Sauk County"},"Hospital Outpatient","F"]
[{"$f":"IF(COUNTIF($A$9:A373,A373)<24,A373,A373+1)","v":16},{"$f":"VLOOKUP(A374,'Counties and Regions'!$G$3:$J$74,4,FALSE)","v":"Southern"},{"$f":"VLOOKUP(A374,'Counties and Regions'!$G$3:$J$74,3,FALSE)","v":"Sauk County"},"Hospital Outpatient","D"]
[{"$f":"IF(COUNTIF($A$9:A374,A374)<24,A374,A374+1)","v":16},{"$f":"VLOOKUP(A375,'Counties and Regions'!$G$3:$J$74,4,FALSE)","v":"Southern"},{"$f":"VLOOKUP(A375,'Counties and Regions'!$G$3:$J$74,3,FALSE)","v":"Sauk County"},"Hospital Outpatient","B"]
[{"$f":"IF(COUNTIF($A$9:A375,A375)<24,A375,A375+1)","v":16},{"$f":"VLOOKUP(A376,'Counties and Regions'!$G$3:$J$74,4,FALSE)","v":"Southern"},{"$f":"VLOOKUP(A376,'Counties and Regions'!$G$3:$J$74,3,FALSE)","v":"Sauk County"},"Hospital Outpatient","O"]
[{"$f":"IF(COUNTIF($A$9:A376,A376)<24,A376,A376+1)","v":16},{"$f":"VLOOKUP(A377,'Counties and Regions'!$G$3:$J$74,4,FALSE)","v":"Southern"},{"$f":"VLOOKUP(A377,'Counties and Regions'!$G$3:$J$74,3,FALSE)","v":"Sauk County"},"Other Facility","F"]
[{"$f":"IF(COUNTIF($A$9:A377,A377)<24,A377,A377+1)","v":16},{"$f":"VLOOKUP(A378,'Counties and Regions'!$G$3:$J$74,4,FALSE)","v":"Southern"},{"$f":"VLOOKUP(A378,'Counties and Regions'!$G$3:$J$74,3,FALSE)","v":"Sauk County"},"Other Facility","D"]
[{"$f":"IF(COUNTIF($A$9:A378,A378)<24,A378,A378+1)","v":16},{"$f":"VLOOKUP(A379,'Counties and Regions'!$G$3:$J$74,4,FALSE)","v":"Southern"},{"$f":"VLOOKUP(A379,'Counties and Regions'!$G$3:$J$74,3,FALSE)","v":"Sauk County"},"Other Facility","B"]
[{"$f":"IF(COUNTIF($A$9:A379,A379)<24,A379,A379+1)","v":16},{"$f":"VLOOKUP(A380,'Counties and Regions'!$G$3:$J$74,4,FALSE)","v":"Southern"},{"$f":"VLOOKUP(A380,'Counties and Regions'!$G$3:$J$74,3,FALSE)","v":"Sauk County"},"Other Facility","O"]
[{"$f":"IF(COUNTIF($A$9:A380,A380)<24,A380,A380+1)","v":16},{"$f":"VLOOKUP(A381,'Counties and Regions'!$G$3:$J$74,4,FALSE)","v":"Southern"},{"$f":"VLOOKUP(A381,'Counties and Regions'!$G$3:$J$74,3,FALSE)","v":"Sauk County"},"Physician Services","F"]
[{"$f":"IF(COUNTIF($A$9:A381,A381)<24,A381,A381+1)","v":16},{"$f":"VLOOKUP(A382,'Counties and Regions'!$G$3:$J$74,4,FALSE)","v":"Southern"},{"$f":"VLOOKUP(A382,'Counties and Regions'!$G$3:$J$74,3,FALSE)","v":"Sauk County"},"Physician Services","D"]
[{"$f":"IF(COUNTIF($A$9:A382,A382)<24,A382,A382+1)","v":16},{"$f":"VLOOKUP(A383,'Counties and Regions'!$G$3:$J$74,4,FALSE)","v":"Southern"},{"$f":"VLOOKUP(A383,'Counties and Regions'!$G$3:$J$74,3,FALSE)","v":"Sauk County"},"Physician Services","B"]
[{"$f":"IF(COUNTIF($A$9:A383,A383)<24,A383,A383+1)","v":16},{"$f":"VLOOKUP(A384,'Counties and Regions'!$G$3:$J$74,4,FALSE)","v":"Southern"},{"$f":"VLOOKUP(A384,'Counties and Regions'!$G$3:$J$74,3,FALSE)","v":"Sauk County"},"Physician Services","O"]
[{"$f":"IF(COUNTIF($A$9:A384,A384)<24,A384,A384+1)","v":16},{"$f":"VLOOKUP(A385,'Counties and Regions'!$G$3:$J$74,4,FALSE)","v":"Southern"},{"$f":"VLOOKUP(A385,'Counties and Regions'!$G$3:$J$74,3,FALSE)","v":"Sauk County"},"Other Services","F"]
[{"$f":"IF(COUNTIF($A$9:A385,A385)<24,A385,A385+1)","v":16},{"$f":"VLOOKUP(A386,'Counties and Regions'!$G$3:$J$74,4,FALSE)","v":"Southern"},{"$f":"VLOOKUP(A386,'Counties and Regions'!$G$3:$J$74,3,FALSE)","v":"Sauk County"},"Other Services","D"]
[{"$f":"IF(COUNTIF($A$9:A386,A386)<24,A386,A386+1)","v":16},{"$f":"VLOOKUP(A387,'Counties and Regions'!$G$3:$J$74,4,FALSE)","v":"Southern"},{"$f":"VLOOKUP(A387,'Counties and Regions'!$G$3:$J$74,3,FALSE)","v":"Sauk County"},"Other Services","B"]
[{"$f":"IF(COUNTIF($A$9:A387,A387)<24,A387,A387+1)","v":16},{"$f":"VLOOKUP(A388,'Counties and Regions'!$G$3:$J$74,4,FALSE)","v":"Southern"},{"$f":"VLOOKUP(A388,'Counties and Regions'!$G$3:$J$74,3,FALSE)","v":"Sauk County"},"Other Services","O"]
[{"$f":"IF(COUNTIF($A$9:A388,A388)<24,A388,A388+1)","v":16},{"$f":"VLOOKUP(A389,'Counties and Regions'!$G$3:$J$74,4,FALSE)","v":"Southern"},{"$f":"VLOOKUP(A389,'Counties and Regions'!$G$3:$J$74,3,FALSE)","v":"Sauk County"},"Additional Services","F"]
[{"$f":"IF(COUNTIF($A$9:A389,A389)<24,A389,A389+1)","v":16},{"$f":"VLOOKUP(A390,'Counties and Regions'!$G$3:$J$74,4,FALSE)","v":"Southern"},{"$f":"VLOOKUP(A390,'Counties and Regions'!$G$3:$J$74,3,FALSE)","v":"Sauk County"},"Additional Services","D"]
[{"$f":"IF(COUNTIF($A$9:A390,A390)<24,A390,A390+1)","v":16},{"$f":"VLOOKUP(A391,'Counties and Regions'!$G$3:$J$74,4,FALSE)","v":"Southern"},{"$f":"VLOOKUP(A391,'Counties and Regions'!$G$3:$J$74,3,FALSE)","v":"Sauk County"},"Additional Services","B"]
[{"$f":"IF(COUNTIF($A$9:A391,A391)<24,A391,A391+1)","v":16},{"$f":"VLOOKUP(A392,'Counties and Regions'!$G$3:$J$74,4,FALSE)","v":"Southern"},{"$f":"VLOOKUP(A392,'Counties and Regions'!$G$3:$J$74,3,FALSE)","v":"Sauk County"},"Additional Services","O"]
[{"$f":"IF(COUNTIF($A$9:A392,A392)<24,A392,A392+1)","v":17},{"$f":"VLOOKUP(A393,'Counties and Regions'!$G$3:$J$74,4,FALSE)","v":"Southern"},{"$f":"VLOOKUP(A393,'Counties and Regions'!$G$3:$J$74,3,FALSE)","v":"Vernon County"},"Hospital Inpatient","F"]
[{"$f":"IF(COUNTIF($A$9:A393,A393)<24,A393,A393+1)","v":17},{"$f":"VLOOKUP(A394,'Counties and Regions'!$G$3:$J$74,4,FALSE)","v":"Southern"},{"$f":"VLOOKUP(A394,'Counties and Regions'!$G$3:$J$74,3,FALSE)","v":"Vernon County"},"Hospital Inpatient","D"]
[{"$f":"IF(COUNTIF($A$9:A394,A394)<24,A394,A394+1)","v":17},{"$f":"VLOOKUP(A395,'Counties and Regions'!$G$3:$J$74,4,FALSE)","v":"Southern"},{"$f":"VLOOKUP(A395,'Counties and Regions'!$G$3:$J$74,3,FALSE)","v":"Vernon County"},"Hospital Inpatient","B"]
[{"$f":"IF(COUNTIF($A$9:A395,A395)<24,A395,A395+1)","v":17},{"$f":"VLOOKUP(A396,'Counties and Regions'!$G$3:$J$74,4,FALSE)","v":"Southern"},{"$f":"VLOOKUP(A396,'Counties and Regions'!$G$3:$J$74,3,FALSE)","v":"Vernon County"},"Hospital Inpatient","O"]
[{"$f":"IF(COUNTIF($A$9:A396,A396)<24,A396,A396+1)","v":17},{"$f":"VLOOKUP(A397,'Counties and Regions'!$G$3:$J$74,4,FALSE)","v":"Southern"},{"$f":"VLOOKUP(A397,'Counties and Regions'!$G$3:$J$74,3,FALSE)","v":"Vernon County"},"Hospital Outpatient","F"]
[{"$f":"IF(COUNTIF($A$9:A397,A397)<24,A397,A397+1)","v":17},{"$f":"VLOOKUP(A398,'Counties and Regions'!$G$3:$J$74,4,FALSE)","v":"Southern"},{"$f":"VLOOKUP(A398,'Counties and Regions'!$G$3:$J$74,3,FALSE)","v":"Vernon County"},"Hospital Outpatient","D"]
[{"$f":"IF(COUNTIF($A$9:A398,A398)<24,A398,A398+1)","v":17},{"$f":"VLOOKUP(A399,'Counties and Regions'!$G$3:$J$74,4,FALSE)","v":"Southern"},{"$f":"VLOOKUP(A399,'Counties and Regions'!$G$3:$J$74,3,FALSE)","v":"Vernon County"},"Hospital Outpatient","B"]
[{"$f":"IF(COUNTIF($A$9:A399,A399)<24,A399,A399+1)","v":17},{"$f":"VLOOKUP(A400,'Counties and Regions'!$G$3:$J$74,4,FALSE)","v":"Southern"},{"$f":"VLOOKUP(A400,'Counties and Regions'!$G$3:$J$74,3,FALSE)","v":"Vernon County"},"Hospital Outpatient","O"]
[{"$f":"IF(COUNTIF($A$9:A400,A400)<24,A400,A400+1)","v":17},{"$f":"VLOOKUP(A401,'Counties and Regions'!$G$3:$J$74,4,FALSE)","v":"Southern"},{"$f":"VLOOKUP(A401,'Counties and Regions'!$G$3:$J$74,3,FALSE)","v":"Vernon County"},"Other Facility","F"]
[{"$f":"IF(COUNTIF($A$9:A401,A401)<24,A401,A401+1)","v":17},{"$f":"VLOOKUP(A402,'Counties and Regions'!$G$3:$J$74,4,FALSE)","v":"Southern"},{"$f":"VLOOKUP(A402,'Counties and Regions'!$G$3:$J$74,3,FALSE)","v":"Vernon County"},"Other Facility","D"]
[{"$f":"IF(COUNTIF($A$9:A402,A402)<24,A402,A402+1)","v":17},{"$f":"VLOOKUP(A403,'Counties and Regions'!$G$3:$J$74,4,FALSE)","v":"Southern"},{"$f":"VLOOKUP(A403,'Counties and Regions'!$G$3:$J$74,3,FALSE)","v":"Vernon County"},"Other Facility","B"]
[{"$f":"IF(COUNTIF($A$9:A403,A403)<24,A403,A403+1)","v":17},{"$f":"VLOOKUP(A404,'Counties and Regions'!$G$3:$J$74,4,FALSE)","v":"Southern"},{"$f":"VLOOKUP(A404,'Counties and Regions'!$G$3:$J$74,3,FALSE)","v":"Vernon County"},"Other Facility","O"]
[{"$f":"IF(COUNTIF($A$9:A404,A404)<24,A404,A404+1)","v":17},{"$f":"VLOOKUP(A405,'Counties and Regions'!$G$3:$J$74,4,FALSE)","v":"Southern"},{"$f":"VLOOKUP(A405,'Counties and Regions'!$G$3:$J$74,3,FALSE)","v":"Vernon County"},"Physician Services","F"]
[{"$f":"IF(COUNTIF($A$9:A405,A405)<24,A405,A405+1)","v":17},{"$f":"VLOOKUP(A406,'Counties and Regions'!$G$3:$J$74,4,FALSE)","v":"Southern"},{"$f":"VLOOKUP(A406,'Counties and Regions'!$G$3:$J$74,3,FALSE)","v":"Vernon County"},"Physician Services","D"]
[{"$f":"IF(COUNTIF($A$9:A406,A406)<24,A406,A406+1)","v":17},{"$f":"VLOOKUP(A407,'Counties and Regions'!$G$3:$J$74,4,FALSE)","v":"Southern"},{"$f":"VLOOKUP(A407,'Counties and Regions'!$G$3:$J$74,3,FALSE)","v":"Vernon County"},"Physician Services","B"]
[{"$f":"IF(COUNTIF($A$9:A407,A407)<24,A407,A407+1)","v":17},{"$f":"VLOOKUP(A408,'Counties and Regions'!$G$3:$J$74,4,FALSE)","v":"Southern"},{"$f":"VLOOKUP(A408,'Counties and Regions'!$G$3:$J$74,3,FALSE)","v":"Vernon County"},"Physician Services","O"]
[{"$f":"IF(COUNTIF($A$9:A408,A408)<24,A408,A408+1)","v":17},{"$f":"VLOOKUP(A409,'Counties and Regions'!$G$3:$J$74,4,FALSE)","v":"Southern"},{"$f":"VLOOKUP(A409,'Counties and Regions'!$G$3:$J$74,3,FALSE)","v":"Vernon County"},"Other Services","F"]
[{"$f":"IF(COUNTIF($A$9:A409,A409)<24,A409,A409+1)","v":17},{"$f":"VLOOKUP(A410,'Counties and Regions'!$G$3:$J$74,4,FALSE)","v":"Southern"},{"$f":"VLOOKUP(A410,'Counties and Regions'!$G$3:$J$74,3,FALSE)","v":"Vernon County"},"Other Services","D"]
[{"$f":"IF(COUNTIF($A$9:A410,A410)<24,A410,A410+1)","v":17},{"$f":"VLOOKUP(A411,'Counties and Regions'!$G$3:$J$74,4,FALSE)","v":"Southern"},{"$f":"VLOOKUP(A411,'Counties and Regions'!$G$3:$J$74,3,FALSE)","v":"Vernon County"},"Other Services","B"]
[{"$f":"IF(COUNTIF($A$9:A411,A411)<24,A411,A411+1)","v":17},{"$f":"VLOOKUP(A412,'Counties and Regions'!$G$3:$J$74,4,FALSE)","v":"Southern"},{"$f":"VLOOKUP(A412,'Counties and Regions'!$G$3:$J$74,3,FALSE)","v":"Vernon County"},"Other Services","O"]
[{"$f":"IF(COUNTIF($A$9:A412,A412)<24,A412,A412+1)","v":17},{"$f":"VLOOKUP(A413,'Counties and Regions'!$G$3:$J$74,4,FALSE)","v":"Southern"},{"$f":"VLOOKUP(A413,'Counties and Regions'!$G$3:$J$74,3,FALSE)","v":"Vernon County"},"Additional Services","F"]
[{"$f":"IF(COUNTIF($A$9:A413,A413)<24,A413,A413+1)","v":17},{"$f":"VLOOKUP(A414,'Counties and Regions'!$G$3:$J$74,4,FALSE)","v":"Southern"},{"$f":"VLOOKUP(A414,'Counties and Regions'!$G$3:$J$74,3,FALSE)","v":"Vernon County"},"Additional Services","D"]
[{"$f":"IF(COUNTIF($A$9:A414,A414)<24,A414,A414+1)","v":17},{"$f":"VLOOKUP(A415,'Counties and Regions'!$G$3:$J$74,4,FALSE)","v":"Southern"},{"$f":"VLOOKUP(A415,'Counties and Regions'!$G$3:$J$74,3,FALSE)","v":"Vernon County"},"Additional Services","B"]
[{"$f":"IF(COUNTIF($A$9:A415,A415)<24,A415,A415+1)","v":17},{"$f":"VLOOKUP(A416,'Counties and Regions'!$G$3:$J$74,4,FALSE)","v":"Southern"},{"$f":"VLOOKUP(A416,'Counties and Regions'!$G$3:$J$74,3,FALSE)","v":"Vernon County"},"Additional Services","O"]
[{"$f":"IF(COUNTIF($A$9:A416,A416)<24,A416,A416+1)","v":18},{"$f":"VLOOKUP(A417,'Counties and Regions'!$G$3:$J$74,4,FALSE)","v":"Southern"},{"$f":"VLOOKUP(A417,'Counties and Regions'!$G$3:$J$74,3,FALSE)","v":"Walworth County"},"Hospital Inpatient","F"]
[{"$f":"IF(COUNTIF($A$9:A417,A417)<24,A417,A417+1)","v":18},{"$f":"VLOOKUP(A418,'Counties and Regions'!$G$3:$J$74,4,FALSE)","v":"Southern"},{"$f":"VLOOKUP(A418,'Counties and Regions'!$G$3:$J$74,3,FALSE)","v":"Walworth County"},"Hospital Inpatient","D"]
[{"$f":"IF(COUNTIF($A$9:A418,A418)<24,A418,A418+1)","v":18},{"$f":"VLOOKUP(A419,'Counties and Regions'!$G$3:$J$74,4,FALSE)","v":"Southern"},{"$f":"VLOOKUP(A419,'Counties and Regions'!$G$3:$J$74,3,FALSE)","v":"Walworth County"},"Hospital Inpatient","B"]
[{"$f":"IF(COUNTIF($A$9:A419,A419)<24,A419,A419+1)","v":18},{"$f":"VLOOKUP(A420,'Counties and Regions'!$G$3:$J$74,4,FALSE)","v":"Southern"},{"$f":"VLOOKUP(A420,'Counties and Regions'!$G$3:$J$74,3,FALSE)","v":"Walworth County"},"Hospital Inpatient","O"]
[{"$f":"IF(COUNTIF($A$9:A420,A420)<24,A420,A420+1)","v":18},{"$f":"VLOOKUP(A421,'Counties and Regions'!$G$3:$J$74,4,FALSE)","v":"Southern"},{"$f":"VLOOKUP(A421,'Counties and Regions'!$G$3:$J$74,3,FALSE)","v":"Walworth County"},"Hospital Outpatient","F"]
[{"$f":"IF(COUNTIF($A$9:A421,A421)<24,A421,A421+1)","v":18},{"$f":"VLOOKUP(A422,'Counties and Regions'!$G$3:$J$74,4,FALSE)","v":"Southern"},{"$f":"VLOOKUP(A422,'Counties and Regions'!$G$3:$J$74,3,FALSE)","v":"Walworth County"},"Hospital Outpatient","D"]
[{"$f":"IF(COUNTIF($A$9:A422,A422)<24,A422,A422+1)","v":18},{"$f":"VLOOKUP(A423,'Counties and Regions'!$G$3:$J$74,4,FALSE)","v":"Southern"},{"$f":"VLOOKUP(A423,'Counties and Regions'!$G$3:$J$74,3,FALSE)","v":"Walworth County"},"Hospital Outpatient","B"]
[{"$f":"IF(COUNTIF($A$9:A423,A423)<24,A423,A423+1)","v":18},{"$f":"VLOOKUP(A424,'Counties and Regions'!$G$3:$J$74,4,FALSE)","v":"Southern"},{"$f":"VLOOKUP(A424,'Counties and Regions'!$G$3:$J$74,3,FALSE)","v":"Walworth County"},"Hospital Outpatient","O"]
[{"$f":"IF(COUNTIF($A$9:A424,A424)<24,A424,A424+1)","v":18},{"$f":"VLOOKUP(A425,'Counties and Regions'!$G$3:$J$74,4,FALSE)","v":"Southern"},{"$f":"VLOOKUP(A425,'Counties and Regions'!$G$3:$J$74,3,FALSE)","v":"Walworth County"},"Other Facility","F"]
[{"$f":"IF(COUNTIF($A$9:A425,A425)<24,A425,A425+1)","v":18},{"$f":"VLOOKUP(A426,'Counties and Regions'!$G$3:$J$74,4,FALSE)","v":"Southern"},{"$f":"VLOOKUP(A426,'Counties and Regions'!$G$3:$J$74,3,FALSE)","v":"Walworth County"},"Other Facility","D"]
[{"$f":"IF(COUNTIF($A$9:A426,A426)<24,A426,A426+1)","v":18},{"$f":"VLOOKUP(A427,'Counties and Regions'!$G$3:$J$74,4,FALSE)","v":"Southern"},{"$f":"VLOOKUP(A427,'Counties and Regions'!$G$3:$J$74,3,FALSE)","v":"Walworth County"},"Other Facility","B"]
[{"$f":"IF(COUNTIF($A$9:A427,A427)<24,A427,A427+1)","v":18},{"$f":"VLOOKUP(A428,'Counties and Regions'!$G$3:$J$74,4,FALSE)","v":"Southern"},{"$f":"VLOOKUP(A428,'Counties and Regions'!$G$3:$J$74,3,FALSE)","v":"Walworth County"},"Other Facility","O"]
[{"$f":"IF(COUNTIF($A$9:A428,A428)<24,A428,A428+1)","v":18},{"$f":"VLOOKUP(A429,'Counties and Regions'!$G$3:$J$74,4,FALSE)","v":"Southern"},{"$f":"VLOOKUP(A429,'Counties and Regions'!$G$3:$J$74,3,FALSE)","v":"Walworth County"},"Physician Services","F"]
[{"$f":"IF(COUNTIF($A$9:A429,A429)<24,A429,A429+1)","v":18},{"$f":"VLOOKUP(A430,'Counties and Regions'!$G$3:$J$74,4,FALSE)","v":"Southern"},{"$f":"VLOOKUP(A430,'Counties and Regions'!$G$3:$J$74,3,FALSE)","v":"Walworth County"},"Physician Services","D"]
[{"$f":"IF(COUNTIF($A$9:A430,A430)<24,A430,A430+1)","v":18},{"$f":"VLOOKUP(A431,'Counties and Regions'!$G$3:$J$74,4,FALSE)","v":"Southern"},{"$f":"VLOOKUP(A431,'Counties and Regions'!$G$3:$J$74,3,FALSE)","v":"Walworth County"},"Physician Services","B"]
[{"$f":"IF(COUNTIF($A$9:A431,A431)<24,A431,A431+1)","v":18},{"$f":"VLOOKUP(A432,'Counties and Regions'!$G$3:$J$74,4,FALSE)","v":"Southern"},{"$f":"VLOOKUP(A432,'Counties and Regions'!$G$3:$J$74,3,FALSE)","v":"Walworth County"},"Physician Services","O"]
[{"$f":"IF(COUNTIF($A$9:A432,A432)<24,A432,A432+1)","v":18},{"$f":"VLOOKUP(A433,'Counties and Regions'!$G$3:$J$74,4,FALSE)","v":"Southern"},{"$f":"VLOOKUP(A433,'Counties and Regions'!$G$3:$J$74,3,FALSE)","v":"Walworth County"},"Other Services","F"]
[{"$f":"IF(COUNTIF($A$9:A433,A433)<24,A433,A433+1)","v":18},{"$f":"VLOOKUP(A434,'Counties and Regions'!$G$3:$J$74,4,FALSE)","v":"Southern"},{"$f":"VLOOKUP(A434,'Counties and Regions'!$G$3:$J$74,3,FALSE)","v":"Walworth County"},"Other Services","D"]
[{"$f":"IF(COUNTIF($A$9:A434,A434)<24,A434,A434+1)","v":18},{"$f":"VLOOKUP(A435,'Counties and Regions'!$G$3:$J$74,4,FALSE)","v":"Southern"},{"$f":"VLOOKUP(A435,'Counties and Regions'!$G$3:$J$74,3,FALSE)","v":"Walworth County"},"Other Services","B"]
[{"$f":"IF(COUNTIF($A$9:A435,A435)<24,A435,A435+1)","v":18},{"$f":"VLOOKUP(A436,'Counties and Regions'!$G$3:$J$74,4,FALSE)","v":"Southern"},{"$f":"VLOOKUP(A436,'Counties and Regions'!$G$3:$J$74,3,FALSE)","v":"Walworth County"},"Other Services","O"]
[{"$f":"IF(COUNTIF($A$9:A436,A436)<24,A436,A436+1)","v":18},{"$f":"VLOOKUP(A437,'Counties and Regions'!$G$3:$J$74,4,FALSE)","v":"Southern"},{"$f":"VLOOKUP(A437,'Counties and Regions'!$G$3:$J$74,3,FALSE)","v":"Walworth County"},"Additional Services","F"]
[{"$f":"IF(COUNTIF($A$9:A437,A437)<24,A437,A437+1)","v":18},{"$f":"VLOOKUP(A438,'Counties and Regions'!$G$3:$J$74,4,FALSE)","v":"Southern"},{"$f":"VLOOKUP(A438,'Counties and Regions'!$G$3:$J$74,3,FALSE)","v":"Walworth County"},"Additional Services","D"]
[{"$f":"IF(COUNTIF($A$9:A438,A438)<24,A438,A438+1)","v":18},{"$f":"VLOOKUP(A439,'Counties and Regions'!$G$3:$J$74,4,FALSE)","v":"Southern"},{"$f":"VLOOKUP(A439,'Counties and Regions'!$G$3:$J$74,3,FALSE)","v":"Walworth County"},"Additional Services","B"]
[{"$f":"IF(COUNTIF($A$9:A439,A439)<24,A439,A439+1)","v":18},{"$f":"VLOOKUP(A440,'Counties and Regions'!$G$3:$J$74,4,FALSE)","v":"Southern"},{"$f":"VLOOKUP(A440,'Counties and Regions'!$G$3:$J$74,3,FALSE)","v":"Walworth County"},"Additional Services","O"]
[{"$f":"IF(COUNTIF($A$9:A440,A440)<24,A440,A440+1)","v":19},{"$f":"VLOOKUP(A441,'Counties and Regions'!$G$3:$J$74,4,FALSE)","v":"Eastern"},{"$f":"VLOOKUP(A441,'Counties and Regions'!$G$3:$J$74,3,FALSE)","v":"Kenosha County"},"Hospital Inpatient","F"]
[{"$f":"IF(COUNTIF($A$9:A441,A441)<24,A441,A441+1)","v":19},{"$f":"VLOOKUP(A442,'Counties and Regions'!$G$3:$J$74,4,FALSE)","v":"Eastern"},{"$f":"VLOOKUP(A442,'Counties and Regions'!$G$3:$J$74,3,FALSE)","v":"Kenosha County"},"Hospital Inpatient","D"]
[{"$f":"IF(COUNTIF($A$9:A442,A442)<24,A442,A442+1)","v":19},{"$f":"VLOOKUP(A443,'Counties and Regions'!$G$3:$J$74,4,FALSE)","v":"Eastern"},{"$f":"VLOOKUP(A443,'Counties and Regions'!$G$3:$J$74,3,FALSE)","v":"Kenosha County"},"Hospital Inpatient","B"]
[{"$f":"IF(COUNTIF($A$9:A443,A443)<24,A443,A443+1)","v":19},{"$f":"VLOOKUP(A444,'Counties and Regions'!$G$3:$J$74,4,FALSE)","v":"Eastern"},{"$f":"VLOOKUP(A444,'Counties and Regions'!$G$3:$J$74,3,FALSE)","v":"Kenosha County"},"Hospital Inpatient","O"]
[{"$f":"IF(COUNTIF($A$9:A444,A444)<24,A444,A444+1)","v":19},{"$f":"VLOOKUP(A445,'Counties and Regions'!$G$3:$J$74,4,FALSE)","v":"Eastern"},{"$f":"VLOOKUP(A445,'Counties and Regions'!$G$3:$J$74,3,FALSE)","v":"Kenosha County"},"Hospital Outpatient","F"]
[{"$f":"IF(COUNTIF($A$9:A445,A445)<24,A445,A445+1)","v":19},{"$f":"VLOOKUP(A446,'Counties and Regions'!$G$3:$J$74,4,FALSE)","v":"Eastern"},{"$f":"VLOOKUP(A446,'Counties and Regions'!$G$3:$J$74,3,FALSE)","v":"Kenosha County"},"Hospital Outpatient","D"]
[{"$f":"IF(COUNTIF($A$9:A446,A446)<24,A446,A446+1)","v":19},{"$f":"VLOOKUP(A447,'Counties and Regions'!$G$3:$J$74,4,FALSE)","v":"Eastern"},{"$f":"VLOOKUP(A447,'Counties and Regions'!$G$3:$J$74,3,FALSE)","v":"Kenosha County"},"Hospital Outpatient","B"]
[{"$f":"IF(COUNTIF($A$9:A447,A447)<24,A447,A447+1)","v":19},{"$f":"VLOOKUP(A448,'Counties and Regions'!$G$3:$J$74,4,FALSE)","v":"Eastern"},{"$f":"VLOOKUP(A448,'Counties and Regions'!$G$3:$J$74,3,FALSE)","v":"Kenosha County"},"Hospital Outpatient","O"]
[{"$f":"IF(COUNTIF($A$9:A448,A448)<24,A448,A448+1)","v":19},{"$f":"VLOOKUP(A449,'Counties and Regions'!$G$3:$J$74,4,FALSE)","v":"Eastern"},{"$f":"VLOOKUP(A449,'Counties and Regions'!$G$3:$J$74,3,FALSE)","v":"Kenosha County"},"Other Facility","F"]
[{"$f":"IF(COUNTIF($A$9:A449,A449)<24,A449,A449+1)","v":19},{"$f":"VLOOKUP(A450,'Counties and Regions'!$G$3:$J$74,4,FALSE)","v":"Eastern"},{"$f":"VLOOKUP(A450,'Counties and Regions'!$G$3:$J$74,3,FALSE)","v":"Kenosha County"},"Other Facility","D"]
[{"$f":"IF(COUNTIF($A$9:A450,A450)<24,A450,A450+1)","v":19},{"$f":"VLOOKUP(A451,'Counties and Regions'!$G$3:$J$74,4,FALSE)","v":"Eastern"},{"$f":"VLOOKUP(A451,'Counties and Regions'!$G$3:$J$74,3,FALSE)","v":"Kenosha County"},"Other Facility","B"]
[{"$f":"IF(COUNTIF($A$9:A451,A451)<24,A451,A451+1)","v":19},{"$f":"VLOOKUP(A452,'Counties and Regions'!$G$3:$J$74,4,FALSE)","v":"Eastern"},{"$f":"VLOOKUP(A452,'Counties and Regions'!$G$3:$J$74,3,FALSE)","v":"Kenosha County"},"Other Facility","O"]
[{"$f":"IF(COUNTIF($A$9:A452,A452)<24,A452,A452+1)","v":19},{"$f":"VLOOKUP(A453,'Counties and Regions'!$G$3:$J$74,4,FALSE)","v":"Eastern"},{"$f":"VLOOKUP(A453,'Counties and Regions'!$G$3:$J$74,3,FALSE)","v":"Kenosha County"},"Physician Services","F"]
[{"$f":"IF(COUNTIF($A$9:A453,A453)<24,A453,A453+1)","v":19},{"$f":"VLOOKUP(A454,'Counties and Regions'!$G$3:$J$74,4,FALSE)","v":"Eastern"},{"$f":"VLOOKUP(A454,'Counties and Regions'!$G$3:$J$74,3,FALSE)","v":"Kenosha County"},"Physician Services","D"]
[{"$f":"IF(COUNTIF($A$9:A454,A454)<24,A454,A454+1)","v":19},{"$f":"VLOOKUP(A455,'Counties and Regions'!$G$3:$J$74,4,FALSE)","v":"Eastern"},{"$f":"VLOOKUP(A455,'Counties and Regions'!$G$3:$J$74,3,FALSE)","v":"Kenosha County"},"Physician Services","B"]
[{"$f":"IF(COUNTIF($A$9:A455,A455)<24,A455,A455+1)","v":19},{"$f":"VLOOKUP(A456,'Counties and Regions'!$G$3:$J$74,4,FALSE)","v":"Eastern"},{"$f":"VLOOKUP(A456,'Counties and Regions'!$G$3:$J$74,3,FALSE)","v":"Kenosha County"},"Physician Services","O"]
[{"$f":"IF(COUNTIF($A$9:A456,A456)<24,A456,A456+1)","v":19},{"$f":"VLOOKUP(A457,'Counties and Regions'!$G$3:$J$74,4,FALSE)","v":"Eastern"},{"$f":"VLOOKUP(A457,'Counties and Regions'!$G$3:$J$74,3,FALSE)","v":"Kenosha County"},"Other Services","F"]
[{"$f":"IF(COUNTIF($A$9:A457,A457)<24,A457,A457+1)","v":19},{"$f":"VLOOKUP(A458,'Counties and Regions'!$G$3:$J$74,4,FALSE)","v":"Eastern"},{"$f":"VLOOKUP(A458,'Counties and Regions'!$G$3:$J$74,3,FALSE)","v":"Kenosha County"},"Other Services","D"]
[{"$f":"IF(COUNTIF($A$9:A458,A458)<24,A458,A458+1)","v":19},{"$f":"VLOOKUP(A459,'Counties and Regions'!$G$3:$J$74,4,FALSE)","v":"Eastern"},{"$f":"VLOOKUP(A459,'Counties and Regions'!$G$3:$J$74,3,FALSE)","v":"Kenosha County"},"Other Services","B"]
[{"$f":"IF(COUNTIF($A$9:A459,A459)<24,A459,A459+1)","v":19},{"$f":"VLOOKUP(A460,'Counties and Regions'!$G$3:$J$74,4,FALSE)","v":"Eastern"},{"$f":"VLOOKUP(A460,'Counties and Regions'!$G$3:$J$74,3,FALSE)","v":"Kenosha County"},"Other Services","O"]
[{"$f":"IF(COUNTIF($A$9:A460,A460)<24,A460,A460+1)","v":19},{"$f":"VLOOKUP(A461,'Counties and Regions'!$G$3:$J$74,4,FALSE)","v":"Eastern"},{"$f":"VLOOKUP(A461,'Counties and Regions'!$G$3:$J$74,3,FALSE)","v":"Kenosha County"},"Additional Services","F"]
[{"$f":"IF(COUNTIF($A$9:A461,A461)<24,A461,A461+1)","v":19},{"$f":"VLOOKUP(A462,'Counties and Regions'!$G$3:$J$74,4,FALSE)","v":"Eastern"},{"$f":"VLOOKUP(A462,'Counties and Regions'!$G$3:$J$74,3,FALSE)","v":"Kenosha County"},"Additional Services","D"]
[{"$f":"IF(COUNTIF($A$9:A462,A462)<24,A462,A462+1)","v":19},{"$f":"VLOOKUP(A463,'Counties and Regions'!$G$3:$J$74,4,FALSE)","v":"Eastern"},{"$f":"VLOOKUP(A463,'Counties and Regions'!$G$3:$J$74,3,FALSE)","v":"Kenosha County"},"Additional Services","B"]
[{"$f":"IF(COUNTIF($A$9:A463,A463)<24,A463,A463+1)","v":19},{"$f":"VLOOKUP(A464,'Counties and Regions'!$G$3:$J$74,4,FALSE)","v":"Eastern"},{"$f":"VLOOKUP(A464,'Counties and Regions'!$G$3:$J$74,3,FALSE)","v":"Kenosha County"},"Additional Services","O"]
[{"$f":"IF(COUNTIF($A$9:A464,A464)<24,A464,A464+1)","v":20},{"$f":"VLOOKUP(A465,'Counties and Regions'!$G$3:$J$74,4,FALSE)","v":"Eastern"},{"$f":"VLOOKUP(A465,'Counties and Regions'!$G$3:$J$74,3,FALSE)","v":"Milwaukee County"},"Hospital Inpatient","F"]
[{"$f":"IF(COUNTIF($A$9:A465,A465)<24,A465,A465+1)","v":20},{"$f":"VLOOKUP(A466,'Counties and Regions'!$G$3:$J$74,4,FALSE)","v":"Eastern"},{"$f":"VLOOKUP(A466,'Counties and Regions'!$G$3:$J$74,3,FALSE)","v":"Milwaukee County"},"Hospital Inpatient","D"]
[{"$f":"IF(COUNTIF($A$9:A466,A466)<24,A466,A466+1)","v":20},{"$f":"VLOOKUP(A467,'Counties and Regions'!$G$3:$J$74,4,FALSE)","v":"Eastern"},{"$f":"VLOOKUP(A467,'Counties and Regions'!$G$3:$J$74,3,FALSE)","v":"Milwaukee County"},"Hospital Inpatient","B"]
[{"$f":"IF(COUNTIF($A$9:A467,A467)<24,A467,A467+1)","v":20},{"$f":"VLOOKUP(A468,'Counties and Regions'!$G$3:$J$74,4,FALSE)","v":"Eastern"},{"$f":"VLOOKUP(A468,'Counties and Regions'!$G$3:$J$74,3,FALSE)","v":"Milwaukee County"},"Hospital Inpatient","O"]
[{"$f":"IF(COUNTIF($A$9:A468,A468)<24,A468,A468+1)","v":20},{"$f":"VLOOKUP(A469,'Counties and Regions'!$G$3:$J$74,4,FALSE)","v":"Eastern"},{"$f":"VLOOKUP(A469,'Counties and Regions'!$G$3:$J$74,3,FALSE)","v":"Milwaukee County"},"Hospital Outpatient","F"]
[{"$f":"IF(COUNTIF($A$9:A469,A469)<24,A469,A469+1)","v":20},{"$f":"VLOOKUP(A470,'Counties and Regions'!$G$3:$J$74,4,FALSE)","v":"Eastern"},{"$f":"VLOOKUP(A470,'Counties and Regions'!$G$3:$J$74,3,FALSE)","v":"Milwaukee County"},"Hospital Outpatient","D"]
[{"$f":"IF(COUNTIF($A$9:A470,A470)<24,A470,A470+1)","v":20},{"$f":"VLOOKUP(A471,'Counties and Regions'!$G$3:$J$74,4,FALSE)","v":"Eastern"},{"$f":"VLOOKUP(A471,'Counties and Regions'!$G$3:$J$74,3,FALSE)","v":"Milwaukee County"},"Hospital Outpatient","B"]
[{"$f":"IF(COUNTIF($A$9:A471,A471)<24,A471,A471+1)","v":20},{"$f":"VLOOKUP(A472,'Counties and Regions'!$G$3:$J$74,4,FALSE)","v":"Eastern"},{"$f":"VLOOKUP(A472,'Counties and Regions'!$G$3:$J$74,3,FALSE)","v":"Milwaukee County"},"Hospital Outpatient","O"]
[{"$f":"IF(COUNTIF($A$9:A472,A472)<24,A472,A472+1)","v":20},{"$f":"VLOOKUP(A473,'Counties and Regions'!$G$3:$J$74,4,FALSE)","v":"Eastern"},{"$f":"VLOOKUP(A473,'Counties and Regions'!$G$3:$J$74,3,FALSE)","v":"Milwaukee County"},"Other Facility","F"]
[{"$f":"IF(COUNTIF($A$9:A473,A473)<24,A473,A473+1)","v":20},{"$f":"VLOOKUP(A474,'Counties and Regions'!$G$3:$J$74,4,FALSE)","v":"Eastern"},{"$f":"VLOOKUP(A474,'Counties and Regions'!$G$3:$J$74,3,FALSE)","v":"Milwaukee County"},"Other Facility","D"]
[{"$f":"IF(COUNTIF($A$9:A474,A474)<24,A474,A474+1)","v":20},{"$f":"VLOOKUP(A475,'Counties and Regions'!$G$3:$J$74,4,FALSE)","v":"Eastern"},{"$f":"VLOOKUP(A475,'Counties and Regions'!$G$3:$J$74,3,FALSE)","v":"Milwaukee County"},"Other Facility","B"]
[{"$f":"IF(COUNTIF($A$9:A475,A475)<24,A475,A475+1)","v":20},{"$f":"VLOOKUP(A476,'Counties and Regions'!$G$3:$J$74,4,FALSE)","v":"Eastern"},{"$f":"VLOOKUP(A476,'Counties and Regions'!$G$3:$J$74,3,FALSE)","v":"Milwaukee County"},"Other Facility","O"]
[{"$f":"IF(COUNTIF($A$9:A476,A476)<24,A476,A476+1)","v":20},{"$f":"VLOOKUP(A477,'Counties and Regions'!$G$3:$J$74,4,FALSE)","v":"Eastern"},{"$f":"VLOOKUP(A477,'Counties and Regions'!$G$3:$J$74,3,FALSE)","v":"Milwaukee County"},"Physician Services","F"]
[{"$f":"IF(COUNTIF($A$9:A477,A477)<24,A477,A477+1)","v":20},{"$f":"VLOOKUP(A478,'Counties and Regions'!$G$3:$J$74,4,FALSE)","v":"Eastern"},{"$f":"VLOOKUP(A478,'Counties and Regions'!$G$3:$J$74,3,FALSE)","v":"Milwaukee County"},"Physician Services","D"]
[{"$f":"IF(COUNTIF($A$9:A478,A478)<24,A478,A478+1)","v":20},{"$f":"VLOOKUP(A479,'Counties and Regions'!$G$3:$J$74,4,FALSE)","v":"Eastern"},{"$f":"VLOOKUP(A479,'Counties and Regions'!$G$3:$J$74,3,FALSE)","v":"Milwaukee County"},"Physician Services","B"]
[{"$f":"IF(COUNTIF($A$9:A479,A479)<24,A479,A479+1)","v":20},{"$f":"VLOOKUP(A480,'Counties and Regions'!$G$3:$J$74,4,FALSE)","v":"Eastern"},{"$f":"VLOOKUP(A480,'Counties and Regions'!$G$3:$J$74,3,FALSE)","v":"Milwaukee County"},"Physician Services","O"]
[{"$f":"IF(COUNTIF($A$9:A480,A480)<24,A480,A480+1)","v":20},{"$f":"VLOOKUP(A481,'Counties and Regions'!$G$3:$J$74,4,FALSE)","v":"Eastern"},{"$f":"VLOOKUP(A481,'Counties and Regions'!$G$3:$J$74,3,FALSE)","v":"Milwaukee County"},"Other Services","F"]
[{"$f":"IF(COUNTIF($A$9:A481,A481)<24,A481,A481+1)","v":20},{"$f":"VLOOKUP(A482,'Counties and Regions'!$G$3:$J$74,4,FALSE)","v":"Eastern"},{"$f":"VLOOKUP(A482,'Counties and Regions'!$G$3:$J$74,3,FALSE)","v":"Milwaukee County"},"Other Services","D"]
[{"$f":"IF(COUNTIF($A$9:A482,A482)<24,A482,A482+1)","v":20},{"$f":"VLOOKUP(A483,'Counties and Regions'!$G$3:$J$74,4,FALSE)","v":"Eastern"},{"$f":"VLOOKUP(A483,'Counties and Regions'!$G$3:$J$74,3,FALSE)","v":"Milwaukee County"},"Other Services","B"]
[{"$f":"IF(COUNTIF($A$9:A483,A483)<24,A483,A483+1)","v":20},{"$f":"VLOOKUP(A484,'Counties and Regions'!$G$3:$J$74,4,FALSE)","v":"Eastern"},{"$f":"VLOOKUP(A484,'Counties and Regions'!$G$3:$J$74,3,FALSE)","v":"Milwaukee County"},"Other Services","O"]
[{"$f":"IF(COUNTIF($A$9:A484,A484)<24,A484,A484+1)","v":20},{"$f":"VLOOKUP(A485,'Counties and Regions'!$G$3:$J$74,4,FALSE)","v":"Eastern"},{"$f":"VLOOKUP(A485,'Counties and Regions'!$G$3:$J$74,3,FALSE)","v":"Milwaukee County"},"Additional Services","F"]
[{"$f":"IF(COUNTIF($A$9:A485,A485)<24,A485,A485+1)","v":20},{"$f":"VLOOKUP(A486,'Counties and Regions'!$G$3:$J$74,4,FALSE)","v":"Eastern"},{"$f":"VLOOKUP(A486,'Counties and Regions'!$G$3:$J$74,3,FALSE)","v":"Milwaukee County"},"Additional Services","D"]
[{"$f":"IF(COUNTIF($A$9:A486,A486)<24,A486,A486+1)","v":20},{"$f":"VLOOKUP(A487,'Counties and Regions'!$G$3:$J$74,4,FALSE)","v":"Eastern"},{"$f":"VLOOKUP(A487,'Counties and Regions'!$G$3:$J$74,3,FALSE)","v":"Milwaukee County"},"Additional Services","B"]
[{"$f":"IF(COUNTIF($A$9:A487,A487)<24,A487,A487+1)","v":20},{"$f":"VLOOKUP(A488,'Counties and Regions'!$G$3:$J$74,4,FALSE)","v":"Eastern"},{"$f":"VLOOKUP(A488,'Counties and Regions'!$G$3:$J$74,3,FALSE)","v":"Milwaukee County"},"Additional Services","O"]
[{"$f":"IF(COUNTIF($A$9:A488,A488)<24,A488,A488+1)","v":21},{"$f":"VLOOKUP(A489,'Counties and Regions'!$G$3:$J$74,4,FALSE)","v":"Eastern"},{"$f":"VLOOKUP(A489,'Counties and Regions'!$G$3:$J$74,3,FALSE)","v":"Ozaukee County"},"Hospital Inpatient","F"]
[{"$f":"IF(COUNTIF($A$9:A489,A489)<24,A489,A489+1)","v":21},{"$f":"VLOOKUP(A490,'Counties and Regions'!$G$3:$J$74,4,FALSE)","v":"Eastern"},{"$f":"VLOOKUP(A490,'Counties and Regions'!$G$3:$J$74,3,FALSE)","v":"Ozaukee County"},"Hospital Inpatient","D"]
[{"$f":"IF(COUNTIF($A$9:A490,A490)<24,A490,A490+1)","v":21},{"$f":"VLOOKUP(A491,'Counties and Regions'!$G$3:$J$74,4,FALSE)","v":"Eastern"},{"$f":"VLOOKUP(A491,'Counties and Regions'!$G$3:$J$74,3,FALSE)","v":"Ozaukee County"},"Hospital Inpatient","B"]
[{"$f":"IF(COUNTIF($A$9:A491,A491)<24,A491,A491+1)","v":21},{"$f":"VLOOKUP(A492,'Counties and Regions'!$G$3:$J$74,4,FALSE)","v":"Eastern"},{"$f":"VLOOKUP(A492,'Counties and Regions'!$G$3:$J$74,3,FALSE)","v":"Ozaukee County"},"Hospital Inpatient","O"]
[{"$f":"IF(COUNTIF($A$9:A492,A492)<24,A492,A492+1)","v":21},{"$f":"VLOOKUP(A493,'Counties and Regions'!$G$3:$J$74,4,FALSE)","v":"Eastern"},{"$f":"VLOOKUP(A493,'Counties and Regions'!$G$3:$J$74,3,FALSE)","v":"Ozaukee County"},"Hospital Outpatient","F"]
[{"$f":"IF(COUNTIF($A$9:A493,A493)<24,A493,A493+1)","v":21},{"$f":"VLOOKUP(A494,'Counties and Regions'!$G$3:$J$74,4,FALSE)","v":"Eastern"},{"$f":"VLOOKUP(A494,'Counties and Regions'!$G$3:$J$74,3,FALSE)","v":"Ozaukee County"},"Hospital Outpatient","D"]
[{"$f":"IF(COUNTIF($A$9:A494,A494)<24,A494,A494+1)","v":21},{"$f":"VLOOKUP(A495,'Counties and Regions'!$G$3:$J$74,4,FALSE)","v":"Eastern"},{"$f":"VLOOKUP(A495,'Counties and Regions'!$G$3:$J$74,3,FALSE)","v":"Ozaukee County"},"Hospital Outpatient","B"]
[{"$f":"IF(COUNTIF($A$9:A495,A495)<24,A495,A495+1)","v":21},{"$f":"VLOOKUP(A496,'Counties and Regions'!$G$3:$J$74,4,FALSE)","v":"Eastern"},{"$f":"VLOOKUP(A496,'Counties and Regions'!$G$3:$J$74,3,FALSE)","v":"Ozaukee County"},"Hospital Outpatient","O"]
[{"$f":"IF(COUNTIF($A$9:A496,A496)<24,A496,A496+1)","v":21},{"$f":"VLOOKUP(A497,'Counties and Regions'!$G$3:$J$74,4,FALSE)","v":"Eastern"},{"$f":"VLOOKUP(A497,'Counties and Regions'!$G$3:$J$74,3,FALSE)","v":"Ozaukee County"},"Other Facility","F"]
[{"$f":"IF(COUNTIF($A$9:A497,A497)<24,A497,A497+1)","v":21},{"$f":"VLOOKUP(A498,'Counties and Regions'!$G$3:$J$74,4,FALSE)","v":"Eastern"},{"$f":"VLOOKUP(A498,'Counties and Regions'!$G$3:$J$74,3,FALSE)","v":"Ozaukee County"},"Other Facility","D"]
[{"$f":"IF(COUNTIF($A$9:A498,A498)<24,A498,A498+1)","v":21},{"$f":"VLOOKUP(A499,'Counties and Regions'!$G$3:$J$74,4,FALSE)","v":"Eastern"},{"$f":"VLOOKUP(A499,'Counties and Regions'!$G$3:$J$74,3,FALSE)","v":"Ozaukee County"},"Other Facility","B"]
[{"$f":"IF(COUNTIF($A$9:A499,A499)<24,A499,A499+1)","v":21},{"$f":"VLOOKUP(A500,'Counties and Regions'!$G$3:$J$74,4,FALSE)","v":"Eastern"},{"$f":"VLOOKUP(A500,'Counties and Regions'!$G$3:$J$74,3,FALSE)","v":"Ozaukee County"},"Other Facility","O"]
[{"$f":"IF(COUNTIF($A$9:A500,A500)<24,A500,A500+1)","v":21},{"$f":"VLOOKUP(A501,'Counties and Regions'!$G$3:$J$74,4,FALSE)","v":"Eastern"},{"$f":"VLOOKUP(A501,'Counties and Regions'!$G$3:$J$74,3,FALSE)","v":"Ozaukee County"},"Physician Services","F"]
[{"$f":"IF(COUNTIF($A$9:A501,A501)<24,A501,A501+1)","v":21},{"$f":"VLOOKUP(A502,'Counties and Regions'!$G$3:$J$74,4,FALSE)","v":"Eastern"},{"$f":"VLOOKUP(A502,'Counties and Regions'!$G$3:$J$74,3,FALSE)","v":"Ozaukee County"},"Physician Services","D"]
[{"$f":"IF(COUNTIF($A$9:A502,A502)<24,A502,A502+1)","v":21},{"$f":"VLOOKUP(A503,'Counties and Regions'!$G$3:$J$74,4,FALSE)","v":"Eastern"},{"$f":"VLOOKUP(A503,'Counties and Regions'!$G$3:$J$74,3,FALSE)","v":"Ozaukee County"},"Physician Services","B"]
[{"$f":"IF(COUNTIF($A$9:A503,A503)<24,A503,A503+1)","v":21},{"$f":"VLOOKUP(A504,'Counties and Regions'!$G$3:$J$74,4,FALSE)","v":"Eastern"},{"$f":"VLOOKUP(A504,'Counties and Regions'!$G$3:$J$74,3,FALSE)","v":"Ozaukee County"},"Physician Services","O"]
[{"$f":"IF(COUNTIF($A$9:A504,A504)<24,A504,A504+1)","v":21},{"$f":"VLOOKUP(A505,'Counties and Regions'!$G$3:$J$74,4,FALSE)","v":"Eastern"},{"$f":"VLOOKUP(A505,'Counties and Regions'!$G$3:$J$74,3,FALSE)","v":"Ozaukee County"},"Other Services","F"]
[{"$f":"IF(COUNTIF($A$9:A505,A505)<24,A505,A505+1)","v":21},{"$f":"VLOOKUP(A506,'Counties and Regions'!$G$3:$J$74,4,FALSE)","v":"Eastern"},{"$f":"VLOOKUP(A506,'Counties and Regions'!$G$3:$J$74,3,FALSE)","v":"Ozaukee County"},"Other Services","D"]
[{"$f":"IF(COUNTIF($A$9:A506,A506)<24,A506,A506+1)","v":21},{"$f":"VLOOKUP(A507,'Counties and Regions'!$G$3:$J$74,4,FALSE)","v":"Eastern"},{"$f":"VLOOKUP(A507,'Counties and Regions'!$G$3:$J$74,3,FALSE)","v":"Ozaukee County"},"Other Services","B"]
[{"$f":"IF(COUNTIF($A$9:A507,A507)<24,A507,A507+1)","v":21},{"$f":"VLOOKUP(A508,'Counties and Regions'!$G$3:$J$74,4,FALSE)","v":"Eastern"},{"$f":"VLOOKUP(A508,'Counties and Regions'!$G$3:$J$74,3,FALSE)","v":"Ozaukee County"},"Other Services","O"]
[{"$f":"IF(COUNTIF($A$9:A508,A508)<24,A508,A508+1)","v":21},{"$f":"VLOOKUP(A509,'Counties and Regions'!$G$3:$J$74,4,FALSE)","v":"Eastern"},{"$f":"VLOOKUP(A509,'Counties and Regions'!$G$3:$J$74,3,FALSE)","v":"Ozaukee County"},"Additional Services","F"]
[{"$f":"IF(COUNTIF($A$9:A509,A509)<24,A509,A509+1)","v":21},{"$f":"VLOOKUP(A510,'Counties and Regions'!$G$3:$J$74,4,FALSE)","v":"Eastern"},{"$f":"VLOOKUP(A510,'Counties and Regions'!$G$3:$J$74,3,FALSE)","v":"Ozaukee County"},"Additional Services","D"]
[{"$f":"IF(COUNTIF($A$9:A510,A510)<24,A510,A510+1)","v":21},{"$f":"VLOOKUP(A511,'Counties and Regions'!$G$3:$J$74,4,FALSE)","v":"Eastern"},{"$f":"VLOOKUP(A511,'Counties and Regions'!$G$3:$J$74,3,FALSE)","v":"Ozaukee County"},"Additional Services","B"]
[{"$f":"IF(COUNTIF($A$9:A511,A511)<24,A511,A511+1)","v":21},{"$f":"VLOOKUP(A512,'Counties and Regions'!$G$3:$J$74,4,FALSE)","v":"Eastern"},{"$f":"VLOOKUP(A512,'Counties and Regions'!$G$3:$J$74,3,FALSE)","v":"Ozaukee County"},"Additional Services","O"]
[{"$f":"IF(COUNTIF($A$9:A512,A512)<24,A512,A512+1)","v":22},{"$f":"VLOOKUP(A513,'Counties and Regions'!$G$3:$J$74,4,FALSE)","v":"Eastern"},{"$f":"VLOOKUP(A513,'Counties and Regions'!$G$3:$J$74,3,FALSE)","v":"Racine County"},"Hospital Inpatient","F"]
[{"$f":"IF(COUNTIF($A$9:A513,A513)<24,A513,A513+1)","v":22},{"$f":"VLOOKUP(A514,'Counties and Regions'!$G$3:$J$74,4,FALSE)","v":"Eastern"},{"$f":"VLOOKUP(A514,'Counties and Regions'!$G$3:$J$74,3,FALSE)","v":"Racine County"},"Hospital Inpatient","D"]
[{"$f":"IF(COUNTIF($A$9:A514,A514)<24,A514,A514+1)","v":22},{"$f":"VLOOKUP(A515,'Counties and Regions'!$G$3:$J$74,4,FALSE)","v":"Eastern"},{"$f":"VLOOKUP(A515,'Counties and Regions'!$G$3:$J$74,3,FALSE)","v":"Racine County"},"Hospital Inpatient","B"]
[{"$f":"IF(COUNTIF($A$9:A515,A515)<24,A515,A515+1)","v":22},{"$f":"VLOOKUP(A516,'Counties and Regions'!$G$3:$J$74,4,FALSE)","v":"Eastern"},{"$f":"VLOOKUP(A516,'Counties and Regions'!$G$3:$J$74,3,FALSE)","v":"Racine County"},"Hospital Inpatient","O"]
[{"$f":"IF(COUNTIF($A$9:A516,A516)<24,A516,A516+1)","v":22},{"$f":"VLOOKUP(A517,'Counties and Regions'!$G$3:$J$74,4,FALSE)","v":"Eastern"},{"$f":"VLOOKUP(A517,'Counties and Regions'!$G$3:$J$74,3,FALSE)","v":"Racine County"},"Hospital Outpatient","F"]
[{"$f":"IF(COUNTIF($A$9:A517,A517)<24,A517,A517+1)","v":22},{"$f":"VLOOKUP(A518,'Counties and Regions'!$G$3:$J$74,4,FALSE)","v":"Eastern"},{"$f":"VLOOKUP(A518,'Counties and Regions'!$G$3:$J$74,3,FALSE)","v":"Racine County"},"Hospital Outpatient","D"]
[{"$f":"IF(COUNTIF($A$9:A518,A518)<24,A518,A518+1)","v":22},{"$f":"VLOOKUP(A519,'Counties and Regions'!$G$3:$J$74,4,FALSE)","v":"Eastern"},{"$f":"VLOOKUP(A519,'Counties and Regions'!$G$3:$J$74,3,FALSE)","v":"Racine County"},"Hospital Outpatient","B"]
[{"$f":"IF(COUNTIF($A$9:A519,A519)<24,A519,A519+1)","v":22},{"$f":"VLOOKUP(A520,'Counties and Regions'!$G$3:$J$74,4,FALSE)","v":"Eastern"},{"$f":"VLOOKUP(A520,'Counties and Regions'!$G$3:$J$74,3,FALSE)","v":"Racine County"},"Hospital Outpatient","O"]
[{"$f":"IF(COUNTIF($A$9:A520,A520)<24,A520,A520+1)","v":22},{"$f":"VLOOKUP(A521,'Counties and Regions'!$G$3:$J$74,4,FALSE)","v":"Eastern"},{"$f":"VLOOKUP(A521,'Counties and Regions'!$G$3:$J$74,3,FALSE)","v":"Racine County"},"Other Facility","F"]
[{"$f":"IF(COUNTIF($A$9:A521,A521)<24,A521,A521+1)","v":22},{"$f":"VLOOKUP(A522,'Counties and Regions'!$G$3:$J$74,4,FALSE)","v":"Eastern"},{"$f":"VLOOKUP(A522,'Counties and Regions'!$G$3:$J$74,3,FALSE)","v":"Racine County"},"Other Facility","D"]
[{"$f":"IF(COUNTIF($A$9:A522,A522)<24,A522,A522+1)","v":22},{"$f":"VLOOKUP(A523,'Counties and Regions'!$G$3:$J$74,4,FALSE)","v":"Eastern"},{"$f":"VLOOKUP(A523,'Counties and Regions'!$G$3:$J$74,3,FALSE)","v":"Racine County"},"Other Facility","B"]
[{"$f":"IF(COUNTIF($A$9:A523,A523)<24,A523,A523+1)","v":22},{"$f":"VLOOKUP(A524,'Counties and Regions'!$G$3:$J$74,4,FALSE)","v":"Eastern"},{"$f":"VLOOKUP(A524,'Counties and Regions'!$G$3:$J$74,3,FALSE)","v":"Racine County"},"Other Facility","O"]
[{"$f":"IF(COUNTIF($A$9:A524,A524)<24,A524,A524+1)","v":22},{"$f":"VLOOKUP(A525,'Counties and Regions'!$G$3:$J$74,4,FALSE)","v":"Eastern"},{"$f":"VLOOKUP(A525,'Counties and Regions'!$G$3:$J$74,3,FALSE)","v":"Racine County"},"Physician Services","F"]
[{"$f":"IF(COUNTIF($A$9:A525,A525)<24,A525,A525+1)","v":22},{"$f":"VLOOKUP(A526,'Counties and Regions'!$G$3:$J$74,4,FALSE)","v":"Eastern"},{"$f":"VLOOKUP(A526,'Counties and Regions'!$G$3:$J$74,3,FALSE)","v":"Racine County"},"Physician Services","D"]
[{"$f":"IF(COUNTIF($A$9:A526,A526)<24,A526,A526+1)","v":22},{"$f":"VLOOKUP(A527,'Counties and Regions'!$G$3:$J$74,4,FALSE)","v":"Eastern"},{"$f":"VLOOKUP(A527,'Counties and Regions'!$G$3:$J$74,3,FALSE)","v":"Racine County"},"Physician Services","B"]
[{"$f":"IF(COUNTIF($A$9:A527,A527)<24,A527,A527+1)","v":22},{"$f":"VLOOKUP(A528,'Counties and Regions'!$G$3:$J$74,4,FALSE)","v":"Eastern"},{"$f":"VLOOKUP(A528,'Counties and Regions'!$G$3:$J$74,3,FALSE)","v":"Racine County"},"Physician Services","O"]
[{"$f":"IF(COUNTIF($A$9:A528,A528)<24,A528,A528+1)","v":22},{"$f":"VLOOKUP(A529,'Counties and Regions'!$G$3:$J$74,4,FALSE)","v":"Eastern"},{"$f":"VLOOKUP(A529,'Counties and Regions'!$G$3:$J$74,3,FALSE)","v":"Racine County"},"Other Services","F"]
[{"$f":"IF(COUNTIF($A$9:A529,A529)<24,A529,A529+1)","v":22},{"$f":"VLOOKUP(A530,'Counties and Regions'!$G$3:$J$74,4,FALSE)","v":"Eastern"},{"$f":"VLOOKUP(A530,'Counties and Regions'!$G$3:$J$74,3,FALSE)","v":"Racine County"},"Other Services","D"]
[{"$f":"IF(COUNTIF($A$9:A530,A530)<24,A530,A530+1)","v":22},{"$f":"VLOOKUP(A531,'Counties and Regions'!$G$3:$J$74,4,FALSE)","v":"Eastern"},{"$f":"VLOOKUP(A531,'Counties and Regions'!$G$3:$J$74,3,FALSE)","v":"Racine County"},"Other Services","B"]
[{"$f":"IF(COUNTIF($A$9:A531,A531)<24,A531,A531+1)","v":22},{"$f":"VLOOKUP(A532,'Counties and Regions'!$G$3:$J$74,4,FALSE)","v":"Eastern"},{"$f":"VLOOKUP(A532,'Counties and Regions'!$G$3:$J$74,3,FALSE)","v":"Racine County"},"Other Services","O"]
[{"$f":"IF(COUNTIF($A$9:A532,A532)<24,A532,A532+1)","v":22},{"$f":"VLOOKUP(A533,'Counties and Regions'!$G$3:$J$74,4,FALSE)","v":"Eastern"},{"$f":"VLOOKUP(A533,'Counties and Regions'!$G$3:$J$74,3,FALSE)","v":"Racine County"},"Additional Services","F"]
[{"$f":"IF(COUNTIF($A$9:A533,A533)<24,A533,A533+1)","v":22},{"$f":"VLOOKUP(A534,'Counties and Regions'!$G$3:$J$74,4,FALSE)","v":"Eastern"},{"$f":"VLOOKUP(A534,'Counties and Regions'!$G$3:$J$74,3,FALSE)","v":"Racine County"},"Additional Services","D"]
[{"$f":"IF(COUNTIF($A$9:A534,A534)<24,A534,A534+1)","v":22},{"$f":"VLOOKUP(A535,'Counties and Regions'!$G$3:$J$74,4,FALSE)","v":"Eastern"},{"$f":"VLOOKUP(A535,'Counties and Regions'!$G$3:$J$74,3,FALSE)","v":"Racine County"},"Additional Services","B"]
[{"$f":"IF(COUNTIF($A$9:A535,A535)<24,A535,A535+1)","v":22},{"$f":"VLOOKUP(A536,'Counties and Regions'!$G$3:$J$74,4,FALSE)","v":"Eastern"},{"$f":"VLOOKUP(A536,'Counties and Regions'!$G$3:$J$74,3,FALSE)","v":"Racine County"},"Additional Services","O"]
[{"$f":"IF(COUNTIF($A$9:A536,A536)<24,A536,A536+1)","v":23},{"$f":"VLOOKUP(A537,'Counties and Regions'!$G$3:$J$74,4,FALSE)","v":"Eastern"},{"$f":"VLOOKUP(A537,'Counties and Regions'!$G$3:$J$74,3,FALSE)","v":"Washington County"},"Hospital Inpatient","F"]
[{"$f":"IF(COUNTIF($A$9:A537,A537)<24,A537,A537+1)","v":23},{"$f":"VLOOKUP(A538,'Counties and Regions'!$G$3:$J$74,4,FALSE)","v":"Eastern"},{"$f":"VLOOKUP(A538,'Counties and Regions'!$G$3:$J$74,3,FALSE)","v":"Washington County"},"Hospital Inpatient","D"]
[{"$f":"IF(COUNTIF($A$9:A538,A538)<24,A538,A538+1)","v":23},{"$f":"VLOOKUP(A539,'Counties and Regions'!$G$3:$J$74,4,FALSE)","v":"Eastern"},{"$f":"VLOOKUP(A539,'Counties and Regions'!$G$3:$J$74,3,FALSE)","v":"Washington County"},"Hospital Inpatient","B"]
[{"$f":"IF(COUNTIF($A$9:A539,A539)<24,A539,A539+1)","v":23},{"$f":"VLOOKUP(A540,'Counties and Regions'!$G$3:$J$74,4,FALSE)","v":"Eastern"},{"$f":"VLOOKUP(A540,'Counties and Regions'!$G$3:$J$74,3,FALSE)","v":"Washington County"},"Hospital Inpatient","O"]
[{"$f":"IF(COUNTIF($A$9:A540,A540)<24,A540,A540+1)","v":23},{"$f":"VLOOKUP(A541,'Counties and Regions'!$G$3:$J$74,4,FALSE)","v":"Eastern"},{"$f":"VLOOKUP(A541,'Counties and Regions'!$G$3:$J$74,3,FALSE)","v":"Washington County"},"Hospital Outpatient","F"]
[{"$f":"IF(COUNTIF($A$9:A541,A541)<24,A541,A541+1)","v":23},{"$f":"VLOOKUP(A542,'Counties and Regions'!$G$3:$J$74,4,FALSE)","v":"Eastern"},{"$f":"VLOOKUP(A542,'Counties and Regions'!$G$3:$J$74,3,FALSE)","v":"Washington County"},"Hospital Outpatient","D"]
[{"$f":"IF(COUNTIF($A$9:A542,A542)<24,A542,A542+1)","v":23},{"$f":"VLOOKUP(A543,'Counties and Regions'!$G$3:$J$74,4,FALSE)","v":"Eastern"},{"$f":"VLOOKUP(A543,'Counties and Regions'!$G$3:$J$74,3,FALSE)","v":"Washington County"},"Hospital Outpatient","B"]
[{"$f":"IF(COUNTIF($A$9:A543,A543)<24,A543,A543+1)","v":23},{"$f":"VLOOKUP(A544,'Counties and Regions'!$G$3:$J$74,4,FALSE)","v":"Eastern"},{"$f":"VLOOKUP(A544,'Counties and Regions'!$G$3:$J$74,3,FALSE)","v":"Washington County"},"Hospital Outpatient","O"]
[{"$f":"IF(COUNTIF($A$9:A544,A544)<24,A544,A544+1)","v":23},{"$f":"VLOOKUP(A545,'Counties and Regions'!$G$3:$J$74,4,FALSE)","v":"Eastern"},{"$f":"VLOOKUP(A545,'Counties and Regions'!$G$3:$J$74,3,FALSE)","v":"Washington County"},"Other Facility","F"]
[{"$f":"IF(COUNTIF($A$9:A545,A545)<24,A545,A545+1)","v":23},{"$f":"VLOOKUP(A546,'Counties and Regions'!$G$3:$J$74,4,FALSE)","v":"Eastern"},{"$f":"VLOOKUP(A546,'Counties and Regions'!$G$3:$J$74,3,FALSE)","v":"Washington County"},"Other Facility","D"]
[{"$f":"IF(COUNTIF($A$9:A546,A546)<24,A546,A546+1)","v":23},{"$f":"VLOOKUP(A547,'Counties and Regions'!$G$3:$J$74,4,FALSE)","v":"Eastern"},{"$f":"VLOOKUP(A547,'Counties and Regions'!$G$3:$J$74,3,FALSE)","v":"Washington County"},"Other Facility","B"]
[{"$f":"IF(COUNTIF($A$9:A547,A547)<24,A547,A547+1)","v":23},{"$f":"VLOOKUP(A548,'Counties and Regions'!$G$3:$J$74,4,FALSE)","v":"Eastern"},{"$f":"VLOOKUP(A548,'Counties and Regions'!$G$3:$J$74,3,FALSE)","v":"Washington County"},"Other Facility","O"]
[{"$f":"IF(COUNTIF($A$9:A548,A548)<24,A548,A548+1)","v":23},{"$f":"VLOOKUP(A549,'Counties and Regions'!$G$3:$J$74,4,FALSE)","v":"Eastern"},{"$f":"VLOOKUP(A549,'Counties and Regions'!$G$3:$J$74,3,FALSE)","v":"Washington County"},"Physician Services","F"]
[{"$f":"IF(COUNTIF($A$9:A549,A549)<24,A549,A549+1)","v":23},{"$f":"VLOOKUP(A550,'Counties and Regions'!$G$3:$J$74,4,FALSE)","v":"Eastern"},{"$f":"VLOOKUP(A550,'Counties and Regions'!$G$3:$J$74,3,FALSE)","v":"Washington County"},"Physician Services","D"]
[{"$f":"IF(COUNTIF($A$9:A550,A550)<24,A550,A550+1)","v":23},{"$f":"VLOOKUP(A551,'Counties and Regions'!$G$3:$J$74,4,FALSE)","v":"Eastern"},{"$f":"VLOOKUP(A551,'Counties and Regions'!$G$3:$J$74,3,FALSE)","v":"Washington County"},"Physician Services","B"]
[{"$f":"IF(COUNTIF($A$9:A551,A551)<24,A551,A551+1)","v":23},{"$f":"VLOOKUP(A552,'Counties and Regions'!$G$3:$J$74,4,FALSE)","v":"Eastern"},{"$f":"VLOOKUP(A552,'Counties and Regions'!$G$3:$J$74,3,FALSE)","v":"Washington County"},"Physician Services","O"]
[{"$f":"IF(COUNTIF($A$9:A552,A552)<24,A552,A552+1)","v":23},{"$f":"VLOOKUP(A553,'Counties and Regions'!$G$3:$J$74,4,FALSE)","v":"Eastern"},{"$f":"VLOOKUP(A553,'Counties and Regions'!$G$3:$J$74,3,FALSE)","v":"Washington County"},"Other Services","F"]
[{"$f":"IF(COUNTIF($A$9:A553,A553)<24,A553,A553+1)","v":23},{"$f":"VLOOKUP(A554,'Counties and Regions'!$G$3:$J$74,4,FALSE)","v":"Eastern"},{"$f":"VLOOKUP(A554,'Counties and Regions'!$G$3:$J$74,3,FALSE)","v":"Washington County"},"Other Services","D"]
[{"$f":"IF(COUNTIF($A$9:A554,A554)<24,A554,A554+1)","v":23},{"$f":"VLOOKUP(A555,'Counties and Regions'!$G$3:$J$74,4,FALSE)","v":"Eastern"},{"$f":"VLOOKUP(A555,'Counties and Regions'!$G$3:$J$74,3,FALSE)","v":"Washington County"},"Other Services","B"]
[{"$f":"IF(COUNTIF($A$9:A555,A555)<24,A555,A555+1)","v":23},{"$f":"VLOOKUP(A556,'Counties and Regions'!$G$3:$J$74,4,FALSE)","v":"Eastern"},{"$f":"VLOOKUP(A556,'Counties and Regions'!$G$3:$J$74,3,FALSE)","v":"Washington County"},"Other Services","O"]
[{"$f":"IF(COUNTIF($A$9:A556,A556)<24,A556,A556+1)","v":23},{"$f":"VLOOKUP(A557,'Counties and Regions'!$G$3:$J$74,4,FALSE)","v":"Eastern"},{"$f":"VLOOKUP(A557,'Counties and Regions'!$G$3:$J$74,3,FALSE)","v":"Washington County"},"Additional Services","F"]
[{"$f":"IF(COUNTIF($A$9:A557,A557)<24,A557,A557+1)","v":23},{"$f":"VLOOKUP(A558,'Counties and Regions'!$G$3:$J$74,4,FALSE)","v":"Eastern"},{"$f":"VLOOKUP(A558,'Counties and Regions'!$G$3:$J$74,3,FALSE)","v":"Washington County"},"Additional Services","D"]
[{"$f":"IF(COUNTIF($A$9:A558,A558)<24,A558,A558+1)","v":23},{"$f":"VLOOKUP(A559,'Counties and Regions'!$G$3:$J$74,4,FALSE)","v":"Eastern"},{"$f":"VLOOKUP(A559,'Counties and Regions'!$G$3:$J$74,3,FALSE)","v":"Washington County"},"Additional Services","B"]
[{"$f":"IF(COUNTIF($A$9:A559,A559)<24,A559,A559+1)","v":23},{"$f":"VLOOKUP(A560,'Counties and Regions'!$G$3:$J$74,4,FALSE)","v":"Eastern"},{"$f":"VLOOKUP(A560,'Counties and Regions'!$G$3:$J$74,3,FALSE)","v":"Washington County"},"Additional Services","O"]
[{"$f":"IF(COUNTIF($A$9:A560,A560)<24,A560,A560+1)","v":24},{"$f":"VLOOKUP(A561,'Counties and Regions'!$G$3:$J$74,4,FALSE)","v":"Eastern"},{"$f":"VLOOKUP(A561,'Counties and Regions'!$G$3:$J$74,3,FALSE)","v":"Waukesha County"},"Hospital Inpatient","F"]
[{"$f":"IF(COUNTIF($A$9:A561,A561)<24,A561,A561+1)","v":24},{"$f":"VLOOKUP(A562,'Counties and Regions'!$G$3:$J$74,4,FALSE)","v":"Eastern"},{"$f":"VLOOKUP(A562,'Counties and Regions'!$G$3:$J$74,3,FALSE)","v":"Waukesha County"},"Hospital Inpatient","D"]
[{"$f":"IF(COUNTIF($A$9:A562,A562)<24,A562,A562+1)","v":24},{"$f":"VLOOKUP(A563,'Counties and Regions'!$G$3:$J$74,4,FALSE)","v":"Eastern"},{"$f":"VLOOKUP(A563,'Counties and Regions'!$G$3:$J$74,3,FALSE)","v":"Waukesha County"},"Hospital Inpatient","B"]
[{"$f":"IF(COUNTIF($A$9:A563,A563)<24,A563,A563+1)","v":24},{"$f":"VLOOKUP(A564,'Counties and Regions'!$G$3:$J$74,4,FALSE)","v":"Eastern"},{"$f":"VLOOKUP(A564,'Counties and Regions'!$G$3:$J$74,3,FALSE)","v":"Waukesha County"},"Hospital Inpatient","O"]
[{"$f":"IF(COUNTIF($A$9:A564,A564)<24,A564,A564+1)","v":24},{"$f":"VLOOKUP(A565,'Counties and Regions'!$G$3:$J$74,4,FALSE)","v":"Eastern"},{"$f":"VLOOKUP(A565,'Counties and Regions'!$G$3:$J$74,3,FALSE)","v":"Waukesha County"},"Hospital Outpatient","F"]
[{"$f":"IF(COUNTIF($A$9:A565,A565)<24,A565,A565+1)","v":24},{"$f":"VLOOKUP(A566,'Counties and Regions'!$G$3:$J$74,4,FALSE)","v":"Eastern"},{"$f":"VLOOKUP(A566,'Counties and Regions'!$G$3:$J$74,3,FALSE)","v":"Waukesha County"},"Hospital Outpatient","D"]
[{"$f":"IF(COUNTIF($A$9:A566,A566)<24,A566,A566+1)","v":24},{"$f":"VLOOKUP(A567,'Counties and Regions'!$G$3:$J$74,4,FALSE)","v":"Eastern"},{"$f":"VLOOKUP(A567,'Counties and Regions'!$G$3:$J$74,3,FALSE)","v":"Waukesha County"},"Hospital Outpatient","B"]
[{"$f":"IF(COUNTIF($A$9:A567,A567)<24,A567,A567+1)","v":24},{"$f":"VLOOKUP(A568,'Counties and Regions'!$G$3:$J$74,4,FALSE)","v":"Eastern"},{"$f":"VLOOKUP(A568,'Counties and Regions'!$G$3:$J$74,3,FALSE)","v":"Waukesha County"},"Hospital Outpatient","O"]
[{"$f":"IF(COUNTIF($A$9:A568,A568)<24,A568,A568+1)","v":24},{"$f":"VLOOKUP(A569,'Counties and Regions'!$G$3:$J$74,4,FALSE)","v":"Eastern"},{"$f":"VLOOKUP(A569,'Counties and Regions'!$G$3:$J$74,3,FALSE)","v":"Waukesha County"},"Other Facility","F"]
[{"$f":"IF(COUNTIF($A$9:A569,A569)<24,A569,A569+1)","v":24},{"$f":"VLOOKUP(A570,'Counties and Regions'!$G$3:$J$74,4,FALSE)","v":"Eastern"},{"$f":"VLOOKUP(A570,'Counties and Regions'!$G$3:$J$74,3,FALSE)","v":"Waukesha County"},"Other Facility","D"]
[{"$f":"IF(COUNTIF($A$9:A570,A570)<24,A570,A570+1)","v":24},{"$f":"VLOOKUP(A571,'Counties and Regions'!$G$3:$J$74,4,FALSE)","v":"Eastern"},{"$f":"VLOOKUP(A571,'Counties and Regions'!$G$3:$J$74,3,FALSE)","v":"Waukesha County"},"Other Facility","B"]
[{"$f":"IF(COUNTIF($A$9:A571,A571)<24,A571,A571+1)","v":24},{"$f":"VLOOKUP(A572,'Counties and Regions'!$G$3:$J$74,4,FALSE)","v":"Eastern"},{"$f":"VLOOKUP(A572,'Counties and Regions'!$G$3:$J$74,3,FALSE)","v":"Waukesha County"},"Other Facility","O"]
[{"$f":"IF(COUNTIF($A$9:A572,A572)<24,A572,A572+1)","v":24},{"$f":"VLOOKUP(A573,'Counties and Regions'!$G$3:$J$74,4,FALSE)","v":"Eastern"},{"$f":"VLOOKUP(A573,'Counties and Regions'!$G$3:$J$74,3,FALSE)","v":"Waukesha County"},"Physician Services","F"]
[{"$f":"IF(COUNTIF($A$9:A573,A573)<24,A573,A573+1)","v":24},{"$f":"VLOOKUP(A574,'Counties and Regions'!$G$3:$J$74,4,FALSE)","v":"Eastern"},{"$f":"VLOOKUP(A574,'Counties and Regions'!$G$3:$J$74,3,FALSE)","v":"Waukesha County"},"Physician Services","D"]
[{"$f":"IF(COUNTIF($A$9:A574,A574)<24,A574,A574+1)","v":24},{"$f":"VLOOKUP(A575,'Counties and Regions'!$G$3:$J$74,4,FALSE)","v":"Eastern"},{"$f":"VLOOKUP(A575,'Counties and Regions'!$G$3:$J$74,3,FALSE)","v":"Waukesha County"},"Physician Services","B"]
[{"$f":"IF(COUNTIF($A$9:A575,A575)<24,A575,A575+1)","v":24},{"$f":"VLOOKUP(A576,'Counties and Regions'!$G$3:$J$74,4,FALSE)","v":"Eastern"},{"$f":"VLOOKUP(A576,'Counties and Regions'!$G$3:$J$74,3,FALSE)","v":"Waukesha County"},"Physician Services","O"]
[{"$f":"IF(COUNTIF($A$9:A576,A576)<24,A576,A576+1)","v":24},{"$f":"VLOOKUP(A577,'Counties and Regions'!$G$3:$J$74,4,FALSE)","v":"Eastern"},{"$f":"VLOOKUP(A577,'Counties and Regions'!$G$3:$J$74,3,FALSE)","v":"Waukesha County"},"Other Services","F"]
[{"$f":"IF(COUNTIF($A$9:A577,A577)<24,A577,A577+1)","v":24},{"$f":"VLOOKUP(A578,'Counties and Regions'!$G$3:$J$74,4,FALSE)","v":"Eastern"},{"$f":"VLOOKUP(A578,'Counties and Regions'!$G$3:$J$74,3,FALSE)","v":"Waukesha County"},"Other Services","D"]
[{"$f":"IF(COUNTIF($A$9:A578,A578)<24,A578,A578+1)","v":24},{"$f":"VLOOKUP(A579,'Counties and Regions'!$G$3:$J$74,4,FALSE)","v":"Eastern"},{"$f":"VLOOKUP(A579,'Counties and Regions'!$G$3:$J$74,3,FALSE)","v":"Waukesha County"},"Other Services","B"]
[{"$f":"IF(COUNTIF($A$9:A579,A579)<24,A579,A579+1)","v":24},{"$f":"VLOOKUP(A580,'Counties and Regions'!$G$3:$J$74,4,FALSE)","v":"Eastern"},{"$f":"VLOOKUP(A580,'Counties and Regions'!$G$3:$J$74,3,FALSE)","v":"Waukesha County"},"Other Services","O"]
[{"$f":"IF(COUNTIF($A$9:A580,A580)<24,A580,A580+1)","v":24},{"$f":"VLOOKUP(A581,'Counties and Regions'!$G$3:$J$74,4,FALSE)","v":"Eastern"},{"$f":"VLOOKUP(A581,'Counties and Regions'!$G$3:$J$74,3,FALSE)","v":"Waukesha County"},"Additional Services","F"]
[{"$f":"IF(COUNTIF($A$9:A581,A581)<24,A581,A581+1)","v":24},{"$f":"VLOOKUP(A582,'Counties and Regions'!$G$3:$J$74,4,FALSE)","v":"Eastern"},{"$f":"VLOOKUP(A582,'Counties and Regions'!$G$3:$J$74,3,FALSE)","v":"Waukesha County"},"Additional Services","D"]
[{"$f":"IF(COUNTIF($A$9:A582,A582)<24,A582,A582+1)","v":24},{"$f":"VLOOKUP(A583,'Counties and Regions'!$G$3:$J$74,4,FALSE)","v":"Eastern"},{"$f":"VLOOKUP(A583,'Counties and Regions'!$G$3:$J$74,3,FALSE)","v":"Waukesha County"},"Additional Services","B"]
[{"$f":"IF(COUNTIF($A$9:A583,A583)<24,A583,A583+1)","v":24},{"$f":"VLOOKUP(A584,'Counties and Regions'!$G$3:$J$74,4,FALSE)","v":"Eastern"},{"$f":"VLOOKUP(A584,'Counties and Regions'!$G$3:$J$74,3,FALSE)","v":"Waukesha County"},"Additional Services","O"]
[{"$f":"IF(COUNTIF($A$9:A584,A584)<24,A584,A584+1)","v":25},{"$f":"VLOOKUP(A585,'Counties and Regions'!$G$3:$J$74,4,FALSE)","v":"Eastern"},{"$f":"VLOOKUP(A585,'Counties and Regions'!$G$3:$J$74,3,FALSE)","v":"Brown County"},"Hospital Inpatient","F"]
[{"$f":"IF(COUNTIF($A$9:A585,A585)<24,A585,A585+1)","v":25},{"$f":"VLOOKUP(A586,'Counties and Regions'!$G$3:$J$74,4,FALSE)","v":"Eastern"},{"$f":"VLOOKUP(A586,'Counties and Regions'!$G$3:$J$74,3,FALSE)","v":"Brown County"},"Hospital Inpatient","D"]
[{"$f":"IF(COUNTIF($A$9:A586,A586)<24,A586,A586+1)","v":25},{"$f":"VLOOKUP(A587,'Counties and Regions'!$G$3:$J$74,4,FALSE)","v":"Eastern"},{"$f":"VLOOKUP(A587,'Counties and Regions'!$G$3:$J$74,3,FALSE)","v":"Brown County"},"Hospital Inpatient","B"]
[{"$f":"IF(COUNTIF($A$9:A587,A587)<24,A587,A587+1)","v":25},{"$f":"VLOOKUP(A588,'Counties and Regions'!$G$3:$J$74,4,FALSE)","v":"Eastern"},{"$f":"VLOOKUP(A588,'Counties and Regions'!$G$3:$J$74,3,FALSE)","v":"Brown County"},"Hospital Inpatient","O"]
[{"$f":"IF(COUNTIF($A$9:A588,A588)<24,A588,A588+1)","v":25},{"$f":"VLOOKUP(A589,'Counties and Regions'!$G$3:$J$74,4,FALSE)","v":"Eastern"},{"$f":"VLOOKUP(A589,'Counties and Regions'!$G$3:$J$74,3,FALSE)","v":"Brown County"},"Hospital Outpatient","F"]
[{"$f":"IF(COUNTIF($A$9:A589,A589)<24,A589,A589+1)","v":25},{"$f":"VLOOKUP(A590,'Counties and Regions'!$G$3:$J$74,4,FALSE)","v":"Eastern"},{"$f":"VLOOKUP(A590,'Counties and Regions'!$G$3:$J$74,3,FALSE)","v":"Brown County"},"Hospital Outpatient","D"]
[{"$f":"IF(COUNTIF($A$9:A590,A590)<24,A590,A590+1)","v":25},{"$f":"VLOOKUP(A591,'Counties and Regions'!$G$3:$J$74,4,FALSE)","v":"Eastern"},{"$f":"VLOOKUP(A591,'Counties and Regions'!$G$3:$J$74,3,FALSE)","v":"Brown County"},"Hospital Outpatient","B"]
[{"$f":"IF(COUNTIF($A$9:A591,A591)<24,A591,A591+1)","v":25},{"$f":"VLOOKUP(A592,'Counties and Regions'!$G$3:$J$74,4,FALSE)","v":"Eastern"},{"$f":"VLOOKUP(A592,'Counties and Regions'!$G$3:$J$74,3,FALSE)","v":"Brown County"},"Hospital Outpatient","O"]
[{"$f":"IF(COUNTIF($A$9:A592,A592)<24,A592,A592+1)","v":25},{"$f":"VLOOKUP(A593,'Counties and Regions'!$G$3:$J$74,4,FALSE)","v":"Eastern"},{"$f":"VLOOKUP(A593,'Counties and Regions'!$G$3:$J$74,3,FALSE)","v":"Brown County"},"Other Facility","F"]
[{"$f":"IF(COUNTIF($A$9:A593,A593)<24,A593,A593+1)","v":25},{"$f":"VLOOKUP(A594,'Counties and Regions'!$G$3:$J$74,4,FALSE)","v":"Eastern"},{"$f":"VLOOKUP(A594,'Counties and Regions'!$G$3:$J$74,3,FALSE)","v":"Brown County"},"Other Facility","D"]
[{"$f":"IF(COUNTIF($A$9:A594,A594)<24,A594,A594+1)","v":25},{"$f":"VLOOKUP(A595,'Counties and Regions'!$G$3:$J$74,4,FALSE)","v":"Eastern"},{"$f":"VLOOKUP(A595,'Counties and Regions'!$G$3:$J$74,3,FALSE)","v":"Brown County"},"Other Facility","B"]
[{"$f":"IF(COUNTIF($A$9:A595,A595)<24,A595,A595+1)","v":25},{"$f":"VLOOKUP(A596,'Counties and Regions'!$G$3:$J$74,4,FALSE)","v":"Eastern"},{"$f":"VLOOKUP(A596,'Counties and Regions'!$G$3:$J$74,3,FALSE)","v":"Brown County"},"Other Facility","O"]
[{"$f":"IF(COUNTIF($A$9:A596,A596)<24,A596,A596+1)","v":25},{"$f":"VLOOKUP(A597,'Counties and Regions'!$G$3:$J$74,4,FALSE)","v":"Eastern"},{"$f":"VLOOKUP(A597,'Counties and Regions'!$G$3:$J$74,3,FALSE)","v":"Brown County"},"Physician Services","F"]
[{"$f":"IF(COUNTIF($A$9:A597,A597)<24,A597,A597+1)","v":25},{"$f":"VLOOKUP(A598,'Counties and Regions'!$G$3:$J$74,4,FALSE)","v":"Eastern"},{"$f":"VLOOKUP(A598,'Counties and Regions'!$G$3:$J$74,3,FALSE)","v":"Brown County"},"Physician Services","D"]
[{"$f":"IF(COUNTIF($A$9:A598,A598)<24,A598,A598+1)","v":25},{"$f":"VLOOKUP(A599,'Counties and Regions'!$G$3:$J$74,4,FALSE)","v":"Eastern"},{"$f":"VLOOKUP(A599,'Counties and Regions'!$G$3:$J$74,3,FALSE)","v":"Brown County"},"Physician Services","B"]
[{"$f":"IF(COUNTIF($A$9:A599,A599)<24,A599,A599+1)","v":25},{"$f":"VLOOKUP(A600,'Counties and Regions'!$G$3:$J$74,4,FALSE)","v":"Eastern"},{"$f":"VLOOKUP(A600,'Counties and Regions'!$G$3:$J$74,3,FALSE)","v":"Brown County"},"Physician Services","O"]
[{"$f":"IF(COUNTIF($A$9:A600,A600)<24,A600,A600+1)","v":25},{"$f":"VLOOKUP(A601,'Counties and Regions'!$G$3:$J$74,4,FALSE)","v":"Eastern"},{"$f":"VLOOKUP(A601,'Counties and Regions'!$G$3:$J$74,3,FALSE)","v":"Brown County"},"Other Services","F"]
[{"$f":"IF(COUNTIF($A$9:A601,A601)<24,A601,A601+1)","v":25},{"$f":"VLOOKUP(A602,'Counties and Regions'!$G$3:$J$74,4,FALSE)","v":"Eastern"},{"$f":"VLOOKUP(A602,'Counties and Regions'!$G$3:$J$74,3,FALSE)","v":"Brown County"},"Other Services","D"]
[{"$f":"IF(COUNTIF($A$9:A602,A602)<24,A602,A602+1)","v":25},{"$f":"VLOOKUP(A603,'Counties and Regions'!$G$3:$J$74,4,FALSE)","v":"Eastern"},{"$f":"VLOOKUP(A603,'Counties and Regions'!$G$3:$J$74,3,FALSE)","v":"Brown County"},"Other Services","B"]
[{"$f":"IF(COUNTIF($A$9:A603,A603)<24,A603,A603+1)","v":25},{"$f":"VLOOKUP(A604,'Counties and Regions'!$G$3:$J$74,4,FALSE)","v":"Eastern"},{"$f":"VLOOKUP(A604,'Counties and Regions'!$G$3:$J$74,3,FALSE)","v":"Brown County"},"Other Services","O"]
[{"$f":"IF(COUNTIF($A$9:A604,A604)<24,A604,A604+1)","v":25},{"$f":"VLOOKUP(A605,'Counties and Regions'!$G$3:$J$74,4,FALSE)","v":"Eastern"},{"$f":"VLOOKUP(A605,'Counties and Regions'!$G$3:$J$74,3,FALSE)","v":"Brown County"},"Additional Services","F"]
[{"$f":"IF(COUNTIF($A$9:A605,A605)<24,A605,A605+1)","v":25},{"$f":"VLOOKUP(A606,'Counties and Regions'!$G$3:$J$74,4,FALSE)","v":"Eastern"},{"$f":"VLOOKUP(A606,'Counties and Regions'!$G$3:$J$74,3,FALSE)","v":"Brown County"},"Additional Services","D"]
[{"$f":"IF(COUNTIF($A$9:A606,A606)<24,A606,A606+1)","v":25},{"$f":"VLOOKUP(A607,'Counties and Regions'!$G$3:$J$74,4,FALSE)","v":"Eastern"},{"$f":"VLOOKUP(A607,'Counties and Regions'!$G$3:$J$74,3,FALSE)","v":"Brown County"},"Additional Services","B"]
[{"$f":"IF(COUNTIF($A$9:A607,A607)<24,A607,A607+1)","v":25},{"$f":"VLOOKUP(A608,'Counties and Regions'!$G$3:$J$74,4,FALSE)","v":"Eastern"},{"$f":"VLOOKUP(A608,'Counties and Regions'!$G$3:$J$74,3,FALSE)","v":"Brown County"},"Additional Services","O"]
[{"$f":"IF(COUNTIF($A$9:A608,A608)<24,A608,A608+1)","v":26},{"$f":"VLOOKUP(A609,'Counties and Regions'!$G$3:$J$74,4,FALSE)","v":"Eastern"},{"$f":"VLOOKUP(A609,'Counties and Regions'!$G$3:$J$74,3,FALSE)","v":"Calumet County"},"Hospital Inpatient","F"]
[{"$f":"IF(COUNTIF($A$9:A609,A609)<24,A609,A609+1)","v":26},{"$f":"VLOOKUP(A610,'Counties and Regions'!$G$3:$J$74,4,FALSE)","v":"Eastern"},{"$f":"VLOOKUP(A610,'Counties and Regions'!$G$3:$J$74,3,FALSE)","v":"Calumet County"},"Hospital Inpatient","D"]
[{"$f":"IF(COUNTIF($A$9:A610,A610)<24,A610,A610+1)","v":26},{"$f":"VLOOKUP(A611,'Counties and Regions'!$G$3:$J$74,4,FALSE)","v":"Eastern"},{"$f":"VLOOKUP(A611,'Counties and Regions'!$G$3:$J$74,3,FALSE)","v":"Calumet County"},"Hospital Inpatient","B"]
[{"$f":"IF(COUNTIF($A$9:A611,A611)<24,A611,A611+1)","v":26},{"$f":"VLOOKUP(A612,'Counties and Regions'!$G$3:$J$74,4,FALSE)","v":"Eastern"},{"$f":"VLOOKUP(A612,'Counties and Regions'!$G$3:$J$74,3,FALSE)","v":"Calumet County"},"Hospital Inpatient","O"]
[{"$f":"IF(COUNTIF($A$9:A612,A612)<24,A612,A612+1)","v":26},{"$f":"VLOOKUP(A613,'Counties and Regions'!$G$3:$J$74,4,FALSE)","v":"Eastern"},{"$f":"VLOOKUP(A613,'Counties and Regions'!$G$3:$J$74,3,FALSE)","v":"Calumet County"},"Hospital Outpatient","F"]
[{"$f":"IF(COUNTIF($A$9:A613,A613)<24,A613,A613+1)","v":26},{"$f":"VLOOKUP(A614,'Counties and Regions'!$G$3:$J$74,4,FALSE)","v":"Eastern"},{"$f":"VLOOKUP(A614,'Counties and Regions'!$G$3:$J$74,3,FALSE)","v":"Calumet County"},"Hospital Outpatient","D"]
[{"$f":"IF(COUNTIF($A$9:A614,A614)<24,A614,A614+1)","v":26},{"$f":"VLOOKUP(A615,'Counties and Regions'!$G$3:$J$74,4,FALSE)","v":"Eastern"},{"$f":"VLOOKUP(A615,'Counties and Regions'!$G$3:$J$74,3,FALSE)","v":"Calumet County"},"Hospital Outpatient","B"]
[{"$f":"IF(COUNTIF($A$9:A615,A615)<24,A615,A615+1)","v":26},{"$f":"VLOOKUP(A616,'Counties and Regions'!$G$3:$J$74,4,FALSE)","v":"Eastern"},{"$f":"VLOOKUP(A616,'Counties and Regions'!$G$3:$J$74,3,FALSE)","v":"Calumet County"},"Hospital Outpatient","O"]
[{"$f":"IF(COUNTIF($A$9:A616,A616)<24,A616,A616+1)","v":26},{"$f":"VLOOKUP(A617,'Counties and Regions'!$G$3:$J$74,4,FALSE)","v":"Eastern"},{"$f":"VLOOKUP(A617,'Counties and Regions'!$G$3:$J$74,3,FALSE)","v":"Calumet County"},"Other Facility","F"]
[{"$f":"IF(COUNTIF($A$9:A617,A617)<24,A617,A617+1)","v":26},{"$f":"VLOOKUP(A618,'Counties and Regions'!$G$3:$J$74,4,FALSE)","v":"Eastern"},{"$f":"VLOOKUP(A618,'Counties and Regions'!$G$3:$J$74,3,FALSE)","v":"Calumet County"},"Other Facility","D"]
[{"$f":"IF(COUNTIF($A$9:A618,A618)<24,A618,A618+1)","v":26},{"$f":"VLOOKUP(A619,'Counties and Regions'!$G$3:$J$74,4,FALSE)","v":"Eastern"},{"$f":"VLOOKUP(A619,'Counties and Regions'!$G$3:$J$74,3,FALSE)","v":"Calumet County"},"Other Facility","B"]
[{"$f":"IF(COUNTIF($A$9:A619,A619)<24,A619,A619+1)","v":26},{"$f":"VLOOKUP(A620,'Counties and Regions'!$G$3:$J$74,4,FALSE)","v":"Eastern"},{"$f":"VLOOKUP(A620,'Counties and Regions'!$G$3:$J$74,3,FALSE)","v":"Calumet County"},"Other Facility","O"]
[{"$f":"IF(COUNTIF($A$9:A620,A620)<24,A620,A620+1)","v":26},{"$f":"VLOOKUP(A621,'Counties and Regions'!$G$3:$J$74,4,FALSE)","v":"Eastern"},{"$f":"VLOOKUP(A621,'Counties and Regions'!$G$3:$J$74,3,FALSE)","v":"Calumet County"},"Physician Services","F"]
[{"$f":"IF(COUNTIF($A$9:A621,A621)<24,A621,A621+1)","v":26},{"$f":"VLOOKUP(A622,'Counties and Regions'!$G$3:$J$74,4,FALSE)","v":"Eastern"},{"$f":"VLOOKUP(A622,'Counties and Regions'!$G$3:$J$74,3,FALSE)","v":"Calumet County"},"Physician Services","D"]
[{"$f":"IF(COUNTIF($A$9:A622,A622)<24,A622,A622+1)","v":26},{"$f":"VLOOKUP(A623,'Counties and Regions'!$G$3:$J$74,4,FALSE)","v":"Eastern"},{"$f":"VLOOKUP(A623,'Counties and Regions'!$G$3:$J$74,3,FALSE)","v":"Calumet County"},"Physician Services","B"]
[{"$f":"IF(COUNTIF($A$9:A623,A623)<24,A623,A623+1)","v":26},{"$f":"VLOOKUP(A624,'Counties and Regions'!$G$3:$J$74,4,FALSE)","v":"Eastern"},{"$f":"VLOOKUP(A624,'Counties and Regions'!$G$3:$J$74,3,FALSE)","v":"Calumet County"},"Physician Services","O"]
[{"$f":"IF(COUNTIF($A$9:A624,A624)<24,A624,A624+1)","v":26},{"$f":"VLOOKUP(A625,'Counties and Regions'!$G$3:$J$74,4,FALSE)","v":"Eastern"},{"$f":"VLOOKUP(A625,'Counties and Regions'!$G$3:$J$74,3,FALSE)","v":"Calumet County"},"Other Services","F"]
[{"$f":"IF(COUNTIF($A$9:A625,A625)<24,A625,A625+1)","v":26},{"$f":"VLOOKUP(A626,'Counties and Regions'!$G$3:$J$74,4,FALSE)","v":"Eastern"},{"$f":"VLOOKUP(A626,'Counties and Regions'!$G$3:$J$74,3,FALSE)","v":"Calumet County"},"Other Services","D"]
[{"$f":"IF(COUNTIF($A$9:A626,A626)<24,A626,A626+1)","v":26},{"$f":"VLOOKUP(A627,'Counties and Regions'!$G$3:$J$74,4,FALSE)","v":"Eastern"},{"$f":"VLOOKUP(A627,'Counties and Regions'!$G$3:$J$74,3,FALSE)","v":"Calumet County"},"Other Services","B"]
[{"$f":"IF(COUNTIF($A$9:A627,A627)<24,A627,A627+1)","v":26},{"$f":"VLOOKUP(A628,'Counties and Regions'!$G$3:$J$74,4,FALSE)","v":"Eastern"},{"$f":"VLOOKUP(A628,'Counties and Regions'!$G$3:$J$74,3,FALSE)","v":"Calumet County"},"Other Services","O"]
[{"$f":"IF(COUNTIF($A$9:A628,A628)<24,A628,A628+1)","v":26},{"$f":"VLOOKUP(A629,'Counties and Regions'!$G$3:$J$74,4,FALSE)","v":"Eastern"},{"$f":"VLOOKUP(A629,'Counties and Regions'!$G$3:$J$74,3,FALSE)","v":"Calumet County"},"Additional Services","F"]
[{"$f":"IF(COUNTIF($A$9:A629,A629)<24,A629,A629+1)","v":26},{"$f":"VLOOKUP(A630,'Counties and Regions'!$G$3:$J$74,4,FALSE)","v":"Eastern"},{"$f":"VLOOKUP(A630,'Counties and Regions'!$G$3:$J$74,3,FALSE)","v":"Calumet County"},"Additional Services","D"]
[{"$f":"IF(COUNTIF($A$9:A630,A630)<24,A630,A630+1)","v":26},{"$f":"VLOOKUP(A631,'Counties and Regions'!$G$3:$J$74,4,FALSE)","v":"Eastern"},{"$f":"VLOOKUP(A631,'Counties and Regions'!$G$3:$J$74,3,FALSE)","v":"Calumet County"},"Additional Services","B"]
[{"$f":"IF(COUNTIF($A$9:A631,A631)<24,A631,A631+1)","v":26},{"$f":"VLOOKUP(A632,'Counties and Regions'!$G$3:$J$74,4,FALSE)","v":"Eastern"},{"$f":"VLOOKUP(A632,'Counties and Regions'!$G$3:$J$74,3,FALSE)","v":"Calumet County"},"Additional Services","O"]
[{"$f":"IF(COUNTIF($A$9:A632,A632)<24,A632,A632+1)","v":27},{"$f":"VLOOKUP(A633,'Counties and Regions'!$G$3:$J$74,4,FALSE)","v":"Eastern"},{"$f":"VLOOKUP(A633,'Counties and Regions'!$G$3:$J$74,3,FALSE)","v":"Door County"},"Hospital Inpatient","F"]
[{"$f":"IF(COUNTIF($A$9:A633,A633)<24,A633,A633+1)","v":27},{"$f":"VLOOKUP(A634,'Counties and Regions'!$G$3:$J$74,4,FALSE)","v":"Eastern"},{"$f":"VLOOKUP(A634,'Counties and Regions'!$G$3:$J$74,3,FALSE)","v":"Door County"},"Hospital Inpatient","D"]
[{"$f":"IF(COUNTIF($A$9:A634,A634)<24,A634,A634+1)","v":27},{"$f":"VLOOKUP(A635,'Counties and Regions'!$G$3:$J$74,4,FALSE)","v":"Eastern"},{"$f":"VLOOKUP(A635,'Counties and Regions'!$G$3:$J$74,3,FALSE)","v":"Door County"},"Hospital Inpatient","B"]
[{"$f":"IF(COUNTIF($A$9:A635,A635)<24,A635,A635+1)","v":27},{"$f":"VLOOKUP(A636,'Counties and Regions'!$G$3:$J$74,4,FALSE)","v":"Eastern"},{"$f":"VLOOKUP(A636,'Counties and Regions'!$G$3:$J$74,3,FALSE)","v":"Door County"},"Hospital Inpatient","O"]
[{"$f":"IF(COUNTIF($A$9:A636,A636)<24,A636,A636+1)","v":27},{"$f":"VLOOKUP(A637,'Counties and Regions'!$G$3:$J$74,4,FALSE)","v":"Eastern"},{"$f":"VLOOKUP(A637,'Counties and Regions'!$G$3:$J$74,3,FALSE)","v":"Door County"},"Hospital Outpatient","F"]
[{"$f":"IF(COUNTIF($A$9:A637,A637)<24,A637,A637+1)","v":27},{"$f":"VLOOKUP(A638,'Counties and Regions'!$G$3:$J$74,4,FALSE)","v":"Eastern"},{"$f":"VLOOKUP(A638,'Counties and Regions'!$G$3:$J$74,3,FALSE)","v":"Door County"},"Hospital Outpatient","D"]
[{"$f":"IF(COUNTIF($A$9:A638,A638)<24,A638,A638+1)","v":27},{"$f":"VLOOKUP(A639,'Counties and Regions'!$G$3:$J$74,4,FALSE)","v":"Eastern"},{"$f":"VLOOKUP(A639,'Counties and Regions'!$G$3:$J$74,3,FALSE)","v":"Door County"},"Hospital Outpatient","B"]
[{"$f":"IF(COUNTIF($A$9:A639,A639)<24,A639,A639+1)","v":27},{"$f":"VLOOKUP(A640,'Counties and Regions'!$G$3:$J$74,4,FALSE)","v":"Eastern"},{"$f":"VLOOKUP(A640,'Counties and Regions'!$G$3:$J$74,3,FALSE)","v":"Door County"},"Hospital Outpatient","O"]
[{"$f":"IF(COUNTIF($A$9:A640,A640)<24,A640,A640+1)","v":27},{"$f":"VLOOKUP(A641,'Counties and Regions'!$G$3:$J$74,4,FALSE)","v":"Eastern"},{"$f":"VLOOKUP(A641,'Counties and Regions'!$G$3:$J$74,3,FALSE)","v":"Door County"},"Other Facility","F"]
[{"$f":"IF(COUNTIF($A$9:A641,A641)<24,A641,A641+1)","v":27},{"$f":"VLOOKUP(A642,'Counties and Regions'!$G$3:$J$74,4,FALSE)","v":"Eastern"},{"$f":"VLOOKUP(A642,'Counties and Regions'!$G$3:$J$74,3,FALSE)","v":"Door County"},"Other Facility","D"]
[{"$f":"IF(COUNTIF($A$9:A642,A642)<24,A642,A642+1)","v":27},{"$f":"VLOOKUP(A643,'Counties and Regions'!$G$3:$J$74,4,FALSE)","v":"Eastern"},{"$f":"VLOOKUP(A643,'Counties and Regions'!$G$3:$J$74,3,FALSE)","v":"Door County"},"Other Facility","B"]
[{"$f":"IF(COUNTIF($A$9:A643,A643)<24,A643,A643+1)","v":27},{"$f":"VLOOKUP(A644,'Counties and Regions'!$G$3:$J$74,4,FALSE)","v":"Eastern"},{"$f":"VLOOKUP(A644,'Counties and Regions'!$G$3:$J$74,3,FALSE)","v":"Door County"},"Other Facility","O"]
[{"$f":"IF(COUNTIF($A$9:A644,A644)<24,A644,A644+1)","v":27},{"$f":"VLOOKUP(A645,'Counties and Regions'!$G$3:$J$74,4,FALSE)","v":"Eastern"},{"$f":"VLOOKUP(A645,'Counties and Regions'!$G$3:$J$74,3,FALSE)","v":"Door County"},"Physician Services","F"]
[{"$f":"IF(COUNTIF($A$9:A645,A645)<24,A645,A645+1)","v":27},{"$f":"VLOOKUP(A646,'Counties and Regions'!$G$3:$J$74,4,FALSE)","v":"Eastern"},{"$f":"VLOOKUP(A646,'Counties and Regions'!$G$3:$J$74,3,FALSE)","v":"Door County"},"Physician Services","D"]
[{"$f":"IF(COUNTIF($A$9:A646,A646)<24,A646,A646+1)","v":27},{"$f":"VLOOKUP(A647,'Counties and Regions'!$G$3:$J$74,4,FALSE)","v":"Eastern"},{"$f":"VLOOKUP(A647,'Counties and Regions'!$G$3:$J$74,3,FALSE)","v":"Door County"},"Physician Services","B"]
[{"$f":"IF(COUNTIF($A$9:A647,A647)<24,A647,A647+1)","v":27},{"$f":"VLOOKUP(A648,'Counties and Regions'!$G$3:$J$74,4,FALSE)","v":"Eastern"},{"$f":"VLOOKUP(A648,'Counties and Regions'!$G$3:$J$74,3,FALSE)","v":"Door County"},"Physician Services","O"]
[{"$f":"IF(COUNTIF($A$9:A648,A648)<24,A648,A648+1)","v":27},{"$f":"VLOOKUP(A649,'Counties and Regions'!$G$3:$J$74,4,FALSE)","v":"Eastern"},{"$f":"VLOOKUP(A649,'Counties and Regions'!$G$3:$J$74,3,FALSE)","v":"Door County"},"Other Services","F"]
[{"$f":"IF(COUNTIF($A$9:A649,A649)<24,A649,A649+1)","v":27},{"$f":"VLOOKUP(A650,'Counties and Regions'!$G$3:$J$74,4,FALSE)","v":"Eastern"},{"$f":"VLOOKUP(A650,'Counties and Regions'!$G$3:$J$74,3,FALSE)","v":"Door County"},"Other Services","D"]
[{"$f":"IF(COUNTIF($A$9:A650,A650)<24,A650,A650+1)","v":27},{"$f":"VLOOKUP(A651,'Counties and Regions'!$G$3:$J$74,4,FALSE)","v":"Eastern"},{"$f":"VLOOKUP(A651,'Counties and Regions'!$G$3:$J$74,3,FALSE)","v":"Door County"},"Other Services","B"]
[{"$f":"IF(COUNTIF($A$9:A651,A651)<24,A651,A651+1)","v":27},{"$f":"VLOOKUP(A652,'Counties and Regions'!$G$3:$J$74,4,FALSE)","v":"Eastern"},{"$f":"VLOOKUP(A652,'Counties and Regions'!$G$3:$J$74,3,FALSE)","v":"Door County"},"Other Services","O"]
[{"$f":"IF(COUNTIF($A$9:A652,A652)<24,A652,A652+1)","v":27},{"$f":"VLOOKUP(A653,'Counties and Regions'!$G$3:$J$74,4,FALSE)","v":"Eastern"},{"$f":"VLOOKUP(A653,'Counties and Regions'!$G$3:$J$74,3,FALSE)","v":"Door County"},"Additional Services","F"]
[{"$f":"IF(COUNTIF($A$9:A653,A653)<24,A653,A653+1)","v":27},{"$f":"VLOOKUP(A654,'Counties and Regions'!$G$3:$J$74,4,FALSE)","v":"Eastern"},{"$f":"VLOOKUP(A654,'Counties and Regions'!$G$3:$J$74,3,FALSE)","v":"Door County"},"Additional Services","D"]
[{"$f":"IF(COUNTIF($A$9:A654,A654)<24,A654,A654+1)","v":27},{"$f":"VLOOKUP(A655,'Counties and Regions'!$G$3:$J$74,4,FALSE)","v":"Eastern"},{"$f":"VLOOKUP(A655,'Counties and Regions'!$G$3:$J$74,3,FALSE)","v":"Door County"},"Additional Services","B"]
[{"$f":"IF(COUNTIF($A$9:A655,A655)<24,A655,A655+1)","v":27},{"$f":"VLOOKUP(A656,'Counties and Regions'!$G$3:$J$74,4,FALSE)","v":"Eastern"},{"$f":"VLOOKUP(A656,'Counties and Regions'!$G$3:$J$74,3,FALSE)","v":"Door County"},"Additional Services","O"]
[{"$f":"IF(COUNTIF($A$9:A656,A656)<24,A656,A656+1)","v":28},{"$f":"VLOOKUP(A657,'Counties and Regions'!$G$3:$J$74,4,FALSE)","v":"Eastern"},{"$f":"VLOOKUP(A657,'Counties and Regions'!$G$3:$J$74,3,FALSE)","v":"Fond du Lac County"},"Hospital Inpatient","F"]
[{"$f":"IF(COUNTIF($A$9:A657,A657)<24,A657,A657+1)","v":28},{"$f":"VLOOKUP(A658,'Counties and Regions'!$G$3:$J$74,4,FALSE)","v":"Eastern"},{"$f":"VLOOKUP(A658,'Counties and Regions'!$G$3:$J$74,3,FALSE)","v":"Fond du Lac County"},"Hospital Inpatient","D"]
[{"$f":"IF(COUNTIF($A$9:A658,A658)<24,A658,A658+1)","v":28},{"$f":"VLOOKUP(A659,'Counties and Regions'!$G$3:$J$74,4,FALSE)","v":"Eastern"},{"$f":"VLOOKUP(A659,'Counties and Regions'!$G$3:$J$74,3,FALSE)","v":"Fond du Lac County"},"Hospital Inpatient","B"]
[{"$f":"IF(COUNTIF($A$9:A659,A659)<24,A659,A659+1)","v":28},{"$f":"VLOOKUP(A660,'Counties and Regions'!$G$3:$J$74,4,FALSE)","v":"Eastern"},{"$f":"VLOOKUP(A660,'Counties and Regions'!$G$3:$J$74,3,FALSE)","v":"Fond du Lac County"},"Hospital Inpatient","O"]
[{"$f":"IF(COUNTIF($A$9:A660,A660)<24,A660,A660+1)","v":28},{"$f":"VLOOKUP(A661,'Counties and Regions'!$G$3:$J$74,4,FALSE)","v":"Eastern"},{"$f":"VLOOKUP(A661,'Counties and Regions'!$G$3:$J$74,3,FALSE)","v":"Fond du Lac County"},"Hospital Outpatient","F"]
[{"$f":"IF(COUNTIF($A$9:A661,A661)<24,A661,A661+1)","v":28},{"$f":"VLOOKUP(A662,'Counties and Regions'!$G$3:$J$74,4,FALSE)","v":"Eastern"},{"$f":"VLOOKUP(A662,'Counties and Regions'!$G$3:$J$74,3,FALSE)","v":"Fond du Lac County"},"Hospital Outpatient","D"]
[{"$f":"IF(COUNTIF($A$9:A662,A662)<24,A662,A662+1)","v":28},{"$f":"VLOOKUP(A663,'Counties and Regions'!$G$3:$J$74,4,FALSE)","v":"Eastern"},{"$f":"VLOOKUP(A663,'Counties and Regions'!$G$3:$J$74,3,FALSE)","v":"Fond du Lac County"},"Hospital Outpatient","B"]
[{"$f":"IF(COUNTIF($A$9:A663,A663)<24,A663,A663+1)","v":28},{"$f":"VLOOKUP(A664,'Counties and Regions'!$G$3:$J$74,4,FALSE)","v":"Eastern"},{"$f":"VLOOKUP(A664,'Counties and Regions'!$G$3:$J$74,3,FALSE)","v":"Fond du Lac County"},"Hospital Outpatient","O"]
[{"$f":"IF(COUNTIF($A$9:A664,A664)<24,A664,A664+1)","v":28},{"$f":"VLOOKUP(A665,'Counties and Regions'!$G$3:$J$74,4,FALSE)","v":"Eastern"},{"$f":"VLOOKUP(A665,'Counties and Regions'!$G$3:$J$74,3,FALSE)","v":"Fond du Lac County"},"Other Facility","F"]
[{"$f":"IF(COUNTIF($A$9:A665,A665)<24,A665,A665+1)","v":28},{"$f":"VLOOKUP(A666,'Counties and Regions'!$G$3:$J$74,4,FALSE)","v":"Eastern"},{"$f":"VLOOKUP(A666,'Counties and Regions'!$G$3:$J$74,3,FALSE)","v":"Fond du Lac County"},"Other Facility","D"]
[{"$f":"IF(COUNTIF($A$9:A666,A666)<24,A666,A666+1)","v":28},{"$f":"VLOOKUP(A667,'Counties and Regions'!$G$3:$J$74,4,FALSE)","v":"Eastern"},{"$f":"VLOOKUP(A667,'Counties and Regions'!$G$3:$J$74,3,FALSE)","v":"Fond du Lac County"},"Other Facility","B"]
[{"$f":"IF(COUNTIF($A$9:A667,A667)<24,A667,A667+1)","v":28},{"$f":"VLOOKUP(A668,'Counties and Regions'!$G$3:$J$74,4,FALSE)","v":"Eastern"},{"$f":"VLOOKUP(A668,'Counties and Regions'!$G$3:$J$74,3,FALSE)","v":"Fond du Lac County"},"Other Facility","O"]
[{"$f":"IF(COUNTIF($A$9:A668,A668)<24,A668,A668+1)","v":28},{"$f":"VLOOKUP(A669,'Counties and Regions'!$G$3:$J$74,4,FALSE)","v":"Eastern"},{"$f":"VLOOKUP(A669,'Counties and Regions'!$G$3:$J$74,3,FALSE)","v":"Fond du Lac County"},"Physician Services","F"]
[{"$f":"IF(COUNTIF($A$9:A669,A669)<24,A669,A669+1)","v":28},{"$f":"VLOOKUP(A670,'Counties and Regions'!$G$3:$J$74,4,FALSE)","v":"Eastern"},{"$f":"VLOOKUP(A670,'Counties and Regions'!$G$3:$J$74,3,FALSE)","v":"Fond du Lac County"},"Physician Services","D"]
[{"$f":"IF(COUNTIF($A$9:A670,A670)<24,A670,A670+1)","v":28},{"$f":"VLOOKUP(A671,'Counties and Regions'!$G$3:$J$74,4,FALSE)","v":"Eastern"},{"$f":"VLOOKUP(A671,'Counties and Regions'!$G$3:$J$74,3,FALSE)","v":"Fond du Lac County"},"Physician Services","B"]
[{"$f":"IF(COUNTIF($A$9:A671,A671)<24,A671,A671+1)","v":28},{"$f":"VLOOKUP(A672,'Counties and Regions'!$G$3:$J$74,4,FALSE)","v":"Eastern"},{"$f":"VLOOKUP(A672,'Counties and Regions'!$G$3:$J$74,3,FALSE)","v":"Fond du Lac County"},"Physician Services","O"]
[{"$f":"IF(COUNTIF($A$9:A672,A672)<24,A672,A672+1)","v":28},{"$f":"VLOOKUP(A673,'Counties and Regions'!$G$3:$J$74,4,FALSE)","v":"Eastern"},{"$f":"VLOOKUP(A673,'Counties and Regions'!$G$3:$J$74,3,FALSE)","v":"Fond du Lac County"},"Other Services","F"]
[{"$f":"IF(COUNTIF($A$9:A673,A673)<24,A673,A673+1)","v":28},{"$f":"VLOOKUP(A674,'Counties and Regions'!$G$3:$J$74,4,FALSE)","v":"Eastern"},{"$f":"VLOOKUP(A674,'Counties and Regions'!$G$3:$J$74,3,FALSE)","v":"Fond du Lac County"},"Other Services","D"]
[{"$f":"IF(COUNTIF($A$9:A674,A674)<24,A674,A674+1)","v":28},{"$f":"VLOOKUP(A675,'Counties and Regions'!$G$3:$J$74,4,FALSE)","v":"Eastern"},{"$f":"VLOOKUP(A675,'Counties and Regions'!$G$3:$J$74,3,FALSE)","v":"Fond du Lac County"},"Other Services","B"]
[{"$f":"IF(COUNTIF($A$9:A675,A675)<24,A675,A675+1)","v":28},{"$f":"VLOOKUP(A676,'Counties and Regions'!$G$3:$J$74,4,FALSE)","v":"Eastern"},{"$f":"VLOOKUP(A676,'Counties and Regions'!$G$3:$J$74,3,FALSE)","v":"Fond du Lac County"},"Other Services","O"]
[{"$f":"IF(COUNTIF($A$9:A676,A676)<24,A676,A676+1)","v":28},{"$f":"VLOOKUP(A677,'Counties and Regions'!$G$3:$J$74,4,FALSE)","v":"Eastern"},{"$f":"VLOOKUP(A677,'Counties and Regions'!$G$3:$J$74,3,FALSE)","v":"Fond du Lac County"},"Additional Services","F"]
[{"$f":"IF(COUNTIF($A$9:A677,A677)<24,A677,A677+1)","v":28},{"$f":"VLOOKUP(A678,'Counties and Regions'!$G$3:$J$74,4,FALSE)","v":"Eastern"},{"$f":"VLOOKUP(A678,'Counties and Regions'!$G$3:$J$74,3,FALSE)","v":"Fond du Lac County"},"Additional Services","D"]
[{"$f":"IF(COUNTIF($A$9:A678,A678)<24,A678,A678+1)","v":28},{"$f":"VLOOKUP(A679,'Counties and Regions'!$G$3:$J$74,4,FALSE)","v":"Eastern"},{"$f":"VLOOKUP(A679,'Counties and Regions'!$G$3:$J$74,3,FALSE)","v":"Fond du Lac County"},"Additional Services","B"]
[{"$f":"IF(COUNTIF($A$9:A679,A679)<24,A679,A679+1)","v":28},{"$f":"VLOOKUP(A680,'Counties and Regions'!$G$3:$J$74,4,FALSE)","v":"Eastern"},{"$f":"VLOOKUP(A680,'Counties and Regions'!$G$3:$J$74,3,FALSE)","v":"Fond du Lac County"},"Additional Services","O"]
[{"$f":"IF(COUNTIF($A$9:A680,A680)<24,A680,A680+1)","v":29},{"$f":"VLOOKUP(A681,'Counties and Regions'!$G$3:$J$74,4,FALSE)","v":"Eastern"},{"$f":"VLOOKUP(A681,'Counties and Regions'!$G$3:$J$74,3,FALSE)","v":"Green Lake County"},"Hospital Inpatient","F"]
[{"$f":"IF(COUNTIF($A$9:A681,A681)<24,A681,A681+1)","v":29},{"$f":"VLOOKUP(A682,'Counties and Regions'!$G$3:$J$74,4,FALSE)","v":"Eastern"},{"$f":"VLOOKUP(A682,'Counties and Regions'!$G$3:$J$74,3,FALSE)","v":"Green Lake County"},"Hospital Inpatient","D"]
[{"$f":"IF(COUNTIF($A$9:A682,A682)<24,A682,A682+1)","v":29},{"$f":"VLOOKUP(A683,'Counties and Regions'!$G$3:$J$74,4,FALSE)","v":"Eastern"},{"$f":"VLOOKUP(A683,'Counties and Regions'!$G$3:$J$74,3,FALSE)","v":"Green Lake County"},"Hospital Inpatient","B"]
[{"$f":"IF(COUNTIF($A$9:A683,A683)<24,A683,A683+1)","v":29},{"$f":"VLOOKUP(A684,'Counties and Regions'!$G$3:$J$74,4,FALSE)","v":"Eastern"},{"$f":"VLOOKUP(A684,'Counties and Regions'!$G$3:$J$74,3,FALSE)","v":"Green Lake County"},"Hospital Inpatient","O"]
[{"$f":"IF(COUNTIF($A$9:A684,A684)<24,A684,A684+1)","v":29},{"$f":"VLOOKUP(A685,'Counties and Regions'!$G$3:$J$74,4,FALSE)","v":"Eastern"},{"$f":"VLOOKUP(A685,'Counties and Regions'!$G$3:$J$74,3,FALSE)","v":"Green Lake County"},"Hospital Outpatient","F"]
[{"$f":"IF(COUNTIF($A$9:A685,A685)<24,A685,A685+1)","v":29},{"$f":"VLOOKUP(A686,'Counties and Regions'!$G$3:$J$74,4,FALSE)","v":"Eastern"},{"$f":"VLOOKUP(A686,'Counties and Regions'!$G$3:$J$74,3,FALSE)","v":"Green Lake County"},"Hospital Outpatient","D"]
[{"$f":"IF(COUNTIF($A$9:A686,A686)<24,A686,A686+1)","v":29},{"$f":"VLOOKUP(A687,'Counties and Regions'!$G$3:$J$74,4,FALSE)","v":"Eastern"},{"$f":"VLOOKUP(A687,'Counties and Regions'!$G$3:$J$74,3,FALSE)","v":"Green Lake County"},"Hospital Outpatient","B"]
[{"$f":"IF(COUNTIF($A$9:A687,A687)<24,A687,A687+1)","v":29},{"$f":"VLOOKUP(A688,'Counties and Regions'!$G$3:$J$74,4,FALSE)","v":"Eastern"},{"$f":"VLOOKUP(A688,'Counties and Regions'!$G$3:$J$74,3,FALSE)","v":"Green Lake County"},"Hospital Outpatient","O"]
[{"$f":"IF(COUNTIF($A$9:A688,A688)<24,A688,A688+1)","v":29},{"$f":"VLOOKUP(A689,'Counties and Regions'!$G$3:$J$74,4,FALSE)","v":"Eastern"},{"$f":"VLOOKUP(A689,'Counties and Regions'!$G$3:$J$74,3,FALSE)","v":"Green Lake County"},"Other Facility","F"]
[{"$f":"IF(COUNTIF($A$9:A689,A689)<24,A689,A689+1)","v":29},{"$f":"VLOOKUP(A690,'Counties and Regions'!$G$3:$J$74,4,FALSE)","v":"Eastern"},{"$f":"VLOOKUP(A690,'Counties and Regions'!$G$3:$J$74,3,FALSE)","v":"Green Lake County"},"Other Facility","D"]
[{"$f":"IF(COUNTIF($A$9:A690,A690)<24,A690,A690+1)","v":29},{"$f":"VLOOKUP(A691,'Counties and Regions'!$G$3:$J$74,4,FALSE)","v":"Eastern"},{"$f":"VLOOKUP(A691,'Counties and Regions'!$G$3:$J$74,3,FALSE)","v":"Green Lake County"},"Other Facility","B"]
[{"$f":"IF(COUNTIF($A$9:A691,A691)<24,A691,A691+1)","v":29},{"$f":"VLOOKUP(A692,'Counties and Regions'!$G$3:$J$74,4,FALSE)","v":"Eastern"},{"$f":"VLOOKUP(A692,'Counties and Regions'!$G$3:$J$74,3,FALSE)","v":"Green Lake County"},"Other Facility","O"]
[{"$f":"IF(COUNTIF($A$9:A692,A692)<24,A692,A692+1)","v":29},{"$f":"VLOOKUP(A693,'Counties and Regions'!$G$3:$J$74,4,FALSE)","v":"Eastern"},{"$f":"VLOOKUP(A693,'Counties and Regions'!$G$3:$J$74,3,FALSE)","v":"Green Lake County"},"Physician Services","F"]
[{"$f":"IF(COUNTIF($A$9:A693,A693)<24,A693,A693+1)","v":29},{"$f":"VLOOKUP(A694,'Counties and Regions'!$G$3:$J$74,4,FALSE)","v":"Eastern"},{"$f":"VLOOKUP(A694,'Counties and Regions'!$G$3:$J$74,3,FALSE)","v":"Green Lake County"},"Physician Services","D"]
[{"$f":"IF(COUNTIF($A$9:A694,A694)<24,A694,A694+1)","v":29},{"$f":"VLOOKUP(A695,'Counties and Regions'!$G$3:$J$74,4,FALSE)","v":"Eastern"},{"$f":"VLOOKUP(A695,'Counties and Regions'!$G$3:$J$74,3,FALSE)","v":"Green Lake County"},"Physician Services","B"]
[{"$f":"IF(COUNTIF($A$9:A695,A695)<24,A695,A695+1)","v":29},{"$f":"VLOOKUP(A696,'Counties and Regions'!$G$3:$J$74,4,FALSE)","v":"Eastern"},{"$f":"VLOOKUP(A696,'Counties and Regions'!$G$3:$J$74,3,FALSE)","v":"Green Lake County"},"Physician Services","O"]
[{"$f":"IF(COUNTIF($A$9:A696,A696)<24,A696,A696+1)","v":29},{"$f":"VLOOKUP(A697,'Counties and Regions'!$G$3:$J$74,4,FALSE)","v":"Eastern"},{"$f":"VLOOKUP(A697,'Counties and Regions'!$G$3:$J$74,3,FALSE)","v":"Green Lake County"},"Other Services","F"]
[{"$f":"IF(COUNTIF($A$9:A697,A697)<24,A697,A697+1)","v":29},{"$f":"VLOOKUP(A698,'Counties and Regions'!$G$3:$J$74,4,FALSE)","v":"Eastern"},{"$f":"VLOOKUP(A698,'Counties and Regions'!$G$3:$J$74,3,FALSE)","v":"Green Lake County"},"Other Services","D"]
[{"$f":"IF(COUNTIF($A$9:A698,A698)<24,A698,A698+1)","v":29},{"$f":"VLOOKUP(A699,'Counties and Regions'!$G$3:$J$74,4,FALSE)","v":"Eastern"},{"$f":"VLOOKUP(A699,'Counties and Regions'!$G$3:$J$74,3,FALSE)","v":"Green Lake County"},"Other Services","B"]
[{"$f":"IF(COUNTIF($A$9:A699,A699)<24,A699,A699+1)","v":29},{"$f":"VLOOKUP(A700,'Counties and Regions'!$G$3:$J$74,4,FALSE)","v":"Eastern"},{"$f":"VLOOKUP(A700,'Counties and Regions'!$G$3:$J$74,3,FALSE)","v":"Green Lake County"},"Other Services","O"]
[{"$f":"IF(COUNTIF($A$9:A700,A700)<24,A700,A700+1)","v":29},{"$f":"VLOOKUP(A701,'Counties and Regions'!$G$3:$J$74,4,FALSE)","v":"Eastern"},{"$f":"VLOOKUP(A701,'Counties and Regions'!$G$3:$J$74,3,FALSE)","v":"Green Lake County"},"Additional Services","F"]
[{"$f":"IF(COUNTIF($A$9:A701,A701)<24,A701,A701+1)","v":29},{"$f":"VLOOKUP(A702,'Counties and Regions'!$G$3:$J$74,4,FALSE)","v":"Eastern"},{"$f":"VLOOKUP(A702,'Counties and Regions'!$G$3:$J$74,3,FALSE)","v":"Green Lake County"},"Additional Services","D"]
[{"$f":"IF(COUNTIF($A$9:A702,A702)<24,A702,A702+1)","v":29},{"$f":"VLOOKUP(A703,'Counties and Regions'!$G$3:$J$74,4,FALSE)","v":"Eastern"},{"$f":"VLOOKUP(A703,'Counties and Regions'!$G$3:$J$74,3,FALSE)","v":"Green Lake County"},"Additional Services","B"]
[{"$f":"IF(COUNTIF($A$9:A703,A703)<24,A703,A703+1)","v":29},{"$f":"VLOOKUP(A704,'Counties and Regions'!$G$3:$J$74,4,FALSE)","v":"Eastern"},{"$f":"VLOOKUP(A704,'Counties and Regions'!$G$3:$J$74,3,FALSE)","v":"Green Lake County"},"Additional Services","O"]
[{"$f":"IF(COUNTIF($A$9:A704,A704)<24,A704,A704+1)","v":30},{"$f":"VLOOKUP(A705,'Counties and Regions'!$G$3:$J$74,4,FALSE)","v":"Eastern"},{"$f":"VLOOKUP(A705,'Counties and Regions'!$G$3:$J$74,3,FALSE)","v":"Kewaunee County"},"Hospital Inpatient","F"]
[{"$f":"IF(COUNTIF($A$9:A705,A705)<24,A705,A705+1)","v":30},{"$f":"VLOOKUP(A706,'Counties and Regions'!$G$3:$J$74,4,FALSE)","v":"Eastern"},{"$f":"VLOOKUP(A706,'Counties and Regions'!$G$3:$J$74,3,FALSE)","v":"Kewaunee County"},"Hospital Inpatient","D"]
[{"$f":"IF(COUNTIF($A$9:A706,A706)<24,A706,A706+1)","v":30},{"$f":"VLOOKUP(A707,'Counties and Regions'!$G$3:$J$74,4,FALSE)","v":"Eastern"},{"$f":"VLOOKUP(A707,'Counties and Regions'!$G$3:$J$74,3,FALSE)","v":"Kewaunee County"},"Hospital Inpatient","B"]
[{"$f":"IF(COUNTIF($A$9:A707,A707)<24,A707,A707+1)","v":30},{"$f":"VLOOKUP(A708,'Counties and Regions'!$G$3:$J$74,4,FALSE)","v":"Eastern"},{"$f":"VLOOKUP(A708,'Counties and Regions'!$G$3:$J$74,3,FALSE)","v":"Kewaunee County"},"Hospital Inpatient","O"]
[{"$f":"IF(COUNTIF($A$9:A708,A708)<24,A708,A708+1)","v":30},{"$f":"VLOOKUP(A709,'Counties and Regions'!$G$3:$J$74,4,FALSE)","v":"Eastern"},{"$f":"VLOOKUP(A709,'Counties and Regions'!$G$3:$J$74,3,FALSE)","v":"Kewaunee County"},"Hospital Outpatient","F"]
[{"$f":"IF(COUNTIF($A$9:A709,A709)<24,A709,A709+1)","v":30},{"$f":"VLOOKUP(A710,'Counties and Regions'!$G$3:$J$74,4,FALSE)","v":"Eastern"},{"$f":"VLOOKUP(A710,'Counties and Regions'!$G$3:$J$74,3,FALSE)","v":"Kewaunee County"},"Hospital Outpatient","D"]
[{"$f":"IF(COUNTIF($A$9:A710,A710)<24,A710,A710+1)","v":30},{"$f":"VLOOKUP(A711,'Counties and Regions'!$G$3:$J$74,4,FALSE)","v":"Eastern"},{"$f":"VLOOKUP(A711,'Counties and Regions'!$G$3:$J$74,3,FALSE)","v":"Kewaunee County"},"Hospital Outpatient","B"]
[{"$f":"IF(COUNTIF($A$9:A711,A711)<24,A711,A711+1)","v":30},{"$f":"VLOOKUP(A712,'Counties and Regions'!$G$3:$J$74,4,FALSE)","v":"Eastern"},{"$f":"VLOOKUP(A712,'Counties and Regions'!$G$3:$J$74,3,FALSE)","v":"Kewaunee County"},"Hospital Outpatient","O"]
[{"$f":"IF(COUNTIF($A$9:A712,A712)<24,A712,A712+1)","v":30},{"$f":"VLOOKUP(A713,'Counties and Regions'!$G$3:$J$74,4,FALSE)","v":"Eastern"},{"$f":"VLOOKUP(A713,'Counties and Regions'!$G$3:$J$74,3,FALSE)","v":"Kewaunee County"},"Other Facility","F"]
[{"$f":"IF(COUNTIF($A$9:A713,A713)<24,A713,A713+1)","v":30},{"$f":"VLOOKUP(A714,'Counties and Regions'!$G$3:$J$74,4,FALSE)","v":"Eastern"},{"$f":"VLOOKUP(A714,'Counties and Regions'!$G$3:$J$74,3,FALSE)","v":"Kewaunee County"},"Other Facility","D"]
[{"$f":"IF(COUNTIF($A$9:A714,A714)<24,A714,A714+1)","v":30},{"$f":"VLOOKUP(A715,'Counties and Regions'!$G$3:$J$74,4,FALSE)","v":"Eastern"},{"$f":"VLOOKUP(A715,'Counties and Regions'!$G$3:$J$74,3,FALSE)","v":"Kewaunee County"},"Other Facility","B"]
[{"$f":"IF(COUNTIF($A$9:A715,A715)<24,A715,A715+1)","v":30},{"$f":"VLOOKUP(A716,'Counties and Regions'!$G$3:$J$74,4,FALSE)","v":"Eastern"},{"$f":"VLOOKUP(A716,'Counties and Regions'!$G$3:$J$74,3,FALSE)","v":"Kewaunee County"},"Other Facility","O"]
[{"$f":"IF(COUNTIF($A$9:A716,A716)<24,A716,A716+1)","v":30},{"$f":"VLOOKUP(A717,'Counties and Regions'!$G$3:$J$74,4,FALSE)","v":"Eastern"},{"$f":"VLOOKUP(A717,'Counties and Regions'!$G$3:$J$74,3,FALSE)","v":"Kewaunee County"},"Physician Services","F"]
[{"$f":"IF(COUNTIF($A$9:A717,A717)<24,A717,A717+1)","v":30},{"$f":"VLOOKUP(A718,'Counties and Regions'!$G$3:$J$74,4,FALSE)","v":"Eastern"},{"$f":"VLOOKUP(A718,'Counties and Regions'!$G$3:$J$74,3,FALSE)","v":"Kewaunee County"},"Physician Services","D"]
[{"$f":"IF(COUNTIF($A$9:A718,A718)<24,A718,A718+1)","v":30},{"$f":"VLOOKUP(A719,'Counties and Regions'!$G$3:$J$74,4,FALSE)","v":"Eastern"},{"$f":"VLOOKUP(A719,'Counties and Regions'!$G$3:$J$74,3,FALSE)","v":"Kewaunee County"},"Physician Services","B"]
[{"$f":"IF(COUNTIF($A$9:A719,A719)<24,A719,A719+1)","v":30},{"$f":"VLOOKUP(A720,'Counties and Regions'!$G$3:$J$74,4,FALSE)","v":"Eastern"},{"$f":"VLOOKUP(A720,'Counties and Regions'!$G$3:$J$74,3,FALSE)","v":"Kewaunee County"},"Physician Services","O"]
[{"$f":"IF(COUNTIF($A$9:A720,A720)<24,A720,A720+1)","v":30},{"$f":"VLOOKUP(A721,'Counties and Regions'!$G$3:$J$74,4,FALSE)","v":"Eastern"},{"$f":"VLOOKUP(A721,'Counties and Regions'!$G$3:$J$74,3,FALSE)","v":"Kewaunee County"},"Other Services","F"]
[{"$f":"IF(COUNTIF($A$9:A721,A721)<24,A721,A721+1)","v":30},{"$f":"VLOOKUP(A722,'Counties and Regions'!$G$3:$J$74,4,FALSE)","v":"Eastern"},{"$f":"VLOOKUP(A722,'Counties and Regions'!$G$3:$J$74,3,FALSE)","v":"Kewaunee County"},"Other Services","D"]
[{"$f":"IF(COUNTIF($A$9:A722,A722)<24,A722,A722+1)","v":30},{"$f":"VLOOKUP(A723,'Counties and Regions'!$G$3:$J$74,4,FALSE)","v":"Eastern"},{"$f":"VLOOKUP(A723,'Counties and Regions'!$G$3:$J$74,3,FALSE)","v":"Kewaunee County"},"Other Services","B"]
[{"$f":"IF(COUNTIF($A$9:A723,A723)<24,A723,A723+1)","v":30},{"$f":"VLOOKUP(A724,'Counties and Regions'!$G$3:$J$74,4,FALSE)","v":"Eastern"},{"$f":"VLOOKUP(A724,'Counties and Regions'!$G$3:$J$74,3,FALSE)","v":"Kewaunee County"},"Other Services","O"]
[{"$f":"IF(COUNTIF($A$9:A724,A724)<24,A724,A724+1)","v":30},{"$f":"VLOOKUP(A725,'Counties and Regions'!$G$3:$J$74,4,FALSE)","v":"Eastern"},{"$f":"VLOOKUP(A725,'Counties and Regions'!$G$3:$J$74,3,FALSE)","v":"Kewaunee County"},"Additional Services","F"]
[{"$f":"IF(COUNTIF($A$9:A725,A725)<24,A725,A725+1)","v":30},{"$f":"VLOOKUP(A726,'Counties and Regions'!$G$3:$J$74,4,FALSE)","v":"Eastern"},{"$f":"VLOOKUP(A726,'Counties and Regions'!$G$3:$J$74,3,FALSE)","v":"Kewaunee County"},"Additional Services","D"]
[{"$f":"IF(COUNTIF($A$9:A726,A726)<24,A726,A726+1)","v":30},{"$f":"VLOOKUP(A727,'Counties and Regions'!$G$3:$J$74,4,FALSE)","v":"Eastern"},{"$f":"VLOOKUP(A727,'Counties and Regions'!$G$3:$J$74,3,FALSE)","v":"Kewaunee County"},"Additional Services","B"]
[{"$f":"IF(COUNTIF($A$9:A727,A727)<24,A727,A727+1)","v":30},{"$f":"VLOOKUP(A728,'Counties and Regions'!$G$3:$J$74,4,FALSE)","v":"Eastern"},{"$f":"VLOOKUP(A728,'Counties and Regions'!$G$3:$J$74,3,FALSE)","v":"Kewaunee County"},"Additional Services","O"]
[{"$f":"IF(COUNTIF($A$9:A728,A728)<24,A728,A728+1)","v":31},{"$f":"VLOOKUP(A729,'Counties and Regions'!$G$3:$J$74,4,FALSE)","v":"Eastern"},{"$f":"VLOOKUP(A729,'Counties and Regions'!$G$3:$J$74,3,FALSE)","v":"Manitowoc County"},"Hospital Inpatient","F"]
[{"$f":"IF(COUNTIF($A$9:A729,A729)<24,A729,A729+1)","v":31},{"$f":"VLOOKUP(A730,'Counties and Regions'!$G$3:$J$74,4,FALSE)","v":"Eastern"},{"$f":"VLOOKUP(A730,'Counties and Regions'!$G$3:$J$74,3,FALSE)","v":"Manitowoc County"},"Hospital Inpatient","D"]
[{"$f":"IF(COUNTIF($A$9:A730,A730)<24,A730,A730+1)","v":31},{"$f":"VLOOKUP(A731,'Counties and Regions'!$G$3:$J$74,4,FALSE)","v":"Eastern"},{"$f":"VLOOKUP(A731,'Counties and Regions'!$G$3:$J$74,3,FALSE)","v":"Manitowoc County"},"Hospital Inpatient","B"]
[{"$f":"IF(COUNTIF($A$9:A731,A731)<24,A731,A731+1)","v":31},{"$f":"VLOOKUP(A732,'Counties and Regions'!$G$3:$J$74,4,FALSE)","v":"Eastern"},{"$f":"VLOOKUP(A732,'Counties and Regions'!$G$3:$J$74,3,FALSE)","v":"Manitowoc County"},"Hospital Inpatient","O"]
[{"$f":"IF(COUNTIF($A$9:A732,A732)<24,A732,A732+1)","v":31},{"$f":"VLOOKUP(A733,'Counties and Regions'!$G$3:$J$74,4,FALSE)","v":"Eastern"},{"$f":"VLOOKUP(A733,'Counties and Regions'!$G$3:$J$74,3,FALSE)","v":"Manitowoc County"},"Hospital Outpatient","F"]
[{"$f":"IF(COUNTIF($A$9:A733,A733)<24,A733,A733+1)","v":31},{"$f":"VLOOKUP(A734,'Counties and Regions'!$G$3:$J$74,4,FALSE)","v":"Eastern"},{"$f":"VLOOKUP(A734,'Counties and Regions'!$G$3:$J$74,3,FALSE)","v":"Manitowoc County"},"Hospital Outpatient","D"]
[{"$f":"IF(COUNTIF($A$9:A734,A734)<24,A734,A734+1)","v":31},{"$f":"VLOOKUP(A735,'Counties and Regions'!$G$3:$J$74,4,FALSE)","v":"Eastern"},{"$f":"VLOOKUP(A735,'Counties and Regions'!$G$3:$J$74,3,FALSE)","v":"Manitowoc County"},"Hospital Outpatient","B"]
[{"$f":"IF(COUNTIF($A$9:A735,A735)<24,A735,A735+1)","v":31},{"$f":"VLOOKUP(A736,'Counties and Regions'!$G$3:$J$74,4,FALSE)","v":"Eastern"},{"$f":"VLOOKUP(A736,'Counties and Regions'!$G$3:$J$74,3,FALSE)","v":"Manitowoc County"},"Hospital Outpatient","O"]
[{"$f":"IF(COUNTIF($A$9:A736,A736)<24,A736,A736+1)","v":31},{"$f":"VLOOKUP(A737,'Counties and Regions'!$G$3:$J$74,4,FALSE)","v":"Eastern"},{"$f":"VLOOKUP(A737,'Counties and Regions'!$G$3:$J$74,3,FALSE)","v":"Manitowoc County"},"Other Facility","F"]
[{"$f":"IF(COUNTIF($A$9:A737,A737)<24,A737,A737+1)","v":31},{"$f":"VLOOKUP(A738,'Counties and Regions'!$G$3:$J$74,4,FALSE)","v":"Eastern"},{"$f":"VLOOKUP(A738,'Counties and Regions'!$G$3:$J$74,3,FALSE)","v":"Manitowoc County"},"Other Facility","D"]
[{"$f":"IF(COUNTIF($A$9:A738,A738)<24,A738,A738+1)","v":31},{"$f":"VLOOKUP(A739,'Counties and Regions'!$G$3:$J$74,4,FALSE)","v":"Eastern"},{"$f":"VLOOKUP(A739,'Counties and Regions'!$G$3:$J$74,3,FALSE)","v":"Manitowoc County"},"Other Facility","B"]
[{"$f":"IF(COUNTIF($A$9:A739,A739)<24,A739,A739+1)","v":31},{"$f":"VLOOKUP(A740,'Counties and Regions'!$G$3:$J$74,4,FALSE)","v":"Eastern"},{"$f":"VLOOKUP(A740,'Counties and Regions'!$G$3:$J$74,3,FALSE)","v":"Manitowoc County"},"Other Facility","O"]
[{"$f":"IF(COUNTIF($A$9:A740,A740)<24,A740,A740+1)","v":31},{"$f":"VLOOKUP(A741,'Counties and Regions'!$G$3:$J$74,4,FALSE)","v":"Eastern"},{"$f":"VLOOKUP(A741,'Counties and Regions'!$G$3:$J$74,3,FALSE)","v":"Manitowoc County"},"Physician Services","F"]
[{"$f":"IF(COUNTIF($A$9:A741,A741)<24,A741,A741+1)","v":31},{"$f":"VLOOKUP(A742,'Counties and Regions'!$G$3:$J$74,4,FALSE)","v":"Eastern"},{"$f":"VLOOKUP(A742,'Counties and Regions'!$G$3:$J$74,3,FALSE)","v":"Manitowoc County"},"Physician Services","D"]
[{"$f":"IF(COUNTIF($A$9:A742,A742)<24,A742,A742+1)","v":31},{"$f":"VLOOKUP(A743,'Counties and Regions'!$G$3:$J$74,4,FALSE)","v":"Eastern"},{"$f":"VLOOKUP(A743,'Counties and Regions'!$G$3:$J$74,3,FALSE)","v":"Manitowoc County"},"Physician Services","B"]
[{"$f":"IF(COUNTIF($A$9:A743,A743)<24,A743,A743+1)","v":31},{"$f":"VLOOKUP(A744,'Counties and Regions'!$G$3:$J$74,4,FALSE)","v":"Eastern"},{"$f":"VLOOKUP(A744,'Counties and Regions'!$G$3:$J$74,3,FALSE)","v":"Manitowoc County"},"Physician Services","O"]
[{"$f":"IF(COUNTIF($A$9:A744,A744)<24,A744,A744+1)","v":31},{"$f":"VLOOKUP(A745,'Counties and Regions'!$G$3:$J$74,4,FALSE)","v":"Eastern"},{"$f":"VLOOKUP(A745,'Counties and Regions'!$G$3:$J$74,3,FALSE)","v":"Manitowoc County"},"Other Services","F"]
[{"$f":"IF(COUNTIF($A$9:A745,A745)<24,A745,A745+1)","v":31},{"$f":"VLOOKUP(A746,'Counties and Regions'!$G$3:$J$74,4,FALSE)","v":"Eastern"},{"$f":"VLOOKUP(A746,'Counties and Regions'!$G$3:$J$74,3,FALSE)","v":"Manitowoc County"},"Other Services","D"]
[{"$f":"IF(COUNTIF($A$9:A746,A746)<24,A746,A746+1)","v":31},{"$f":"VLOOKUP(A747,'Counties and Regions'!$G$3:$J$74,4,FALSE)","v":"Eastern"},{"$f":"VLOOKUP(A747,'Counties and Regions'!$G$3:$J$74,3,FALSE)","v":"Manitowoc County"},"Other Services","B"]
[{"$f":"IF(COUNTIF($A$9:A747,A747)<24,A747,A747+1)","v":31},{"$f":"VLOOKUP(A748,'Counties and Regions'!$G$3:$J$74,4,FALSE)","v":"Eastern"},{"$f":"VLOOKUP(A748,'Counties and Regions'!$G$3:$J$74,3,FALSE)","v":"Manitowoc County"},"Other Services","O"]
[{"$f":"IF(COUNTIF($A$9:A748,A748)<24,A748,A748+1)","v":31},{"$f":"VLOOKUP(A749,'Counties and Regions'!$G$3:$J$74,4,FALSE)","v":"Eastern"},{"$f":"VLOOKUP(A749,'Counties and Regions'!$G$3:$J$74,3,FALSE)","v":"Manitowoc County"},"Additional Services","F"]
[{"$f":"IF(COUNTIF($A$9:A749,A749)<24,A749,A749+1)","v":31},{"$f":"VLOOKUP(A750,'Counties and Regions'!$G$3:$J$74,4,FALSE)","v":"Eastern"},{"$f":"VLOOKUP(A750,'Counties and Regions'!$G$3:$J$74,3,FALSE)","v":"Manitowoc County"},"Additional Services","D"]
[{"$f":"IF(COUNTIF($A$9:A750,A750)<24,A750,A750+1)","v":31},{"$f":"VLOOKUP(A751,'Counties and Regions'!$G$3:$J$74,4,FALSE)","v":"Eastern"},{"$f":"VLOOKUP(A751,'Counties and Regions'!$G$3:$J$74,3,FALSE)","v":"Manitowoc County"},"Additional Services","B"]
[{"$f":"IF(COUNTIF($A$9:A751,A751)<24,A751,A751+1)","v":31},{"$f":"VLOOKUP(A752,'Counties and Regions'!$G$3:$J$74,4,FALSE)","v":"Eastern"},{"$f":"VLOOKUP(A752,'Counties and Regions'!$G$3:$J$74,3,FALSE)","v":"Manitowoc County"},"Additional Services","O"]
[{"$f":"IF(COUNTIF($A$9:A752,A752)<24,A752,A752+1)","v":32},{"$f":"VLOOKUP(A753,'Counties and Regions'!$G$3:$J$74,4,FALSE)","v":"Eastern"},{"$f":"VLOOKUP(A753,'Counties and Regions'!$G$3:$J$74,3,FALSE)","v":"Marinette County"},"Hospital Inpatient","F"]
[{"$f":"IF(COUNTIF($A$9:A753,A753)<24,A753,A753+1)","v":32},{"$f":"VLOOKUP(A754,'Counties and Regions'!$G$3:$J$74,4,FALSE)","v":"Eastern"},{"$f":"VLOOKUP(A754,'Counties and Regions'!$G$3:$J$74,3,FALSE)","v":"Marinette County"},"Hospital Inpatient","D"]
[{"$f":"IF(COUNTIF($A$9:A754,A754)<24,A754,A754+1)","v":32},{"$f":"VLOOKUP(A755,'Counties and Regions'!$G$3:$J$74,4,FALSE)","v":"Eastern"},{"$f":"VLOOKUP(A755,'Counties and Regions'!$G$3:$J$74,3,FALSE)","v":"Marinette County"},"Hospital Inpatient","B"]
[{"$f":"IF(COUNTIF($A$9:A755,A755)<24,A755,A755+1)","v":32},{"$f":"VLOOKUP(A756,'Counties and Regions'!$G$3:$J$74,4,FALSE)","v":"Eastern"},{"$f":"VLOOKUP(A756,'Counties and Regions'!$G$3:$J$74,3,FALSE)","v":"Marinette County"},"Hospital Inpatient","O"]
[{"$f":"IF(COUNTIF($A$9:A756,A756)<24,A756,A756+1)","v":32},{"$f":"VLOOKUP(A757,'Counties and Regions'!$G$3:$J$74,4,FALSE)","v":"Eastern"},{"$f":"VLOOKUP(A757,'Counties and Regions'!$G$3:$J$74,3,FALSE)","v":"Marinette County"},"Hospital Outpatient","F"]
[{"$f":"IF(COUNTIF($A$9:A757,A757)<24,A757,A757+1)","v":32},{"$f":"VLOOKUP(A758,'Counties and Regions'!$G$3:$J$74,4,FALSE)","v":"Eastern"},{"$f":"VLOOKUP(A758,'Counties and Regions'!$G$3:$J$74,3,FALSE)","v":"Marinette County"},"Hospital Outpatient","D"]
[{"$f":"IF(COUNTIF($A$9:A758,A758)<24,A758,A758+1)","v":32},{"$f":"VLOOKUP(A759,'Counties and Regions'!$G$3:$J$74,4,FALSE)","v":"Eastern"},{"$f":"VLOOKUP(A759,'Counties and Regions'!$G$3:$J$74,3,FALSE)","v":"Marinette County"},"Hospital Outpatient","B"]
[{"$f":"IF(COUNTIF($A$9:A759,A759)<24,A759,A759+1)","v":32},{"$f":"VLOOKUP(A760,'Counties and Regions'!$G$3:$J$74,4,FALSE)","v":"Eastern"},{"$f":"VLOOKUP(A760,'Counties and Regions'!$G$3:$J$74,3,FALSE)","v":"Marinette County"},"Hospital Outpatient","O"]
[{"$f":"IF(COUNTIF($A$9:A760,A760)<24,A760,A760+1)","v":32},{"$f":"VLOOKUP(A761,'Counties and Regions'!$G$3:$J$74,4,FALSE)","v":"Eastern"},{"$f":"VLOOKUP(A761,'Counties and Regions'!$G$3:$J$74,3,FALSE)","v":"Marinette County"},"Other Facility","F"]
[{"$f":"IF(COUNTIF($A$9:A761,A761)<24,A761,A761+1)","v":32},{"$f":"VLOOKUP(A762,'Counties and Regions'!$G$3:$J$74,4,FALSE)","v":"Eastern"},{"$f":"VLOOKUP(A762,'Counties and Regions'!$G$3:$J$74,3,FALSE)","v":"Marinette County"},"Other Facility","D"]
[{"$f":"IF(COUNTIF($A$9:A762,A762)<24,A762,A762+1)","v":32},{"$f":"VLOOKUP(A763,'Counties and Regions'!$G$3:$J$74,4,FALSE)","v":"Eastern"},{"$f":"VLOOKUP(A763,'Counties and Regions'!$G$3:$J$74,3,FALSE)","v":"Marinette County"},"Other Facility","B"]
[{"$f":"IF(COUNTIF($A$9:A763,A763)<24,A763,A763+1)","v":32},{"$f":"VLOOKUP(A764,'Counties and Regions'!$G$3:$J$74,4,FALSE)","v":"Eastern"},{"$f":"VLOOKUP(A764,'Counties and Regions'!$G$3:$J$74,3,FALSE)","v":"Marinette County"},"Other Facility","O"]
[{"$f":"IF(COUNTIF($A$9:A764,A764)<24,A764,A764+1)","v":32},{"$f":"VLOOKUP(A765,'Counties and Regions'!$G$3:$J$74,4,FALSE)","v":"Eastern"},{"$f":"VLOOKUP(A765,'Counties and Regions'!$G$3:$J$74,3,FALSE)","v":"Marinette County"},"Physician Services","F"]
[{"$f":"IF(COUNTIF($A$9:A765,A765)<24,A765,A765+1)","v":32},{"$f":"VLOOKUP(A766,'Counties and Regions'!$G$3:$J$74,4,FALSE)","v":"Eastern"},{"$f":"VLOOKUP(A766,'Counties and Regions'!$G$3:$J$74,3,FALSE)","v":"Marinette County"},"Physician Services","D"]
[{"$f":"IF(COUNTIF($A$9:A766,A766)<24,A766,A766+1)","v":32},{"$f":"VLOOKUP(A767,'Counties and Regions'!$G$3:$J$74,4,FALSE)","v":"Eastern"},{"$f":"VLOOKUP(A767,'Counties and Regions'!$G$3:$J$74,3,FALSE)","v":"Marinette County"},"Physician Services","B"]
[{"$f":"IF(COUNTIF($A$9:A767,A767)<24,A767,A767+1)","v":32},{"$f":"VLOOKUP(A768,'Counties and Regions'!$G$3:$J$74,4,FALSE)","v":"Eastern"},{"$f":"VLOOKUP(A768,'Counties and Regions'!$G$3:$J$74,3,FALSE)","v":"Marinette County"},"Physician Services","O"]
[{"$f":"IF(COUNTIF($A$9:A768,A768)<24,A768,A768+1)","v":32},{"$f":"VLOOKUP(A769,'Counties and Regions'!$G$3:$J$74,4,FALSE)","v":"Eastern"},{"$f":"VLOOKUP(A769,'Counties and Regions'!$G$3:$J$74,3,FALSE)","v":"Marinette County"},"Other Services","F"]
[{"$f":"IF(COUNTIF($A$9:A769,A769)<24,A769,A769+1)","v":32},{"$f":"VLOOKUP(A770,'Counties and Regions'!$G$3:$J$74,4,FALSE)","v":"Eastern"},{"$f":"VLOOKUP(A770,'Counties and Regions'!$G$3:$J$74,3,FALSE)","v":"Marinette County"},"Other Services","D"]
[{"$f":"IF(COUNTIF($A$9:A770,A770)<24,A770,A770+1)","v":32},{"$f":"VLOOKUP(A771,'Counties and Regions'!$G$3:$J$74,4,FALSE)","v":"Eastern"},{"$f":"VLOOKUP(A771,'Counties and Regions'!$G$3:$J$74,3,FALSE)","v":"Marinette County"},"Other Services","B"]
[{"$f":"IF(COUNTIF($A$9:A771,A771)<24,A771,A771+1)","v":32},{"$f":"VLOOKUP(A772,'Counties and Regions'!$G$3:$J$74,4,FALSE)","v":"Eastern"},{"$f":"VLOOKUP(A772,'Counties and Regions'!$G$3:$J$74,3,FALSE)","v":"Marinette County"},"Other Services","O"]
[{"$f":"IF(COUNTIF($A$9:A772,A772)<24,A772,A772+1)","v":32},{"$f":"VLOOKUP(A773,'Counties and Regions'!$G$3:$J$74,4,FALSE)","v":"Eastern"},{"$f":"VLOOKUP(A773,'Counties and Regions'!$G$3:$J$74,3,FALSE)","v":"Marinette County"},"Additional Services","F"]
[{"$f":"IF(COUNTIF($A$9:A773,A773)<24,A773,A773+1)","v":32},{"$f":"VLOOKUP(A774,'Counties and Regions'!$G$3:$J$74,4,FALSE)","v":"Eastern"},{"$f":"VLOOKUP(A774,'Counties and Regions'!$G$3:$J$74,3,FALSE)","v":"Marinette County"},"Additional Services","D"]
[{"$f":"IF(COUNTIF($A$9:A774,A774)<24,A774,A774+1)","v":32},{"$f":"VLOOKUP(A775,'Counties and Regions'!$G$3:$J$74,4,FALSE)","v":"Eastern"},{"$f":"VLOOKUP(A775,'Counties and Regions'!$G$3:$J$74,3,FALSE)","v":"Marinette County"},"Additional Services","B"]
[{"$f":"IF(COUNTIF($A$9:A775,A775)<24,A775,A775+1)","v":32},{"$f":"VLOOKUP(A776,'Counties and Regions'!$G$3:$J$74,4,FALSE)","v":"Eastern"},{"$f":"VLOOKUP(A776,'Counties and Regions'!$G$3:$J$74,3,FALSE)","v":"Marinette County"},"Additional Services","O"]
[{"$f":"IF(COUNTIF($A$9:A776,A776)<24,A776,A776+1)","v":33},{"$f":"VLOOKUP(A777,'Counties and Regions'!$G$3:$J$74,4,FALSE)","v":"Eastern"},{"$f":"VLOOKUP(A777,'Counties and Regions'!$G$3:$J$74,3,FALSE)","v":"Marquette County"},"Hospital Inpatient","F"]
[{"$f":"IF(COUNTIF($A$9:A777,A777)<24,A777,A777+1)","v":33},{"$f":"VLOOKUP(A778,'Counties and Regions'!$G$3:$J$74,4,FALSE)","v":"Eastern"},{"$f":"VLOOKUP(A778,'Counties and Regions'!$G$3:$J$74,3,FALSE)","v":"Marquette County"},"Hospital Inpatient","D"]
[{"$f":"IF(COUNTIF($A$9:A778,A778)<24,A778,A778+1)","v":33},{"$f":"VLOOKUP(A779,'Counties and Regions'!$G$3:$J$74,4,FALSE)","v":"Eastern"},{"$f":"VLOOKUP(A779,'Counties and Regions'!$G$3:$J$74,3,FALSE)","v":"Marquette County"},"Hospital Inpatient","B"]
[{"$f":"IF(COUNTIF($A$9:A779,A779)<24,A779,A779+1)","v":33},{"$f":"VLOOKUP(A780,'Counties and Regions'!$G$3:$J$74,4,FALSE)","v":"Eastern"},{"$f":"VLOOKUP(A780,'Counties and Regions'!$G$3:$J$74,3,FALSE)","v":"Marquette County"},"Hospital Inpatient","O"]
[{"$f":"IF(COUNTIF($A$9:A780,A780)<24,A780,A780+1)","v":33},{"$f":"VLOOKUP(A781,'Counties and Regions'!$G$3:$J$74,4,FALSE)","v":"Eastern"},{"$f":"VLOOKUP(A781,'Counties and Regions'!$G$3:$J$74,3,FALSE)","v":"Marquette County"},"Hospital Outpatient","F"]
[{"$f":"IF(COUNTIF($A$9:A781,A781)<24,A781,A781+1)","v":33},{"$f":"VLOOKUP(A782,'Counties and Regions'!$G$3:$J$74,4,FALSE)","v":"Eastern"},{"$f":"VLOOKUP(A782,'Counties and Regions'!$G$3:$J$74,3,FALSE)","v":"Marquette County"},"Hospital Outpatient","D"]
[{"$f":"IF(COUNTIF($A$9:A782,A782)<24,A782,A782+1)","v":33},{"$f":"VLOOKUP(A783,'Counties and Regions'!$G$3:$J$74,4,FALSE)","v":"Eastern"},{"$f":"VLOOKUP(A783,'Counties and Regions'!$G$3:$J$74,3,FALSE)","v":"Marquette County"},"Hospital Outpatient","B"]
[{"$f":"IF(COUNTIF($A$9:A783,A783)<24,A783,A783+1)","v":33},{"$f":"VLOOKUP(A784,'Counties and Regions'!$G$3:$J$74,4,FALSE)","v":"Eastern"},{"$f":"VLOOKUP(A784,'Counties and Regions'!$G$3:$J$74,3,FALSE)","v":"Marquette County"},"Hospital Outpatient","O"]
[{"$f":"IF(COUNTIF($A$9:A784,A784)<24,A784,A784+1)","v":33},{"$f":"VLOOKUP(A785,'Counties and Regions'!$G$3:$J$74,4,FALSE)","v":"Eastern"},{"$f":"VLOOKUP(A785,'Counties and Regions'!$G$3:$J$74,3,FALSE)","v":"Marquette County"},"Other Facility","F"]
[{"$f":"IF(COUNTIF($A$9:A785,A785)<24,A785,A785+1)","v":33},{"$f":"VLOOKUP(A786,'Counties and Regions'!$G$3:$J$74,4,FALSE)","v":"Eastern"},{"$f":"VLOOKUP(A786,'Counties and Regions'!$G$3:$J$74,3,FALSE)","v":"Marquette County"},"Other Facility","D"]
[{"$f":"IF(COUNTIF($A$9:A786,A786)<24,A786,A786+1)","v":33},{"$f":"VLOOKUP(A787,'Counties and Regions'!$G$3:$J$74,4,FALSE)","v":"Eastern"},{"$f":"VLOOKUP(A787,'Counties and Regions'!$G$3:$J$74,3,FALSE)","v":"Marquette County"},"Other Facility","B"]
[{"$f":"IF(COUNTIF($A$9:A787,A787)<24,A787,A787+1)","v":33},{"$f":"VLOOKUP(A788,'Counties and Regions'!$G$3:$J$74,4,FALSE)","v":"Eastern"},{"$f":"VLOOKUP(A788,'Counties and Regions'!$G$3:$J$74,3,FALSE)","v":"Marquette County"},"Other Facility","O"]
[{"$f":"IF(COUNTIF($A$9:A788,A788)<24,A788,A788+1)","v":33},{"$f":"VLOOKUP(A789,'Counties and Regions'!$G$3:$J$74,4,FALSE)","v":"Eastern"},{"$f":"VLOOKUP(A789,'Counties and Regions'!$G$3:$J$74,3,FALSE)","v":"Marquette County"},"Physician Services","F"]
[{"$f":"IF(COUNTIF($A$9:A789,A789)<24,A789,A789+1)","v":33},{"$f":"VLOOKUP(A790,'Counties and Regions'!$G$3:$J$74,4,FALSE)","v":"Eastern"},{"$f":"VLOOKUP(A790,'Counties and Regions'!$G$3:$J$74,3,FALSE)","v":"Marquette County"},"Physician Services","D"]
[{"$f":"IF(COUNTIF($A$9:A790,A790)<24,A790,A790+1)","v":33},{"$f":"VLOOKUP(A791,'Counties and Regions'!$G$3:$J$74,4,FALSE)","v":"Eastern"},{"$f":"VLOOKUP(A791,'Counties and Regions'!$G$3:$J$74,3,FALSE)","v":"Marquette County"},"Physician Services","B"]
[{"$f":"IF(COUNTIF($A$9:A791,A791)<24,A791,A791+1)","v":33},{"$f":"VLOOKUP(A792,'Counties and Regions'!$G$3:$J$74,4,FALSE)","v":"Eastern"},{"$f":"VLOOKUP(A792,'Counties and Regions'!$G$3:$J$74,3,FALSE)","v":"Marquette County"},"Physician Services","O"]
[{"$f":"IF(COUNTIF($A$9:A792,A792)<24,A792,A792+1)","v":33},{"$f":"VLOOKUP(A793,'Counties and Regions'!$G$3:$J$74,4,FALSE)","v":"Eastern"},{"$f":"VLOOKUP(A793,'Counties and Regions'!$G$3:$J$74,3,FALSE)","v":"Marquette County"},"Other Services","F"]
[{"$f":"IF(COUNTIF($A$9:A793,A793)<24,A793,A793+1)","v":33},{"$f":"VLOOKUP(A794,'Counties and Regions'!$G$3:$J$74,4,FALSE)","v":"Eastern"},{"$f":"VLOOKUP(A794,'Counties and Regions'!$G$3:$J$74,3,FALSE)","v":"Marquette County"},"Other Services","D"]
[{"$f":"IF(COUNTIF($A$9:A794,A794)<24,A794,A794+1)","v":33},{"$f":"VLOOKUP(A795,'Counties and Regions'!$G$3:$J$74,4,FALSE)","v":"Eastern"},{"$f":"VLOOKUP(A795,'Counties and Regions'!$G$3:$J$74,3,FALSE)","v":"Marquette County"},"Other Services","B"]
[{"$f":"IF(COUNTIF($A$9:A795,A795)<24,A795,A795+1)","v":33},{"$f":"VLOOKUP(A796,'Counties and Regions'!$G$3:$J$74,4,FALSE)","v":"Eastern"},{"$f":"VLOOKUP(A796,'Counties and Regions'!$G$3:$J$74,3,FALSE)","v":"Marquette County"},"Other Services","O"]
[{"$f":"IF(COUNTIF($A$9:A796,A796)<24,A796,A796+1)","v":33},{"$f":"VLOOKUP(A797,'Counties and Regions'!$G$3:$J$74,4,FALSE)","v":"Eastern"},{"$f":"VLOOKUP(A797,'Counties and Regions'!$G$3:$J$74,3,FALSE)","v":"Marquette County"},"Additional Services","F"]
[{"$f":"IF(COUNTIF($A$9:A797,A797)<24,A797,A797+1)","v":33},{"$f":"VLOOKUP(A798,'Counties and Regions'!$G$3:$J$74,4,FALSE)","v":"Eastern"},{"$f":"VLOOKUP(A798,'Counties and Regions'!$G$3:$J$74,3,FALSE)","v":"Marquette County"},"Additional Services","D"]
[{"$f":"IF(COUNTIF($A$9:A798,A798)<24,A798,A798+1)","v":33},{"$f":"VLOOKUP(A799,'Counties and Regions'!$G$3:$J$74,4,FALSE)","v":"Eastern"},{"$f":"VLOOKUP(A799,'Counties and Regions'!$G$3:$J$74,3,FALSE)","v":"Marquette County"},"Additional Services","B"]
[{"$f":"IF(COUNTIF($A$9:A799,A799)<24,A799,A799+1)","v":33},{"$f":"VLOOKUP(A800,'Counties and Regions'!$G$3:$J$74,4,FALSE)","v":"Eastern"},{"$f":"VLOOKUP(A800,'Counties and Regions'!$G$3:$J$74,3,FALSE)","v":"Marquette County"},"Additional Services","O"]
[{"$f":"IF(COUNTIF($A$9:A800,A800)<24,A800,A800+1)","v":34},{"$f":"VLOOKUP(A801,'Counties and Regions'!$G$3:$J$74,4,FALSE)","v":"Eastern"},{"$f":"VLOOKUP(A801,'Counties and Regions'!$G$3:$J$74,3,FALSE)","v":"Menominee County"},"Hospital Inpatient","F"]
[{"$f":"IF(COUNTIF($A$9:A801,A801)<24,A801,A801+1)","v":34},{"$f":"VLOOKUP(A802,'Counties and Regions'!$G$3:$J$74,4,FALSE)","v":"Eastern"},{"$f":"VLOOKUP(A802,'Counties and Regions'!$G$3:$J$74,3,FALSE)","v":"Menominee County"},"Hospital Inpatient","D"]
[{"$f":"IF(COUNTIF($A$9:A802,A802)<24,A802,A802+1)","v":34},{"$f":"VLOOKUP(A803,'Counties and Regions'!$G$3:$J$74,4,FALSE)","v":"Eastern"},{"$f":"VLOOKUP(A803,'Counties and Regions'!$G$3:$J$74,3,FALSE)","v":"Menominee County"},"Hospital Inpatient","B"]
[{"$f":"IF(COUNTIF($A$9:A803,A803)<24,A803,A803+1)","v":34},{"$f":"VLOOKUP(A804,'Counties and Regions'!$G$3:$J$74,4,FALSE)","v":"Eastern"},{"$f":"VLOOKUP(A804,'Counties and Regions'!$G$3:$J$74,3,FALSE)","v":"Menominee County"},"Hospital Inpatient","O"]
[{"$f":"IF(COUNTIF($A$9:A804,A804)<24,A804,A804+1)","v":34},{"$f":"VLOOKUP(A805,'Counties and Regions'!$G$3:$J$74,4,FALSE)","v":"Eastern"},{"$f":"VLOOKUP(A805,'Counties and Regions'!$G$3:$J$74,3,FALSE)","v":"Menominee County"},"Hospital Outpatient","F"]
[{"$f":"IF(COUNTIF($A$9:A805,A805)<24,A805,A805+1)","v":34},{"$f":"VLOOKUP(A806,'Counties and Regions'!$G$3:$J$74,4,FALSE)","v":"Eastern"},{"$f":"VLOOKUP(A806,'Counties and Regions'!$G$3:$J$74,3,FALSE)","v":"Menominee County"},"Hospital Outpatient","D"]
[{"$f":"IF(COUNTIF($A$9:A806,A806)<24,A806,A806+1)","v":34},{"$f":"VLOOKUP(A807,'Counties and Regions'!$G$3:$J$74,4,FALSE)","v":"Eastern"},{"$f":"VLOOKUP(A807,'Counties and Regions'!$G$3:$J$74,3,FALSE)","v":"Menominee County"},"Hospital Outpatient","B"]
[{"$f":"IF(COUNTIF($A$9:A807,A807)<24,A807,A807+1)","v":34},{"$f":"VLOOKUP(A808,'Counties and Regions'!$G$3:$J$74,4,FALSE)","v":"Eastern"},{"$f":"VLOOKUP(A808,'Counties and Regions'!$G$3:$J$74,3,FALSE)","v":"Menominee County"},"Hospital Outpatient","O"]
[{"$f":"IF(COUNTIF($A$9:A808,A808)<24,A808,A808+1)","v":34},{"$f":"VLOOKUP(A809,'Counties and Regions'!$G$3:$J$74,4,FALSE)","v":"Eastern"},{"$f":"VLOOKUP(A809,'Counties and Regions'!$G$3:$J$74,3,FALSE)","v":"Menominee County"},"Other Facility","F"]
[{"$f":"IF(COUNTIF($A$9:A809,A809)<24,A809,A809+1)","v":34},{"$f":"VLOOKUP(A810,'Counties and Regions'!$G$3:$J$74,4,FALSE)","v":"Eastern"},{"$f":"VLOOKUP(A810,'Counties and Regions'!$G$3:$J$74,3,FALSE)","v":"Menominee County"},"Other Facility","D"]
[{"$f":"IF(COUNTIF($A$9:A810,A810)<24,A810,A810+1)","v":34},{"$f":"VLOOKUP(A811,'Counties and Regions'!$G$3:$J$74,4,FALSE)","v":"Eastern"},{"$f":"VLOOKUP(A811,'Counties and Regions'!$G$3:$J$74,3,FALSE)","v":"Menominee County"},"Other Facility","B"]
[{"$f":"IF(COUNTIF($A$9:A811,A811)<24,A811,A811+1)","v":34},{"$f":"VLOOKUP(A812,'Counties and Regions'!$G$3:$J$74,4,FALSE)","v":"Eastern"},{"$f":"VLOOKUP(A812,'Counties and Regions'!$G$3:$J$74,3,FALSE)","v":"Menominee County"},"Other Facility","O"]
[{"$f":"IF(COUNTIF($A$9:A812,A812)<24,A812,A812+1)","v":34},{"$f":"VLOOKUP(A813,'Counties and Regions'!$G$3:$J$74,4,FALSE)","v":"Eastern"},{"$f":"VLOOKUP(A813,'Counties and Regions'!$G$3:$J$74,3,FALSE)","v":"Menominee County"},"Physician Services","F"]
[{"$f":"IF(COUNTIF($A$9:A813,A813)<24,A813,A813+1)","v":34},{"$f":"VLOOKUP(A814,'Counties and Regions'!$G$3:$J$74,4,FALSE)","v":"Eastern"},{"$f":"VLOOKUP(A814,'Counties and Regions'!$G$3:$J$74,3,FALSE)","v":"Menominee County"},"Physician Services","D"]
[{"$f":"IF(COUNTIF($A$9:A814,A814)<24,A814,A814+1)","v":34},{"$f":"VLOOKUP(A815,'Counties and Regions'!$G$3:$J$74,4,FALSE)","v":"Eastern"},{"$f":"VLOOKUP(A815,'Counties and Regions'!$G$3:$J$74,3,FALSE)","v":"Menominee County"},"Physician Services","B"]
[{"$f":"IF(COUNTIF($A$9:A815,A815)<24,A815,A815+1)","v":34},{"$f":"VLOOKUP(A816,'Counties and Regions'!$G$3:$J$74,4,FALSE)","v":"Eastern"},{"$f":"VLOOKUP(A816,'Counties and Regions'!$G$3:$J$74,3,FALSE)","v":"Menominee County"},"Physician Services","O"]
[{"$f":"IF(COUNTIF($A$9:A816,A816)<24,A816,A816+1)","v":34},{"$f":"VLOOKUP(A817,'Counties and Regions'!$G$3:$J$74,4,FALSE)","v":"Eastern"},{"$f":"VLOOKUP(A817,'Counties and Regions'!$G$3:$J$74,3,FALSE)","v":"Menominee County"},"Other Services","F"]
[{"$f":"IF(COUNTIF($A$9:A817,A817)<24,A817,A817+1)","v":34},{"$f":"VLOOKUP(A818,'Counties and Regions'!$G$3:$J$74,4,FALSE)","v":"Eastern"},{"$f":"VLOOKUP(A818,'Counties and Regions'!$G$3:$J$74,3,FALSE)","v":"Menominee County"},"Other Services","D"]
[{"$f":"IF(COUNTIF($A$9:A818,A818)<24,A818,A818+1)","v":34},{"$f":"VLOOKUP(A819,'Counties and Regions'!$G$3:$J$74,4,FALSE)","v":"Eastern"},{"$f":"VLOOKUP(A819,'Counties and Regions'!$G$3:$J$74,3,FALSE)","v":"Menominee County"},"Other Services","B"]
[{"$f":"IF(COUNTIF($A$9:A819,A819)<24,A819,A819+1)","v":34},{"$f":"VLOOKUP(A820,'Counties and Regions'!$G$3:$J$74,4,FALSE)","v":"Eastern"},{"$f":"VLOOKUP(A820,'Counties and Regions'!$G$3:$J$74,3,FALSE)","v":"Menominee County"},"Other Services","O"]
[{"$f":"IF(COUNTIF($A$9:A820,A820)<24,A820,A820+1)","v":34},{"$f":"VLOOKUP(A821,'Counties and Regions'!$G$3:$J$74,4,FALSE)","v":"Eastern"},{"$f":"VLOOKUP(A821,'Counties and Regions'!$G$3:$J$74,3,FALSE)","v":"Menominee County"},"Additional Services","F"]
[{"$f":"IF(COUNTIF($A$9:A821,A821)<24,A821,A821+1)","v":34},{"$f":"VLOOKUP(A822,'Counties and Regions'!$G$3:$J$74,4,FALSE)","v":"Eastern"},{"$f":"VLOOKUP(A822,'Counties and Regions'!$G$3:$J$74,3,FALSE)","v":"Menominee County"},"Additional Services","D"]
[{"$f":"IF(COUNTIF($A$9:A822,A822)<24,A822,A822+1)","v":34},{"$f":"VLOOKUP(A823,'Counties and Regions'!$G$3:$J$74,4,FALSE)","v":"Eastern"},{"$f":"VLOOKUP(A823,'Counties and Regions'!$G$3:$J$74,3,FALSE)","v":"Menominee County"},"Additional Services","B"]
[{"$f":"IF(COUNTIF($A$9:A823,A823)<24,A823,A823+1)","v":34},{"$f":"VLOOKUP(A824,'Counties and Regions'!$G$3:$J$74,4,FALSE)","v":"Eastern"},{"$f":"VLOOKUP(A824,'Counties and Regions'!$G$3:$J$74,3,FALSE)","v":"Menominee County"},"Additional Services","O"]
[{"$f":"IF(COUNTIF($A$9:A824,A824)<24,A824,A824+1)","v":35},{"$f":"VLOOKUP(A825,'Counties and Regions'!$G$3:$J$74,4,FALSE)","v":"Eastern"},{"$f":"VLOOKUP(A825,'Counties and Regions'!$G$3:$J$74,3,FALSE)","v":"Oconto County"},"Hospital Inpatient","F"]
[{"$f":"IF(COUNTIF($A$9:A825,A825)<24,A825,A825+1)","v":35},{"$f":"VLOOKUP(A826,'Counties and Regions'!$G$3:$J$74,4,FALSE)","v":"Eastern"},{"$f":"VLOOKUP(A826,'Counties and Regions'!$G$3:$J$74,3,FALSE)","v":"Oconto County"},"Hospital Inpatient","D"]
[{"$f":"IF(COUNTIF($A$9:A826,A826)<24,A826,A826+1)","v":35},{"$f":"VLOOKUP(A827,'Counties and Regions'!$G$3:$J$74,4,FALSE)","v":"Eastern"},{"$f":"VLOOKUP(A827,'Counties and Regions'!$G$3:$J$74,3,FALSE)","v":"Oconto County"},"Hospital Inpatient","B"]
[{"$f":"IF(COUNTIF($A$9:A827,A827)<24,A827,A827+1)","v":35},{"$f":"VLOOKUP(A828,'Counties and Regions'!$G$3:$J$74,4,FALSE)","v":"Eastern"},{"$f":"VLOOKUP(A828,'Counties and Regions'!$G$3:$J$74,3,FALSE)","v":"Oconto County"},"Hospital Inpatient","O"]
[{"$f":"IF(COUNTIF($A$9:A828,A828)<24,A828,A828+1)","v":35},{"$f":"VLOOKUP(A829,'Counties and Regions'!$G$3:$J$74,4,FALSE)","v":"Eastern"},{"$f":"VLOOKUP(A829,'Counties and Regions'!$G$3:$J$74,3,FALSE)","v":"Oconto County"},"Hospital Outpatient","F"]
[{"$f":"IF(COUNTIF($A$9:A829,A829)<24,A829,A829+1)","v":35},{"$f":"VLOOKUP(A830,'Counties and Regions'!$G$3:$J$74,4,FALSE)","v":"Eastern"},{"$f":"VLOOKUP(A830,'Counties and Regions'!$G$3:$J$74,3,FALSE)","v":"Oconto County"},"Hospital Outpatient","D"]
[{"$f":"IF(COUNTIF($A$9:A830,A830)<24,A830,A830+1)","v":35},{"$f":"VLOOKUP(A831,'Counties and Regions'!$G$3:$J$74,4,FALSE)","v":"Eastern"},{"$f":"VLOOKUP(A831,'Counties and Regions'!$G$3:$J$74,3,FALSE)","v":"Oconto County"},"Hospital Outpatient","B"]
[{"$f":"IF(COUNTIF($A$9:A831,A831)<24,A831,A831+1)","v":35},{"$f":"VLOOKUP(A832,'Counties and Regions'!$G$3:$J$74,4,FALSE)","v":"Eastern"},{"$f":"VLOOKUP(A832,'Counties and Regions'!$G$3:$J$74,3,FALSE)","v":"Oconto County"},"Hospital Outpatient","O"]
[{"$f":"IF(COUNTIF($A$9:A832,A832)<24,A832,A832+1)","v":35},{"$f":"VLOOKUP(A833,'Counties and Regions'!$G$3:$J$74,4,FALSE)","v":"Eastern"},{"$f":"VLOOKUP(A833,'Counties and Regions'!$G$3:$J$74,3,FALSE)","v":"Oconto County"},"Other Facility","F"]
[{"$f":"IF(COUNTIF($A$9:A833,A833)<24,A833,A833+1)","v":35},{"$f":"VLOOKUP(A834,'Counties and Regions'!$G$3:$J$74,4,FALSE)","v":"Eastern"},{"$f":"VLOOKUP(A834,'Counties and Regions'!$G$3:$J$74,3,FALSE)","v":"Oconto County"},"Other Facility","D"]
[{"$f":"IF(COUNTIF($A$9:A834,A834)<24,A834,A834+1)","v":35},{"$f":"VLOOKUP(A835,'Counties and Regions'!$G$3:$J$74,4,FALSE)","v":"Eastern"},{"$f":"VLOOKUP(A835,'Counties and Regions'!$G$3:$J$74,3,FALSE)","v":"Oconto County"},"Other Facility","B"]
[{"$f":"IF(COUNTIF($A$9:A835,A835)<24,A835,A835+1)","v":35},{"$f":"VLOOKUP(A836,'Counties and Regions'!$G$3:$J$74,4,FALSE)","v":"Eastern"},{"$f":"VLOOKUP(A836,'Counties and Regions'!$G$3:$J$74,3,FALSE)","v":"Oconto County"},"Other Facility","O"]
[{"$f":"IF(COUNTIF($A$9:A836,A836)<24,A836,A836+1)","v":35},{"$f":"VLOOKUP(A837,'Counties and Regions'!$G$3:$J$74,4,FALSE)","v":"Eastern"},{"$f":"VLOOKUP(A837,'Counties and Regions'!$G$3:$J$74,3,FALSE)","v":"Oconto County"},"Physician Services","F"]
[{"$f":"IF(COUNTIF($A$9:A837,A837)<24,A837,A837+1)","v":35},{"$f":"VLOOKUP(A838,'Counties and Regions'!$G$3:$J$74,4,FALSE)","v":"Eastern"},{"$f":"VLOOKUP(A838,'Counties and Regions'!$G$3:$J$74,3,FALSE)","v":"Oconto County"},"Physician Services","D"]
[{"$f":"IF(COUNTIF($A$9:A838,A838)<24,A838,A838+1)","v":35},{"$f":"VLOOKUP(A839,'Counties and Regions'!$G$3:$J$74,4,FALSE)","v":"Eastern"},{"$f":"VLOOKUP(A839,'Counties and Regions'!$G$3:$J$74,3,FALSE)","v":"Oconto County"},"Physician Services","B"]
[{"$f":"IF(COUNTIF($A$9:A839,A839)<24,A839,A839+1)","v":35},{"$f":"VLOOKUP(A840,'Counties and Regions'!$G$3:$J$74,4,FALSE)","v":"Eastern"},{"$f":"VLOOKUP(A840,'Counties and Regions'!$G$3:$J$74,3,FALSE)","v":"Oconto County"},"Physician Services","O"]
[{"$f":"IF(COUNTIF($A$9:A840,A840)<24,A840,A840+1)","v":35},{"$f":"VLOOKUP(A841,'Counties and Regions'!$G$3:$J$74,4,FALSE)","v":"Eastern"},{"$f":"VLOOKUP(A841,'Counties and Regions'!$G$3:$J$74,3,FALSE)","v":"Oconto County"},"Other Services","F"]
[{"$f":"IF(COUNTIF($A$9:A841,A841)<24,A841,A841+1)","v":35},{"$f":"VLOOKUP(A842,'Counties and Regions'!$G$3:$J$74,4,FALSE)","v":"Eastern"},{"$f":"VLOOKUP(A842,'Counties and Regions'!$G$3:$J$74,3,FALSE)","v":"Oconto County"},"Other Services","D"]
[{"$f":"IF(COUNTIF($A$9:A842,A842)<24,A842,A842+1)","v":35},{"$f":"VLOOKUP(A843,'Counties and Regions'!$G$3:$J$74,4,FALSE)","v":"Eastern"},{"$f":"VLOOKUP(A843,'Counties and Regions'!$G$3:$J$74,3,FALSE)","v":"Oconto County"},"Other Services","B"]
[{"$f":"IF(COUNTIF($A$9:A843,A843)<24,A843,A843+1)","v":35},{"$f":"VLOOKUP(A844,'Counties and Regions'!$G$3:$J$74,4,FALSE)","v":"Eastern"},{"$f":"VLOOKUP(A844,'Counties and Regions'!$G$3:$J$74,3,FALSE)","v":"Oconto County"},"Other Services","O"]
[{"$f":"IF(COUNTIF($A$9:A844,A844)<24,A844,A844+1)","v":35},{"$f":"VLOOKUP(A845,'Counties and Regions'!$G$3:$J$74,4,FALSE)","v":"Eastern"},{"$f":"VLOOKUP(A845,'Counties and Regions'!$G$3:$J$74,3,FALSE)","v":"Oconto County"},"Additional Services","F"]
[{"$f":"IF(COUNTIF($A$9:A845,A845)<24,A845,A845+1)","v":35},{"$f":"VLOOKUP(A846,'Counties and Regions'!$G$3:$J$74,4,FALSE)","v":"Eastern"},{"$f":"VLOOKUP(A846,'Counties and Regions'!$G$3:$J$74,3,FALSE)","v":"Oconto County"},"Additional Services","D"]
[{"$f":"IF(COUNTIF($A$9:A846,A846)<24,A846,A846+1)","v":35},{"$f":"VLOOKUP(A847,'Counties and Regions'!$G$3:$J$74,4,FALSE)","v":"Eastern"},{"$f":"VLOOKUP(A847,'Counties and Regions'!$G$3:$J$74,3,FALSE)","v":"Oconto County"},"Additional Services","B"]
[{"$f":"IF(COUNTIF($A$9:A847,A847)<24,A847,A847+1)","v":35},{"$f":"VLOOKUP(A848,'Counties and Regions'!$G$3:$J$74,4,FALSE)","v":"Eastern"},{"$f":"VLOOKUP(A848,'Counties and Regions'!$G$3:$J$74,3,FALSE)","v":"Oconto County"},"Additional Services","O"]
[{"$f":"IF(COUNTIF($A$9:A848,A848)<24,A848,A848+1)","v":36},{"$f":"VLOOKUP(A849,'Counties and Regions'!$G$3:$J$74,4,FALSE)","v":"Eastern"},{"$f":"VLOOKUP(A849,'Counties and Regions'!$G$3:$J$74,3,FALSE)","v":"Outagamie County"},"Hospital Inpatient","F"]
[{"$f":"IF(COUNTIF($A$9:A849,A849)<24,A849,A849+1)","v":36},{"$f":"VLOOKUP(A850,'Counties and Regions'!$G$3:$J$74,4,FALSE)","v":"Eastern"},{"$f":"VLOOKUP(A850,'Counties and Regions'!$G$3:$J$74,3,FALSE)","v":"Outagamie County"},"Hospital Inpatient","D"]
[{"$f":"IF(COUNTIF($A$9:A850,A850)<24,A850,A850+1)","v":36},{"$f":"VLOOKUP(A851,'Counties and Regions'!$G$3:$J$74,4,FALSE)","v":"Eastern"},{"$f":"VLOOKUP(A851,'Counties and Regions'!$G$3:$J$74,3,FALSE)","v":"Outagamie County"},"Hospital Inpatient","B"]
[{"$f":"IF(COUNTIF($A$9:A851,A851)<24,A851,A851+1)","v":36},{"$f":"VLOOKUP(A852,'Counties and Regions'!$G$3:$J$74,4,FALSE)","v":"Eastern"},{"$f":"VLOOKUP(A852,'Counties and Regions'!$G$3:$J$74,3,FALSE)","v":"Outagamie County"},"Hospital Inpatient","O"]
[{"$f":"IF(COUNTIF($A$9:A852,A852)<24,A852,A852+1)","v":36},{"$f":"VLOOKUP(A853,'Counties and Regions'!$G$3:$J$74,4,FALSE)","v":"Eastern"},{"$f":"VLOOKUP(A853,'Counties and Regions'!$G$3:$J$74,3,FALSE)","v":"Outagamie County"},"Hospital Outpatient","F"]
[{"$f":"IF(COUNTIF($A$9:A853,A853)<24,A853,A853+1)","v":36},{"$f":"VLOOKUP(A854,'Counties and Regions'!$G$3:$J$74,4,FALSE)","v":"Eastern"},{"$f":"VLOOKUP(A854,'Counties and Regions'!$G$3:$J$74,3,FALSE)","v":"Outagamie County"},"Hospital Outpatient","D"]
[{"$f":"IF(COUNTIF($A$9:A854,A854)<24,A854,A854+1)","v":36},{"$f":"VLOOKUP(A855,'Counties and Regions'!$G$3:$J$74,4,FALSE)","v":"Eastern"},{"$f":"VLOOKUP(A855,'Counties and Regions'!$G$3:$J$74,3,FALSE)","v":"Outagamie County"},"Hospital Outpatient","B"]
[{"$f":"IF(COUNTIF($A$9:A855,A855)<24,A855,A855+1)","v":36},{"$f":"VLOOKUP(A856,'Counties and Regions'!$G$3:$J$74,4,FALSE)","v":"Eastern"},{"$f":"VLOOKUP(A856,'Counties and Regions'!$G$3:$J$74,3,FALSE)","v":"Outagamie County"},"Hospital Outpatient","O"]
[{"$f":"IF(COUNTIF($A$9:A856,A856)<24,A856,A856+1)","v":36},{"$f":"VLOOKUP(A857,'Counties and Regions'!$G$3:$J$74,4,FALSE)","v":"Eastern"},{"$f":"VLOOKUP(A857,'Counties and Regions'!$G$3:$J$74,3,FALSE)","v":"Outagamie County"},"Other Facility","F"]
[{"$f":"IF(COUNTIF($A$9:A857,A857)<24,A857,A857+1)","v":36},{"$f":"VLOOKUP(A858,'Counties and Regions'!$G$3:$J$74,4,FALSE)","v":"Eastern"},{"$f":"VLOOKUP(A858,'Counties and Regions'!$G$3:$J$74,3,FALSE)","v":"Outagamie County"},"Other Facility","D"]
[{"$f":"IF(COUNTIF($A$9:A858,A858)<24,A858,A858+1)","v":36},{"$f":"VLOOKUP(A859,'Counties and Regions'!$G$3:$J$74,4,FALSE)","v":"Eastern"},{"$f":"VLOOKUP(A859,'Counties and Regions'!$G$3:$J$74,3,FALSE)","v":"Outagamie County"},"Other Facility","B"]
[{"$f":"IF(COUNTIF($A$9:A859,A859)<24,A859,A859+1)","v":36},{"$f":"VLOOKUP(A860,'Counties and Regions'!$G$3:$J$74,4,FALSE)","v":"Eastern"},{"$f":"VLOOKUP(A860,'Counties and Regions'!$G$3:$J$74,3,FALSE)","v":"Outagamie County"},"Other Facility","O"]
[{"$f":"IF(COUNTIF($A$9:A860,A860)<24,A860,A860+1)","v":36},{"$f":"VLOOKUP(A861,'Counties and Regions'!$G$3:$J$74,4,FALSE)","v":"Eastern"},{"$f":"VLOOKUP(A861,'Counties and Regions'!$G$3:$J$74,3,FALSE)","v":"Outagamie County"},"Physician Services","F"]
[{"$f":"IF(COUNTIF($A$9:A861,A861)<24,A861,A861+1)","v":36},{"$f":"VLOOKUP(A862,'Counties and Regions'!$G$3:$J$74,4,FALSE)","v":"Eastern"},{"$f":"VLOOKUP(A862,'Counties and Regions'!$G$3:$J$74,3,FALSE)","v":"Outagamie County"},"Physician Services","D"]
[{"$f":"IF(COUNTIF($A$9:A862,A862)<24,A862,A862+1)","v":36},{"$f":"VLOOKUP(A863,'Counties and Regions'!$G$3:$J$74,4,FALSE)","v":"Eastern"},{"$f":"VLOOKUP(A863,'Counties and Regions'!$G$3:$J$74,3,FALSE)","v":"Outagamie County"},"Physician Services","B"]
[{"$f":"IF(COUNTIF($A$9:A863,A863)<24,A863,A863+1)","v":36},{"$f":"VLOOKUP(A864,'Counties and Regions'!$G$3:$J$74,4,FALSE)","v":"Eastern"},{"$f":"VLOOKUP(A864,'Counties and Regions'!$G$3:$J$74,3,FALSE)","v":"Outagamie County"},"Physician Services","O"]
[{"$f":"IF(COUNTIF($A$9:A864,A864)<24,A864,A864+1)","v":36},{"$f":"VLOOKUP(A865,'Counties and Regions'!$G$3:$J$74,4,FALSE)","v":"Eastern"},{"$f":"VLOOKUP(A865,'Counties and Regions'!$G$3:$J$74,3,FALSE)","v":"Outagamie County"},"Other Services","F"]
[{"$f":"IF(COUNTIF($A$9:A865,A865)<24,A865,A865+1)","v":36},{"$f":"VLOOKUP(A866,'Counties and Regions'!$G$3:$J$74,4,FALSE)","v":"Eastern"},{"$f":"VLOOKUP(A866,'Counties and Regions'!$G$3:$J$74,3,FALSE)","v":"Outagamie County"},"Other Services","D"]
[{"$f":"IF(COUNTIF($A$9:A866,A866)<24,A866,A866+1)","v":36},{"$f":"VLOOKUP(A867,'Counties and Regions'!$G$3:$J$74,4,FALSE)","v":"Eastern"},{"$f":"VLOOKUP(A867,'Counties and Regions'!$G$3:$J$74,3,FALSE)","v":"Outagamie County"},"Other Services","B"]
[{"$f":"IF(COUNTIF($A$9:A867,A867)<24,A867,A867+1)","v":36},{"$f":"VLOOKUP(A868,'Counties and Regions'!$G$3:$J$74,4,FALSE)","v":"Eastern"},{"$f":"VLOOKUP(A868,'Counties and Regions'!$G$3:$J$74,3,FALSE)","v":"Outagamie County"},"Other Services","O"]
[{"$f":"IF(COUNTIF($A$9:A868,A868)<24,A868,A868+1)","v":36},{"$f":"VLOOKUP(A869,'Counties and Regions'!$G$3:$J$74,4,FALSE)","v":"Eastern"},{"$f":"VLOOKUP(A869,'Counties and Regions'!$G$3:$J$74,3,FALSE)","v":"Outagamie County"},"Additional Services","F"]
[{"$f":"IF(COUNTIF($A$9:A869,A869)<24,A869,A869+1)","v":36},{"$f":"VLOOKUP(A870,'Counties and Regions'!$G$3:$J$74,4,FALSE)","v":"Eastern"},{"$f":"VLOOKUP(A870,'Counties and Regions'!$G$3:$J$74,3,FALSE)","v":"Outagamie County"},"Additional Services","D"]
[{"$f":"IF(COUNTIF($A$9:A870,A870)<24,A870,A870+1)","v":36},{"$f":"VLOOKUP(A871,'Counties and Regions'!$G$3:$J$74,4,FALSE)","v":"Eastern"},{"$f":"VLOOKUP(A871,'Counties and Regions'!$G$3:$J$74,3,FALSE)","v":"Outagamie County"},"Additional Services","B"]
[{"$f":"IF(COUNTIF($A$9:A871,A871)<24,A871,A871+1)","v":36},{"$f":"VLOOKUP(A872,'Counties and Regions'!$G$3:$J$74,4,FALSE)","v":"Eastern"},{"$f":"VLOOKUP(A872,'Counties and Regions'!$G$3:$J$74,3,FALSE)","v":"Outagamie County"},"Additional Services","O"]
[{"$f":"IF(COUNTIF($A$9:A872,A872)<24,A872,A872+1)","v":37},{"$f":"VLOOKUP(A873,'Counties and Regions'!$G$3:$J$74,4,FALSE)","v":"Eastern"},{"$f":"VLOOKUP(A873,'Counties and Regions'!$G$3:$J$74,3,FALSE)","v":"Shawano County"},"Hospital Inpatient","F"]
[{"$f":"IF(COUNTIF($A$9:A873,A873)<24,A873,A873+1)","v":37},{"$f":"VLOOKUP(A874,'Counties and Regions'!$G$3:$J$74,4,FALSE)","v":"Eastern"},{"$f":"VLOOKUP(A874,'Counties and Regions'!$G$3:$J$74,3,FALSE)","v":"Shawano County"},"Hospital Inpatient","D"]
[{"$f":"IF(COUNTIF($A$9:A874,A874)<24,A874,A874+1)","v":37},{"$f":"VLOOKUP(A875,'Counties and Regions'!$G$3:$J$74,4,FALSE)","v":"Eastern"},{"$f":"VLOOKUP(A875,'Counties and Regions'!$G$3:$J$74,3,FALSE)","v":"Shawano County"},"Hospital Inpatient","B"]
[{"$f":"IF(COUNTIF($A$9:A875,A875)<24,A875,A875+1)","v":37},{"$f":"VLOOKUP(A876,'Counties and Regions'!$G$3:$J$74,4,FALSE)","v":"Eastern"},{"$f":"VLOOKUP(A876,'Counties and Regions'!$G$3:$J$74,3,FALSE)","v":"Shawano County"},"Hospital Inpatient","O"]
[{"$f":"IF(COUNTIF($A$9:A876,A876)<24,A876,A876+1)","v":37},{"$f":"VLOOKUP(A877,'Counties and Regions'!$G$3:$J$74,4,FALSE)","v":"Eastern"},{"$f":"VLOOKUP(A877,'Counties and Regions'!$G$3:$J$74,3,FALSE)","v":"Shawano County"},"Hospital Outpatient","F"]
[{"$f":"IF(COUNTIF($A$9:A877,A877)<24,A877,A877+1)","v":37},{"$f":"VLOOKUP(A878,'Counties and Regions'!$G$3:$J$74,4,FALSE)","v":"Eastern"},{"$f":"VLOOKUP(A878,'Counties and Regions'!$G$3:$J$74,3,FALSE)","v":"Shawano County"},"Hospital Outpatient","D"]
[{"$f":"IF(COUNTIF($A$9:A878,A878)<24,A878,A878+1)","v":37},{"$f":"VLOOKUP(A879,'Counties and Regions'!$G$3:$J$74,4,FALSE)","v":"Eastern"},{"$f":"VLOOKUP(A879,'Counties and Regions'!$G$3:$J$74,3,FALSE)","v":"Shawano County"},"Hospital Outpatient","B"]
[{"$f":"IF(COUNTIF($A$9:A879,A879)<24,A879,A879+1)","v":37},{"$f":"VLOOKUP(A880,'Counties and Regions'!$G$3:$J$74,4,FALSE)","v":"Eastern"},{"$f":"VLOOKUP(A880,'Counties and Regions'!$G$3:$J$74,3,FALSE)","v":"Shawano County"},"Hospital Outpatient","O"]
[{"$f":"IF(COUNTIF($A$9:A880,A880)<24,A880,A880+1)","v":37},{"$f":"VLOOKUP(A881,'Counties and Regions'!$G$3:$J$74,4,FALSE)","v":"Eastern"},{"$f":"VLOOKUP(A881,'Counties and Regions'!$G$3:$J$74,3,FALSE)","v":"Shawano County"},"Other Facility","F"]
[{"$f":"IF(COUNTIF($A$9:A881,A881)<24,A881,A881+1)","v":37},{"$f":"VLOOKUP(A882,'Counties and Regions'!$G$3:$J$74,4,FALSE)","v":"Eastern"},{"$f":"VLOOKUP(A882,'Counties and Regions'!$G$3:$J$74,3,FALSE)","v":"Shawano County"},"Other Facility","D"]
[{"$f":"IF(COUNTIF($A$9:A882,A882)<24,A882,A882+1)","v":37},{"$f":"VLOOKUP(A883,'Counties and Regions'!$G$3:$J$74,4,FALSE)","v":"Eastern"},{"$f":"VLOOKUP(A883,'Counties and Regions'!$G$3:$J$74,3,FALSE)","v":"Shawano County"},"Other Facility","B"]
[{"$f":"IF(COUNTIF($A$9:A883,A883)<24,A883,A883+1)","v":37},{"$f":"VLOOKUP(A884,'Counties and Regions'!$G$3:$J$74,4,FALSE)","v":"Eastern"},{"$f":"VLOOKUP(A884,'Counties and Regions'!$G$3:$J$74,3,FALSE)","v":"Shawano County"},"Other Facility","O"]
[{"$f":"IF(COUNTIF($A$9:A884,A884)<24,A884,A884+1)","v":37},{"$f":"VLOOKUP(A885,'Counties and Regions'!$G$3:$J$74,4,FALSE)","v":"Eastern"},{"$f":"VLOOKUP(A885,'Counties and Regions'!$G$3:$J$74,3,FALSE)","v":"Shawano County"},"Physician Services","F"]
[{"$f":"IF(COUNTIF($A$9:A885,A885)<24,A885,A885+1)","v":37},{"$f":"VLOOKUP(A886,'Counties and Regions'!$G$3:$J$74,4,FALSE)","v":"Eastern"},{"$f":"VLOOKUP(A886,'Counties and Regions'!$G$3:$J$74,3,FALSE)","v":"Shawano County"},"Physician Services","D"]
[{"$f":"IF(COUNTIF($A$9:A886,A886)<24,A886,A886+1)","v":37},{"$f":"VLOOKUP(A887,'Counties and Regions'!$G$3:$J$74,4,FALSE)","v":"Eastern"},{"$f":"VLOOKUP(A887,'Counties and Regions'!$G$3:$J$74,3,FALSE)","v":"Shawano County"},"Physician Services","B"]
[{"$f":"IF(COUNTIF($A$9:A887,A887)<24,A887,A887+1)","v":37},{"$f":"VLOOKUP(A888,'Counties and Regions'!$G$3:$J$74,4,FALSE)","v":"Eastern"},{"$f":"VLOOKUP(A888,'Counties and Regions'!$G$3:$J$74,3,FALSE)","v":"Shawano County"},"Physician Services","O"]
[{"$f":"IF(COUNTIF($A$9:A888,A888)<24,A888,A888+1)","v":37},{"$f":"VLOOKUP(A889,'Counties and Regions'!$G$3:$J$74,4,FALSE)","v":"Eastern"},{"$f":"VLOOKUP(A889,'Counties and Regions'!$G$3:$J$74,3,FALSE)","v":"Shawano County"},"Other Services","F"]
[{"$f":"IF(COUNTIF($A$9:A889,A889)<24,A889,A889+1)","v":37},{"$f":"VLOOKUP(A890,'Counties and Regions'!$G$3:$J$74,4,FALSE)","v":"Eastern"},{"$f":"VLOOKUP(A890,'Counties and Regions'!$G$3:$J$74,3,FALSE)","v":"Shawano County"},"Other Services","D"]
[{"$f":"IF(COUNTIF($A$9:A890,A890)<24,A890,A890+1)","v":37},{"$f":"VLOOKUP(A891,'Counties and Regions'!$G$3:$J$74,4,FALSE)","v":"Eastern"},{"$f":"VLOOKUP(A891,'Counties and Regions'!$G$3:$J$74,3,FALSE)","v":"Shawano County"},"Other Services","B"]
[{"$f":"IF(COUNTIF($A$9:A891,A891)<24,A891,A891+1)","v":37},{"$f":"VLOOKUP(A892,'Counties and Regions'!$G$3:$J$74,4,FALSE)","v":"Eastern"},{"$f":"VLOOKUP(A892,'Counties and Regions'!$G$3:$J$74,3,FALSE)","v":"Shawano County"},"Other Services","O"]
[{"$f":"IF(COUNTIF($A$9:A892,A892)<24,A892,A892+1)","v":37},{"$f":"VLOOKUP(A893,'Counties and Regions'!$G$3:$J$74,4,FALSE)","v":"Eastern"},{"$f":"VLOOKUP(A893,'Counties and Regions'!$G$3:$J$74,3,FALSE)","v":"Shawano County"},"Additional Services","F"]
[{"$f":"IF(COUNTIF($A$9:A893,A893)<24,A893,A893+1)","v":37},{"$f":"VLOOKUP(A894,'Counties and Regions'!$G$3:$J$74,4,FALSE)","v":"Eastern"},{"$f":"VLOOKUP(A894,'Counties and Regions'!$G$3:$J$74,3,FALSE)","v":"Shawano County"},"Additional Services","D"]
[{"$f":"IF(COUNTIF($A$9:A894,A894)<24,A894,A894+1)","v":37},{"$f":"VLOOKUP(A895,'Counties and Regions'!$G$3:$J$74,4,FALSE)","v":"Eastern"},{"$f":"VLOOKUP(A895,'Counties and Regions'!$G$3:$J$74,3,FALSE)","v":"Shawano County"},"Additional Services","B"]
[{"$f":"IF(COUNTIF($A$9:A895,A895)<24,A895,A895+1)","v":37},{"$f":"VLOOKUP(A896,'Counties and Regions'!$G$3:$J$74,4,FALSE)","v":"Eastern"},{"$f":"VLOOKUP(A896,'Counties and Regions'!$G$3:$J$74,3,FALSE)","v":"Shawano County"},"Additional Services","O"]
[{"$f":"IF(COUNTIF($A$9:A896,A896)<24,A896,A896+1)","v":38},{"$f":"VLOOKUP(A897,'Counties and Regions'!$G$3:$J$74,4,FALSE)","v":"Eastern"},{"$f":"VLOOKUP(A897,'Counties and Regions'!$G$3:$J$74,3,FALSE)","v":"Sheboygan County"},"Hospital Inpatient","F"]
[{"$f":"IF(COUNTIF($A$9:A897,A897)<24,A897,A897+1)","v":38},{"$f":"VLOOKUP(A898,'Counties and Regions'!$G$3:$J$74,4,FALSE)","v":"Eastern"},{"$f":"VLOOKUP(A898,'Counties and Regions'!$G$3:$J$74,3,FALSE)","v":"Sheboygan County"},"Hospital Inpatient","D"]
[{"$f":"IF(COUNTIF($A$9:A898,A898)<24,A898,A898+1)","v":38},{"$f":"VLOOKUP(A899,'Counties and Regions'!$G$3:$J$74,4,FALSE)","v":"Eastern"},{"$f":"VLOOKUP(A899,'Counties and Regions'!$G$3:$J$74,3,FALSE)","v":"Sheboygan County"},"Hospital Inpatient","B"]
[{"$f":"IF(COUNTIF($A$9:A899,A899)<24,A899,A899+1)","v":38},{"$f":"VLOOKUP(A900,'Counties and Regions'!$G$3:$J$74,4,FALSE)","v":"Eastern"},{"$f":"VLOOKUP(A900,'Counties and Regions'!$G$3:$J$74,3,FALSE)","v":"Sheboygan County"},"Hospital Inpatient","O"]
[{"$f":"IF(COUNTIF($A$9:A900,A900)<24,A900,A900+1)","v":38},{"$f":"VLOOKUP(A901,'Counties and Regions'!$G$3:$J$74,4,FALSE)","v":"Eastern"},{"$f":"VLOOKUP(A901,'Counties and Regions'!$G$3:$J$74,3,FALSE)","v":"Sheboygan County"},"Hospital Outpatient","F"]
[{"$f":"IF(COUNTIF($A$9:A901,A901)<24,A901,A901+1)","v":38},{"$f":"VLOOKUP(A902,'Counties and Regions'!$G$3:$J$74,4,FALSE)","v":"Eastern"},{"$f":"VLOOKUP(A902,'Counties and Regions'!$G$3:$J$74,3,FALSE)","v":"Sheboygan County"},"Hospital Outpatient","D"]
[{"$f":"IF(COUNTIF($A$9:A902,A902)<24,A902,A902+1)","v":38},{"$f":"VLOOKUP(A903,'Counties and Regions'!$G$3:$J$74,4,FALSE)","v":"Eastern"},{"$f":"VLOOKUP(A903,'Counties and Regions'!$G$3:$J$74,3,FALSE)","v":"Sheboygan County"},"Hospital Outpatient","B"]
[{"$f":"IF(COUNTIF($A$9:A903,A903)<24,A903,A903+1)","v":38},{"$f":"VLOOKUP(A904,'Counties and Regions'!$G$3:$J$74,4,FALSE)","v":"Eastern"},{"$f":"VLOOKUP(A904,'Counties and Regions'!$G$3:$J$74,3,FALSE)","v":"Sheboygan County"},"Hospital Outpatient","O"]
[{"$f":"IF(COUNTIF($A$9:A904,A904)<24,A904,A904+1)","v":38},{"$f":"VLOOKUP(A905,'Counties and Regions'!$G$3:$J$74,4,FALSE)","v":"Eastern"},{"$f":"VLOOKUP(A905,'Counties and Regions'!$G$3:$J$74,3,FALSE)","v":"Sheboygan County"},"Other Facility","F"]
[{"$f":"IF(COUNTIF($A$9:A905,A905)<24,A905,A905+1)","v":38},{"$f":"VLOOKUP(A906,'Counties and Regions'!$G$3:$J$74,4,FALSE)","v":"Eastern"},{"$f":"VLOOKUP(A906,'Counties and Regions'!$G$3:$J$74,3,FALSE)","v":"Sheboygan County"},"Other Facility","D"]
[{"$f":"IF(COUNTIF($A$9:A906,A906)<24,A906,A906+1)","v":38},{"$f":"VLOOKUP(A907,'Counties and Regions'!$G$3:$J$74,4,FALSE)","v":"Eastern"},{"$f":"VLOOKUP(A907,'Counties and Regions'!$G$3:$J$74,3,FALSE)","v":"Sheboygan County"},"Other Facility","B"]
[{"$f":"IF(COUNTIF($A$9:A907,A907)<24,A907,A907+1)","v":38},{"$f":"VLOOKUP(A908,'Counties and Regions'!$G$3:$J$74,4,FALSE)","v":"Eastern"},{"$f":"VLOOKUP(A908,'Counties and Regions'!$G$3:$J$74,3,FALSE)","v":"Sheboygan County"},"Other Facility","O"]
[{"$f":"IF(COUNTIF($A$9:A908,A908)<24,A908,A908+1)","v":38},{"$f":"VLOOKUP(A909,'Counties and Regions'!$G$3:$J$74,4,FALSE)","v":"Eastern"},{"$f":"VLOOKUP(A909,'Counties and Regions'!$G$3:$J$74,3,FALSE)","v":"Sheboygan County"},"Physician Services","F"]
[{"$f":"IF(COUNTIF($A$9:A909,A909)<24,A909,A909+1)","v":38},{"$f":"VLOOKUP(A910,'Counties and Regions'!$G$3:$J$74,4,FALSE)","v":"Eastern"},{"$f":"VLOOKUP(A910,'Counties and Regions'!$G$3:$J$74,3,FALSE)","v":"Sheboygan County"},"Physician Services","D"]
[{"$f":"IF(COUNTIF($A$9:A910,A910)<24,A910,A910+1)","v":38},{"$f":"VLOOKUP(A911,'Counties and Regions'!$G$3:$J$74,4,FALSE)","v":"Eastern"},{"$f":"VLOOKUP(A911,'Counties and Regions'!$G$3:$J$74,3,FALSE)","v":"Sheboygan County"},"Physician Services","B"]
[{"$f":"IF(COUNTIF($A$9:A911,A911)<24,A911,A911+1)","v":38},{"$f":"VLOOKUP(A912,'Counties and Regions'!$G$3:$J$74,4,FALSE)","v":"Eastern"},{"$f":"VLOOKUP(A912,'Counties and Regions'!$G$3:$J$74,3,FALSE)","v":"Sheboygan County"},"Physician Services","O"]
[{"$f":"IF(COUNTIF($A$9:A912,A912)<24,A912,A912+1)","v":38},{"$f":"VLOOKUP(A913,'Counties and Regions'!$G$3:$J$74,4,FALSE)","v":"Eastern"},{"$f":"VLOOKUP(A913,'Counties and Regions'!$G$3:$J$74,3,FALSE)","v":"Sheboygan County"},"Other Services","F"]
[{"$f":"IF(COUNTIF($A$9:A913,A913)<24,A913,A913+1)","v":38},{"$f":"VLOOKUP(A914,'Counties and Regions'!$G$3:$J$74,4,FALSE)","v":"Eastern"},{"$f":"VLOOKUP(A914,'Counties and Regions'!$G$3:$J$74,3,FALSE)","v":"Sheboygan County"},"Other Services","D"]
[{"$f":"IF(COUNTIF($A$9:A914,A914)<24,A914,A914+1)","v":38},{"$f":"VLOOKUP(A915,'Counties and Regions'!$G$3:$J$74,4,FALSE)","v":"Eastern"},{"$f":"VLOOKUP(A915,'Counties and Regions'!$G$3:$J$74,3,FALSE)","v":"Sheboygan County"},"Other Services","B"]
[{"$f":"IF(COUNTIF($A$9:A915,A915)<24,A915,A915+1)","v":38},{"$f":"VLOOKUP(A916,'Counties and Regions'!$G$3:$J$74,4,FALSE)","v":"Eastern"},{"$f":"VLOOKUP(A916,'Counties and Regions'!$G$3:$J$74,3,FALSE)","v":"Sheboygan County"},"Other Services","O"]
[{"$f":"IF(COUNTIF($A$9:A916,A916)<24,A916,A916+1)","v":38},{"$f":"VLOOKUP(A917,'Counties and Regions'!$G$3:$J$74,4,FALSE)","v":"Eastern"},{"$f":"VLOOKUP(A917,'Counties and Regions'!$G$3:$J$74,3,FALSE)","v":"Sheboygan County"},"Additional Services","F"]
[{"$f":"IF(COUNTIF($A$9:A917,A917)<24,A917,A917+1)","v":38},{"$f":"VLOOKUP(A918,'Counties and Regions'!$G$3:$J$74,4,FALSE)","v":"Eastern"},{"$f":"VLOOKUP(A918,'Counties and Regions'!$G$3:$J$74,3,FALSE)","v":"Sheboygan County"},"Additional Services","D"]
[{"$f":"IF(COUNTIF($A$9:A918,A918)<24,A918,A918+1)","v":38},{"$f":"VLOOKUP(A919,'Counties and Regions'!$G$3:$J$74,4,FALSE)","v":"Eastern"},{"$f":"VLOOKUP(A919,'Counties and Regions'!$G$3:$J$74,3,FALSE)","v":"Sheboygan County"},"Additional Services","B"]
[{"$f":"IF(COUNTIF($A$9:A919,A919)<24,A919,A919+1)","v":38},{"$f":"VLOOKUP(A920,'Counties and Regions'!$G$3:$J$74,4,FALSE)","v":"Eastern"},{"$f":"VLOOKUP(A920,'Counties and Regions'!$G$3:$J$74,3,FALSE)","v":"Sheboygan County"},"Additional Services","O"]
[{"$f":"IF(COUNTIF($A$9:A920,A920)<24,A920,A920+1)","v":39},{"$f":"VLOOKUP(A921,'Counties and Regions'!$G$3:$J$74,4,FALSE)","v":"Eastern"},{"$f":"VLOOKUP(A921,'Counties and Regions'!$G$3:$J$74,3,FALSE)","v":"Waupaca County"},"Hospital Inpatient","F"]
[{"$f":"IF(COUNTIF($A$9:A921,A921)<24,A921,A921+1)","v":39},{"$f":"VLOOKUP(A922,'Counties and Regions'!$G$3:$J$74,4,FALSE)","v":"Eastern"},{"$f":"VLOOKUP(A922,'Counties and Regions'!$G$3:$J$74,3,FALSE)","v":"Waupaca County"},"Hospital Inpatient","D"]
[{"$f":"IF(COUNTIF($A$9:A922,A922)<24,A922,A922+1)","v":39},{"$f":"VLOOKUP(A923,'Counties and Regions'!$G$3:$J$74,4,FALSE)","v":"Eastern"},{"$f":"VLOOKUP(A923,'Counties and Regions'!$G$3:$J$74,3,FALSE)","v":"Waupaca County"},"Hospital Inpatient","B"]
[{"$f":"IF(COUNTIF($A$9:A923,A923)<24,A923,A923+1)","v":39},{"$f":"VLOOKUP(A924,'Counties and Regions'!$G$3:$J$74,4,FALSE)","v":"Eastern"},{"$f":"VLOOKUP(A924,'Counties and Regions'!$G$3:$J$74,3,FALSE)","v":"Waupaca County"},"Hospital Inpatient","O"]
[{"$f":"IF(COUNTIF($A$9:A924,A924)<24,A924,A924+1)","v":39},{"$f":"VLOOKUP(A925,'Counties and Regions'!$G$3:$J$74,4,FALSE)","v":"Eastern"},{"$f":"VLOOKUP(A925,'Counties and Regions'!$G$3:$J$74,3,FALSE)","v":"Waupaca County"},"Hospital Outpatient","F"]
[{"$f":"IF(COUNTIF($A$9:A925,A925)<24,A925,A925+1)","v":39},{"$f":"VLOOKUP(A926,'Counties and Regions'!$G$3:$J$74,4,FALSE)","v":"Eastern"},{"$f":"VLOOKUP(A926,'Counties and Regions'!$G$3:$J$74,3,FALSE)","v":"Waupaca County"},"Hospital Outpatient","D"]
[{"$f":"IF(COUNTIF($A$9:A926,A926)<24,A926,A926+1)","v":39},{"$f":"VLOOKUP(A927,'Counties and Regions'!$G$3:$J$74,4,FALSE)","v":"Eastern"},{"$f":"VLOOKUP(A927,'Counties and Regions'!$G$3:$J$74,3,FALSE)","v":"Waupaca County"},"Hospital Outpatient","B"]
[{"$f":"IF(COUNTIF($A$9:A927,A927)<24,A927,A927+1)","v":39},{"$f":"VLOOKUP(A928,'Counties and Regions'!$G$3:$J$74,4,FALSE)","v":"Eastern"},{"$f":"VLOOKUP(A928,'Counties and Regions'!$G$3:$J$74,3,FALSE)","v":"Waupaca County"},"Hospital Outpatient","O"]
[{"$f":"IF(COUNTIF($A$9:A928,A928)<24,A928,A928+1)","v":39},{"$f":"VLOOKUP(A929,'Counties and Regions'!$G$3:$J$74,4,FALSE)","v":"Eastern"},{"$f":"VLOOKUP(A929,'Counties and Regions'!$G$3:$J$74,3,FALSE)","v":"Waupaca County"},"Other Facility","F"]
[{"$f":"IF(COUNTIF($A$9:A929,A929)<24,A929,A929+1)","v":39},{"$f":"VLOOKUP(A930,'Counties and Regions'!$G$3:$J$74,4,FALSE)","v":"Eastern"},{"$f":"VLOOKUP(A930,'Counties and Regions'!$G$3:$J$74,3,FALSE)","v":"Waupaca County"},"Other Facility","D"]
[{"$f":"IF(COUNTIF($A$9:A930,A930)<24,A930,A930+1)","v":39},{"$f":"VLOOKUP(A931,'Counties and Regions'!$G$3:$J$74,4,FALSE)","v":"Eastern"},{"$f":"VLOOKUP(A931,'Counties and Regions'!$G$3:$J$74,3,FALSE)","v":"Waupaca County"},"Other Facility","B"]
[{"$f":"IF(COUNTIF($A$9:A931,A931)<24,A931,A931+1)","v":39},{"$f":"VLOOKUP(A932,'Counties and Regions'!$G$3:$J$74,4,FALSE)","v":"Eastern"},{"$f":"VLOOKUP(A932,'Counties and Regions'!$G$3:$J$74,3,FALSE)","v":"Waupaca County"},"Other Facility","O"]
[{"$f":"IF(COUNTIF($A$9:A932,A932)<24,A932,A932+1)","v":39},{"$f":"VLOOKUP(A933,'Counties and Regions'!$G$3:$J$74,4,FALSE)","v":"Eastern"},{"$f":"VLOOKUP(A933,'Counties and Regions'!$G$3:$J$74,3,FALSE)","v":"Waupaca County"},"Physician Services","F"]
[{"$f":"IF(COUNTIF($A$9:A933,A933)<24,A933,A933+1)","v":39},{"$f":"VLOOKUP(A934,'Counties and Regions'!$G$3:$J$74,4,FALSE)","v":"Eastern"},{"$f":"VLOOKUP(A934,'Counties and Regions'!$G$3:$J$74,3,FALSE)","v":"Waupaca County"},"Physician Services","D"]
[{"$f":"IF(COUNTIF($A$9:A934,A934)<24,A934,A934+1)","v":39},{"$f":"VLOOKUP(A935,'Counties and Regions'!$G$3:$J$74,4,FALSE)","v":"Eastern"},{"$f":"VLOOKUP(A935,'Counties and Regions'!$G$3:$J$74,3,FALSE)","v":"Waupaca County"},"Physician Services","B"]
[{"$f":"IF(COUNTIF($A$9:A935,A935)<24,A935,A935+1)","v":39},{"$f":"VLOOKUP(A936,'Counties and Regions'!$G$3:$J$74,4,FALSE)","v":"Eastern"},{"$f":"VLOOKUP(A936,'Counties and Regions'!$G$3:$J$74,3,FALSE)","v":"Waupaca County"},"Physician Services","O"]
[{"$f":"IF(COUNTIF($A$9:A936,A936)<24,A936,A936+1)","v":39},{"$f":"VLOOKUP(A937,'Counties and Regions'!$G$3:$J$74,4,FALSE)","v":"Eastern"},{"$f":"VLOOKUP(A937,'Counties and Regions'!$G$3:$J$74,3,FALSE)","v":"Waupaca County"},"Other Services","F"]
[{"$f":"IF(COUNTIF($A$9:A937,A937)<24,A937,A937+1)","v":39},{"$f":"VLOOKUP(A938,'Counties and Regions'!$G$3:$J$74,4,FALSE)","v":"Eastern"},{"$f":"VLOOKUP(A938,'Counties and Regions'!$G$3:$J$74,3,FALSE)","v":"Waupaca County"},"Other Services","D"]
[{"$f":"IF(COUNTIF($A$9:A938,A938)<24,A938,A938+1)","v":39},{"$f":"VLOOKUP(A939,'Counties and Regions'!$G$3:$J$74,4,FALSE)","v":"Eastern"},{"$f":"VLOOKUP(A939,'Counties and Regions'!$G$3:$J$74,3,FALSE)","v":"Waupaca County"},"Other Services","B"]
[{"$f":"IF(COUNTIF($A$9:A939,A939)<24,A939,A939+1)","v":39},{"$f":"VLOOKUP(A940,'Counties and Regions'!$G$3:$J$74,4,FALSE)","v":"Eastern"},{"$f":"VLOOKUP(A940,'Counties and Regions'!$G$3:$J$74,3,FALSE)","v":"Waupaca County"},"Other Services","O"]
[{"$f":"IF(COUNTIF($A$9:A940,A940)<24,A940,A940+1)","v":39},{"$f":"VLOOKUP(A941,'Counties and Regions'!$G$3:$J$74,4,FALSE)","v":"Eastern"},{"$f":"VLOOKUP(A941,'Counties and Regions'!$G$3:$J$74,3,FALSE)","v":"Waupaca County"},"Additional Services","F"]
[{"$f":"IF(COUNTIF($A$9:A941,A941)<24,A941,A941+1)","v":39},{"$f":"VLOOKUP(A942,'Counties and Regions'!$G$3:$J$74,4,FALSE)","v":"Eastern"},{"$f":"VLOOKUP(A942,'Counties and Regions'!$G$3:$J$74,3,FALSE)","v":"Waupaca County"},"Additional Services","D"]
[{"$f":"IF(COUNTIF($A$9:A942,A942)<24,A942,A942+1)","v":39},{"$f":"VLOOKUP(A943,'Counties and Regions'!$G$3:$J$74,4,FALSE)","v":"Eastern"},{"$f":"VLOOKUP(A943,'Counties and Regions'!$G$3:$J$74,3,FALSE)","v":"Waupaca County"},"Additional Services","B"]
[{"$f":"IF(COUNTIF($A$9:A943,A943)<24,A943,A943+1)","v":39},{"$f":"VLOOKUP(A944,'Counties and Regions'!$G$3:$J$74,4,FALSE)","v":"Eastern"},{"$f":"VLOOKUP(A944,'Counties and Regions'!$G$3:$J$74,3,FALSE)","v":"Waupaca County"},"Additional Services","O"]
[{"$f":"IF(COUNTIF($A$9:A944,A944)<24,A944,A944+1)","v":40},{"$f":"VLOOKUP(A945,'Counties and Regions'!$G$3:$J$74,4,FALSE)","v":"Eastern"},{"$f":"VLOOKUP(A945,'Counties and Regions'!$G$3:$J$74,3,FALSE)","v":"Waushara County"},"Hospital Inpatient","F"]
[{"$f":"IF(COUNTIF($A$9:A945,A945)<24,A945,A945+1)","v":40},{"$f":"VLOOKUP(A946,'Counties and Regions'!$G$3:$J$74,4,FALSE)","v":"Eastern"},{"$f":"VLOOKUP(A946,'Counties and Regions'!$G$3:$J$74,3,FALSE)","v":"Waushara County"},"Hospital Inpatient","D"]
[{"$f":"IF(COUNTIF($A$9:A946,A946)<24,A946,A946+1)","v":40},{"$f":"VLOOKUP(A947,'Counties and Regions'!$G$3:$J$74,4,FALSE)","v":"Eastern"},{"$f":"VLOOKUP(A947,'Counties and Regions'!$G$3:$J$74,3,FALSE)","v":"Waushara County"},"Hospital Inpatient","B"]
[{"$f":"IF(COUNTIF($A$9:A947,A947)<24,A947,A947+1)","v":40},{"$f":"VLOOKUP(A948,'Counties and Regions'!$G$3:$J$74,4,FALSE)","v":"Eastern"},{"$f":"VLOOKUP(A948,'Counties and Regions'!$G$3:$J$74,3,FALSE)","v":"Waushara County"},"Hospital Inpatient","O"]
[{"$f":"IF(COUNTIF($A$9:A948,A948)<24,A948,A948+1)","v":40},{"$f":"VLOOKUP(A949,'Counties and Regions'!$G$3:$J$74,4,FALSE)","v":"Eastern"},{"$f":"VLOOKUP(A949,'Counties and Regions'!$G$3:$J$74,3,FALSE)","v":"Waushara County"},"Hospital Outpatient","F"]
[{"$f":"IF(COUNTIF($A$9:A949,A949)<24,A949,A949+1)","v":40},{"$f":"VLOOKUP(A950,'Counties and Regions'!$G$3:$J$74,4,FALSE)","v":"Eastern"},{"$f":"VLOOKUP(A950,'Counties and Regions'!$G$3:$J$74,3,FALSE)","v":"Waushara County"},"Hospital Outpatient","D"]
[{"$f":"IF(COUNTIF($A$9:A950,A950)<24,A950,A950+1)","v":40},{"$f":"VLOOKUP(A951,'Counties and Regions'!$G$3:$J$74,4,FALSE)","v":"Eastern"},{"$f":"VLOOKUP(A951,'Counties and Regions'!$G$3:$J$74,3,FALSE)","v":"Waushara County"},"Hospital Outpatient","B"]
[{"$f":"IF(COUNTIF($A$9:A951,A951)<24,A951,A951+1)","v":40},{"$f":"VLOOKUP(A952,'Counties and Regions'!$G$3:$J$74,4,FALSE)","v":"Eastern"},{"$f":"VLOOKUP(A952,'Counties and Regions'!$G$3:$J$74,3,FALSE)","v":"Waushara County"},"Hospital Outpatient","O"]
[{"$f":"IF(COUNTIF($A$9:A952,A952)<24,A952,A952+1)","v":40},{"$f":"VLOOKUP(A953,'Counties and Regions'!$G$3:$J$74,4,FALSE)","v":"Eastern"},{"$f":"VLOOKUP(A953,'Counties and Regions'!$G$3:$J$74,3,FALSE)","v":"Waushara County"},"Other Facility","F"]
[{"$f":"IF(COUNTIF($A$9:A953,A953)<24,A953,A953+1)","v":40},{"$f":"VLOOKUP(A954,'Counties and Regions'!$G$3:$J$74,4,FALSE)","v":"Eastern"},{"$f":"VLOOKUP(A954,'Counties and Regions'!$G$3:$J$74,3,FALSE)","v":"Waushara County"},"Other Facility","D"]
[{"$f":"IF(COUNTIF($A$9:A954,A954)<24,A954,A954+1)","v":40},{"$f":"VLOOKUP(A955,'Counties and Regions'!$G$3:$J$74,4,FALSE)","v":"Eastern"},{"$f":"VLOOKUP(A955,'Counties and Regions'!$G$3:$J$74,3,FALSE)","v":"Waushara County"},"Other Facility","B"]
[{"$f":"IF(COUNTIF($A$9:A955,A955)<24,A955,A955+1)","v":40},{"$f":"VLOOKUP(A956,'Counties and Regions'!$G$3:$J$74,4,FALSE)","v":"Eastern"},{"$f":"VLOOKUP(A956,'Counties and Regions'!$G$3:$J$74,3,FALSE)","v":"Waushara County"},"Other Facility","O"]
[{"$f":"IF(COUNTIF($A$9:A956,A956)<24,A956,A956+1)","v":40},{"$f":"VLOOKUP(A957,'Counties and Regions'!$G$3:$J$74,4,FALSE)","v":"Eastern"},{"$f":"VLOOKUP(A957,'Counties and Regions'!$G$3:$J$74,3,FALSE)","v":"Waushara County"},"Physician Services","F"]
[{"$f":"IF(COUNTIF($A$9:A957,A957)<24,A957,A957+1)","v":40},{"$f":"VLOOKUP(A958,'Counties and Regions'!$G$3:$J$74,4,FALSE)","v":"Eastern"},{"$f":"VLOOKUP(A958,'Counties and Regions'!$G$3:$J$74,3,FALSE)","v":"Waushara County"},"Physician Services","D"]
[{"$f":"IF(COUNTIF($A$9:A958,A958)<24,A958,A958+1)","v":40},{"$f":"VLOOKUP(A959,'Counties and Regions'!$G$3:$J$74,4,FALSE)","v":"Eastern"},{"$f":"VLOOKUP(A959,'Counties and Regions'!$G$3:$J$74,3,FALSE)","v":"Waushara County"},"Physician Services","B"]
[{"$f":"IF(COUNTIF($A$9:A959,A959)<24,A959,A959+1)","v":40},{"$f":"VLOOKUP(A960,'Counties and Regions'!$G$3:$J$74,4,FALSE)","v":"Eastern"},{"$f":"VLOOKUP(A960,'Counties and Regions'!$G$3:$J$74,3,FALSE)","v":"Waushara County"},"Physician Services","O"]
[{"$f":"IF(COUNTIF($A$9:A960,A960)<24,A960,A960+1)","v":40},{"$f":"VLOOKUP(A961,'Counties and Regions'!$G$3:$J$74,4,FALSE)","v":"Eastern"},{"$f":"VLOOKUP(A961,'Counties and Regions'!$G$3:$J$74,3,FALSE)","v":"Waushara County"},"Other Services","F"]
[{"$f":"IF(COUNTIF($A$9:A961,A961)<24,A961,A961+1)","v":40},{"$f":"VLOOKUP(A962,'Counties and Regions'!$G$3:$J$74,4,FALSE)","v":"Eastern"},{"$f":"VLOOKUP(A962,'Counties and Regions'!$G$3:$J$74,3,FALSE)","v":"Waushara County"},"Other Services","D"]
[{"$f":"IF(COUNTIF($A$9:A962,A962)<24,A962,A962+1)","v":40},{"$f":"VLOOKUP(A963,'Counties and Regions'!$G$3:$J$74,4,FALSE)","v":"Eastern"},{"$f":"VLOOKUP(A963,'Counties and Regions'!$G$3:$J$74,3,FALSE)","v":"Waushara County"},"Other Services","B"]
[{"$f":"IF(COUNTIF($A$9:A963,A963)<24,A963,A963+1)","v":40},{"$f":"VLOOKUP(A964,'Counties and Regions'!$G$3:$J$74,4,FALSE)","v":"Eastern"},{"$f":"VLOOKUP(A964,'Counties and Regions'!$G$3:$J$74,3,FALSE)","v":"Waushara County"},"Other Services","O"]
[{"$f":"IF(COUNTIF($A$9:A964,A964)<24,A964,A964+1)","v":40},{"$f":"VLOOKUP(A965,'Counties and Regions'!$G$3:$J$74,4,FALSE)","v":"Eastern"},{"$f":"VLOOKUP(A965,'Counties and Regions'!$G$3:$J$74,3,FALSE)","v":"Waushara County"},"Additional Services","F"]
[{"$f":"IF(COUNTIF($A$9:A965,A965)<24,A965,A965+1)","v":40},{"$f":"VLOOKUP(A966,'Counties and Regions'!$G$3:$J$74,4,FALSE)","v":"Eastern"},{"$f":"VLOOKUP(A966,'Counties and Regions'!$G$3:$J$74,3,FALSE)","v":"Waushara County"},"Additional Services","D"]
[{"$f":"IF(COUNTIF($A$9:A966,A966)<24,A966,A966+1)","v":40},{"$f":"VLOOKUP(A967,'Counties and Regions'!$G$3:$J$74,4,FALSE)","v":"Eastern"},{"$f":"VLOOKUP(A967,'Counties and Regions'!$G$3:$J$74,3,FALSE)","v":"Waushara County"},"Additional Services","B"]
[{"$f":"IF(COUNTIF($A$9:A967,A967)<24,A967,A967+1)","v":40},{"$f":"VLOOKUP(A968,'Counties and Regions'!$G$3:$J$74,4,FALSE)","v":"Eastern"},{"$f":"VLOOKUP(A968,'Counties and Regions'!$G$3:$J$74,3,FALSE)","v":"Waushara County"},"Additional Services","O"]
[{"$f":"IF(COUNTIF($A$9:A968,A968)<24,A968,A968+1)","v":41},{"$f":"VLOOKUP(A969,'Counties and Regions'!$G$3:$J$74,4,FALSE)","v":"Eastern"},{"$f":"VLOOKUP(A969,'Counties and Regions'!$G$3:$J$74,3,FALSE)","v":"Winnebago County"},"Hospital Inpatient","F"]
[{"$f":"IF(COUNTIF($A$9:A969,A969)<24,A969,A969+1)","v":41},{"$f":"VLOOKUP(A970,'Counties and Regions'!$G$3:$J$74,4,FALSE)","v":"Eastern"},{"$f":"VLOOKUP(A970,'Counties and Regions'!$G$3:$J$74,3,FALSE)","v":"Winnebago County"},"Hospital Inpatient","D"]
[{"$f":"IF(COUNTIF($A$9:A970,A970)<24,A970,A970+1)","v":41},{"$f":"VLOOKUP(A971,'Counties and Regions'!$G$3:$J$74,4,FALSE)","v":"Eastern"},{"$f":"VLOOKUP(A971,'Counties and Regions'!$G$3:$J$74,3,FALSE)","v":"Winnebago County"},"Hospital Inpatient","B"]
[{"$f":"IF(COUNTIF($A$9:A971,A971)<24,A971,A971+1)","v":41},{"$f":"VLOOKUP(A972,'Counties and Regions'!$G$3:$J$74,4,FALSE)","v":"Eastern"},{"$f":"VLOOKUP(A972,'Counties and Regions'!$G$3:$J$74,3,FALSE)","v":"Winnebago County"},"Hospital Inpatient","O"]
[{"$f":"IF(COUNTIF($A$9:A972,A972)<24,A972,A972+1)","v":41},{"$f":"VLOOKUP(A973,'Counties and Regions'!$G$3:$J$74,4,FALSE)","v":"Eastern"},{"$f":"VLOOKUP(A973,'Counties and Regions'!$G$3:$J$74,3,FALSE)","v":"Winnebago County"},"Hospital Outpatient","F"]
[{"$f":"IF(COUNTIF($A$9:A973,A973)<24,A973,A973+1)","v":41},{"$f":"VLOOKUP(A974,'Counties and Regions'!$G$3:$J$74,4,FALSE)","v":"Eastern"},{"$f":"VLOOKUP(A974,'Counties and Regions'!$G$3:$J$74,3,FALSE)","v":"Winnebago County"},"Hospital Outpatient","D"]
[{"$f":"IF(COUNTIF($A$9:A974,A974)<24,A974,A974+1)","v":41},{"$f":"VLOOKUP(A975,'Counties and Regions'!$G$3:$J$74,4,FALSE)","v":"Eastern"},{"$f":"VLOOKUP(A975,'Counties and Regions'!$G$3:$J$74,3,FALSE)","v":"Winnebago County"},"Hospital Outpatient","B"]
[{"$f":"IF(COUNTIF($A$9:A975,A975)<24,A975,A975+1)","v":41},{"$f":"VLOOKUP(A976,'Counties and Regions'!$G$3:$J$74,4,FALSE)","v":"Eastern"},{"$f":"VLOOKUP(A976,'Counties and Regions'!$G$3:$J$74,3,FALSE)","v":"Winnebago County"},"Hospital Outpatient","O"]
[{"$f":"IF(COUNTIF($A$9:A976,A976)<24,A976,A976+1)","v":41},{"$f":"VLOOKUP(A977,'Counties and Regions'!$G$3:$J$74,4,FALSE)","v":"Eastern"},{"$f":"VLOOKUP(A977,'Counties and Regions'!$G$3:$J$74,3,FALSE)","v":"Winnebago County"},"Other Facility","F"]
[{"$f":"IF(COUNTIF($A$9:A977,A977)<24,A977,A977+1)","v":41},{"$f":"VLOOKUP(A978,'Counties and Regions'!$G$3:$J$74,4,FALSE)","v":"Eastern"},{"$f":"VLOOKUP(A978,'Counties and Regions'!$G$3:$J$74,3,FALSE)","v":"Winnebago County"},"Other Facility","D"]
[{"$f":"IF(COUNTIF($A$9:A978,A978)<24,A978,A978+1)","v":41},{"$f":"VLOOKUP(A979,'Counties and Regions'!$G$3:$J$74,4,FALSE)","v":"Eastern"},{"$f":"VLOOKUP(A979,'Counties and Regions'!$G$3:$J$74,3,FALSE)","v":"Winnebago County"},"Other Facility","B"]
[{"$f":"IF(COUNTIF($A$9:A979,A979)<24,A979,A979+1)","v":41},{"$f":"VLOOKUP(A980,'Counties and Regions'!$G$3:$J$74,4,FALSE)","v":"Eastern"},{"$f":"VLOOKUP(A980,'Counties and Regions'!$G$3:$J$74,3,FALSE)","v":"Winnebago County"},"Other Facility","O"]
[{"$f":"IF(COUNTIF($A$9:A980,A980)<24,A980,A980+1)","v":41},{"$f":"VLOOKUP(A981,'Counties and Regions'!$G$3:$J$74,4,FALSE)","v":"Eastern"},{"$f":"VLOOKUP(A981,'Counties and Regions'!$G$3:$J$74,3,FALSE)","v":"Winnebago County"},"Physician Services","F"]
[{"$f":"IF(COUNTIF($A$9:A981,A981)<24,A981,A981+1)","v":41},{"$f":"VLOOKUP(A982,'Counties and Regions'!$G$3:$J$74,4,FALSE)","v":"Eastern"},{"$f":"VLOOKUP(A982,'Counties and Regions'!$G$3:$J$74,3,FALSE)","v":"Winnebago County"},"Physician Services","D"]
[{"$f":"IF(COUNTIF($A$9:A982,A982)<24,A982,A982+1)","v":41},{"$f":"VLOOKUP(A983,'Counties and Regions'!$G$3:$J$74,4,FALSE)","v":"Eastern"},{"$f":"VLOOKUP(A983,'Counties and Regions'!$G$3:$J$74,3,FALSE)","v":"Winnebago County"},"Physician Services","B"]
[{"$f":"IF(COUNTIF($A$9:A983,A983)<24,A983,A983+1)","v":41},{"$f":"VLOOKUP(A984,'Counties and Regions'!$G$3:$J$74,4,FALSE)","v":"Eastern"},{"$f":"VLOOKUP(A984,'Counties and Regions'!$G$3:$J$74,3,FALSE)","v":"Winnebago County"},"Physician Services","O"]
[{"$f":"IF(COUNTIF($A$9:A984,A984)<24,A984,A984+1)","v":41},{"$f":"VLOOKUP(A985,'Counties and Regions'!$G$3:$J$74,4,FALSE)","v":"Eastern"},{"$f":"VLOOKUP(A985,'Counties and Regions'!$G$3:$J$74,3,FALSE)","v":"Winnebago County"},"Other Services","F"]
[{"$f":"IF(COUNTIF($A$9:A985,A985)<24,A985,A985+1)","v":41},{"$f":"VLOOKUP(A986,'Counties and Regions'!$G$3:$J$74,4,FALSE)","v":"Eastern"},{"$f":"VLOOKUP(A986,'Counties and Regions'!$G$3:$J$74,3,FALSE)","v":"Winnebago County"},"Other Services","D"]
[{"$f":"IF(COUNTIF($A$9:A986,A986)<24,A986,A986+1)","v":41},{"$f":"VLOOKUP(A987,'Counties and Regions'!$G$3:$J$74,4,FALSE)","v":"Eastern"},{"$f":"VLOOKUP(A987,'Counties and Regions'!$G$3:$J$74,3,FALSE)","v":"Winnebago County"},"Other Services","B"]
[{"$f":"IF(COUNTIF($A$9:A987,A987)<24,A987,A987+1)","v":41},{"$f":"VLOOKUP(A988,'Counties and Regions'!$G$3:$J$74,4,FALSE)","v":"Eastern"},{"$f":"VLOOKUP(A988,'Counties and Regions'!$G$3:$J$74,3,FALSE)","v":"Winnebago County"},"Other Services","O"]
[{"$f":"IF(COUNTIF($A$9:A988,A988)<24,A988,A988+1)","v":41},{"$f":"VLOOKUP(A989,'Counties and Regions'!$G$3:$J$74,4,FALSE)","v":"Eastern"},{"$f":"VLOOKUP(A989,'Counties and Regions'!$G$3:$J$74,3,FALSE)","v":"Winnebago County"},"Additional Services","F"]
[{"$f":"IF(COUNTIF($A$9:A989,A989)<24,A989,A989+1)","v":41},{"$f":"VLOOKUP(A990,'Counties and Regions'!$G$3:$J$74,4,FALSE)","v":"Eastern"},{"$f":"VLOOKUP(A990,'Counties and Regions'!$G$3:$J$74,3,FALSE)","v":"Winnebago County"},"Additional Services","D"]
[{"$f":"IF(COUNTIF($A$9:A990,A990)<24,A990,A990+1)","v":41},{"$f":"VLOOKUP(A991,'Counties and Regions'!$G$3:$J$74,4,FALSE)","v":"Eastern"},{"$f":"VLOOKUP(A991,'Counties and Regions'!$G$3:$J$74,3,FALSE)","v":"Winnebago County"},"Additional Services","B"]
[{"$f":"IF(COUNTIF($A$9:A991,A991)<24,A991,A991+1)","v":41},{"$f":"VLOOKUP(A992,'Counties and Regions'!$G$3:$J$74,4,FALSE)","v":"Eastern"},{"$f":"VLOOKUP(A992,'Counties and Regions'!$G$3:$J$74,3,FALSE)","v":"Winnebago County"},"Additional Services","O"]
[{"$f":"IF(COUNTIF($A$9:A992,A992)<24,A992,A992+1)","v":42},{"$f":"VLOOKUP(A993,'Counties and Regions'!$G$3:$J$74,4,FALSE)","v":"Western"},{"$f":"VLOOKUP(A993,'Counties and Regions'!$G$3:$J$74,3,FALSE)","v":"Barron County"},"Hospital Inpatient","F"]
[{"$f":"IF(COUNTIF($A$9:A993,A993)<24,A993,A993+1)","v":42},{"$f":"VLOOKUP(A994,'Counties and Regions'!$G$3:$J$74,4,FALSE)","v":"Western"},{"$f":"VLOOKUP(A994,'Counties and Regions'!$G$3:$J$74,3,FALSE)","v":"Barron County"},"Hospital Inpatient","D"]
[{"$f":"IF(COUNTIF($A$9:A994,A994)<24,A994,A994+1)","v":42},{"$f":"VLOOKUP(A995,'Counties and Regions'!$G$3:$J$74,4,FALSE)","v":"Western"},{"$f":"VLOOKUP(A995,'Counties and Regions'!$G$3:$J$74,3,FALSE)","v":"Barron County"},"Hospital Inpatient","B"]
[{"$f":"IF(COUNTIF($A$9:A995,A995)<24,A995,A995+1)","v":42},{"$f":"VLOOKUP(A996,'Counties and Regions'!$G$3:$J$74,4,FALSE)","v":"Western"},{"$f":"VLOOKUP(A996,'Counties and Regions'!$G$3:$J$74,3,FALSE)","v":"Barron County"},"Hospital Inpatient","O"]
[{"$f":"IF(COUNTIF($A$9:A996,A996)<24,A996,A996+1)","v":42},{"$f":"VLOOKUP(A997,'Counties and Regions'!$G$3:$J$74,4,FALSE)","v":"Western"},{"$f":"VLOOKUP(A997,'Counties and Regions'!$G$3:$J$74,3,FALSE)","v":"Barron County"},"Hospital Outpatient","F"]
[{"$f":"IF(COUNTIF($A$9:A997,A997)<24,A997,A997+1)","v":42},{"$f":"VLOOKUP(A998,'Counties and Regions'!$G$3:$J$74,4,FALSE)","v":"Western"},{"$f":"VLOOKUP(A998,'Counties and Regions'!$G$3:$J$74,3,FALSE)","v":"Barron County"},"Hospital Outpatient","D"]
[{"$f":"IF(COUNTIF($A$9:A998,A998)<24,A998,A998+1)","v":42},{"$f":"VLOOKUP(A999,'Counties and Regions'!$G$3:$J$74,4,FALSE)","v":"Western"},{"$f":"VLOOKUP(A999,'Counties and Regions'!$G$3:$J$74,3,FALSE)","v":"Barron County"},"Hospital Outpatient","B"]
[{"$f":"IF(COUNTIF($A$9:A999,A999)<24,A999,A999+1)","v":42},{"$f":"VLOOKUP(A1000,'Counties and Regions'!$G$3:$J$74,4,FALSE)","v":"Western"},{"$f":"VLOOKUP(A1000,'Counties and Regions'!$G$3:$J$74,3,FALSE)","v":"Barron County"},"Hospital Outpatient","O"]
[{"$f":"IF(COUNTIF($A$9:A1000,A1000)<24,A1000,A1000+1)","v":42},{"$f":"VLOOKUP(A1001,'Counties and Regions'!$G$3:$J$74,4,FALSE)","v":"Western"},{"$f":"VLOOKUP(A1001,'Counties and Regions'!$G$3:$J$74,3,FALSE)","v":"Barron County"},"Other Facility","F"]
[{"$f":"IF(COUNTIF($A$9:A1001,A1001)<24,A1001,A1001+1)","v":42},{"$f":"VLOOKUP(A1002,'Counties and Regions'!$G$3:$J$74,4,FALSE)","v":"Western"},{"$f":"VLOOKUP(A1002,'Counties and Regions'!$G$3:$J$74,3,FALSE)","v":"Barron County"},"Other Facility","D"]
[{"$f":"IF(COUNTIF($A$9:A1002,A1002)<24,A1002,A1002+1)","v":42},{"$f":"VLOOKUP(A1003,'Counties and Regions'!$G$3:$J$74,4,FALSE)","v":"Western"},{"$f":"VLOOKUP(A1003,'Counties and Regions'!$G$3:$J$74,3,FALSE)","v":"Barron County"},"Other Facility","B"]
[{"$f":"IF(COUNTIF($A$9:A1003,A1003)<24,A1003,A1003+1)","v":42},{"$f":"VLOOKUP(A1004,'Counties and Regions'!$G$3:$J$74,4,FALSE)","v":"Western"},{"$f":"VLOOKUP(A1004,'Counties and Regions'!$G$3:$J$74,3,FALSE)","v":"Barron County"},"Other Facility","O"]
[{"$f":"IF(COUNTIF($A$9:A1004,A1004)<24,A1004,A1004+1)","v":42},{"$f":"VLOOKUP(A1005,'Counties and Regions'!$G$3:$J$74,4,FALSE)","v":"Western"},{"$f":"VLOOKUP(A1005,'Counties and Regions'!$G$3:$J$74,3,FALSE)","v":"Barron County"},"Physician Services","F"]
[{"$f":"IF(COUNTIF($A$9:A1005,A1005)<24,A1005,A1005+1)","v":42},{"$f":"VLOOKUP(A1006,'Counties and Regions'!$G$3:$J$74,4,FALSE)","v":"Western"},{"$f":"VLOOKUP(A1006,'Counties and Regions'!$G$3:$J$74,3,FALSE)","v":"Barron County"},"Physician Services","D"]
[{"$f":"IF(COUNTIF($A$9:A1006,A1006)<24,A1006,A1006+1)","v":42},{"$f":"VLOOKUP(A1007,'Counties and Regions'!$G$3:$J$74,4,FALSE)","v":"Western"},{"$f":"VLOOKUP(A1007,'Counties and Regions'!$G$3:$J$74,3,FALSE)","v":"Barron County"},"Physician Services","B"]
[{"$f":"IF(COUNTIF($A$9:A1007,A1007)<24,A1007,A1007+1)","v":42},{"$f":"VLOOKUP(A1008,'Counties and Regions'!$G$3:$J$74,4,FALSE)","v":"Western"},{"$f":"VLOOKUP(A1008,'Counties and Regions'!$G$3:$J$74,3,FALSE)","v":"Barron County"},"Physician Services","O"]
[{"$f":"IF(COUNTIF($A$9:A1008,A1008)<24,A1008,A1008+1)","v":42},{"$f":"VLOOKUP(A1009,'Counties and Regions'!$G$3:$J$74,4,FALSE)","v":"Western"},{"$f":"VLOOKUP(A1009,'Counties and Regions'!$G$3:$J$74,3,FALSE)","v":"Barron County"},"Other Services","F"]
[{"$f":"IF(COUNTIF($A$9:A1009,A1009)<24,A1009,A1009+1)","v":42},{"$f":"VLOOKUP(A1010,'Counties and Regions'!$G$3:$J$74,4,FALSE)","v":"Western"},{"$f":"VLOOKUP(A1010,'Counties and Regions'!$G$3:$J$74,3,FALSE)","v":"Barron County"},"Other Services","D"]
[{"$f":"IF(COUNTIF($A$9:A1010,A1010)<24,A1010,A1010+1)","v":42},{"$f":"VLOOKUP(A1011,'Counties and Regions'!$G$3:$J$74,4,FALSE)","v":"Western"},{"$f":"VLOOKUP(A1011,'Counties and Regions'!$G$3:$J$74,3,FALSE)","v":"Barron County"},"Other Services","B"]
[{"$f":"IF(COUNTIF($A$9:A1011,A1011)<24,A1011,A1011+1)","v":42},{"$f":"VLOOKUP(A1012,'Counties and Regions'!$G$3:$J$74,4,FALSE)","v":"Western"},{"$f":"VLOOKUP(A1012,'Counties and Regions'!$G$3:$J$74,3,FALSE)","v":"Barron County"},"Other Services","O"]
[{"$f":"IF(COUNTIF($A$9:A1012,A1012)<24,A1012,A1012+1)","v":42},{"$f":"VLOOKUP(A1013,'Counties and Regions'!$G$3:$J$74,4,FALSE)","v":"Western"},{"$f":"VLOOKUP(A1013,'Counties and Regions'!$G$3:$J$74,3,FALSE)","v":"Barron County"},"Additional Services","F"]
[{"$f":"IF(COUNTIF($A$9:A1013,A1013)<24,A1013,A1013+1)","v":42},{"$f":"VLOOKUP(A1014,'Counties and Regions'!$G$3:$J$74,4,FALSE)","v":"Western"},{"$f":"VLOOKUP(A1014,'Counties and Regions'!$G$3:$J$74,3,FALSE)","v":"Barron County"},"Additional Services","D"]
[{"$f":"IF(COUNTIF($A$9:A1014,A1014)<24,A1014,A1014+1)","v":42},{"$f":"VLOOKUP(A1015,'Counties and Regions'!$G$3:$J$74,4,FALSE)","v":"Western"},{"$f":"VLOOKUP(A1015,'Counties and Regions'!$G$3:$J$74,3,FALSE)","v":"Barron County"},"Additional Services","B"]
[{"$f":"IF(COUNTIF($A$9:A1015,A1015)<24,A1015,A1015+1)","v":42},{"$f":"VLOOKUP(A1016,'Counties and Regions'!$G$3:$J$74,4,FALSE)","v":"Western"},{"$f":"VLOOKUP(A1016,'Counties and Regions'!$G$3:$J$74,3,FALSE)","v":"Barron County"},"Additional Services","O"]
[{"$f":"IF(COUNTIF($A$9:A1016,A1016)<24,A1016,A1016+1)","v":43},{"$f":"VLOOKUP(A1017,'Counties and Regions'!$G$3:$J$74,4,FALSE)","v":"Western"},{"$f":"VLOOKUP(A1017,'Counties and Regions'!$G$3:$J$74,3,FALSE)","v":"Buffalo County"},"Hospital Inpatient","F"]
[{"$f":"IF(COUNTIF($A$9:A1017,A1017)<24,A1017,A1017+1)","v":43},{"$f":"VLOOKUP(A1018,'Counties and Regions'!$G$3:$J$74,4,FALSE)","v":"Western"},{"$f":"VLOOKUP(A1018,'Counties and Regions'!$G$3:$J$74,3,FALSE)","v":"Buffalo County"},"Hospital Inpatient","D"]
[{"$f":"IF(COUNTIF($A$9:A1018,A1018)<24,A1018,A1018+1)","v":43},{"$f":"VLOOKUP(A1019,'Counties and Regions'!$G$3:$J$74,4,FALSE)","v":"Western"},{"$f":"VLOOKUP(A1019,'Counties and Regions'!$G$3:$J$74,3,FALSE)","v":"Buffalo County"},"Hospital Inpatient","B"]
[{"$f":"IF(COUNTIF($A$9:A1019,A1019)<24,A1019,A1019+1)","v":43},{"$f":"VLOOKUP(A1020,'Counties and Regions'!$G$3:$J$74,4,FALSE)","v":"Western"},{"$f":"VLOOKUP(A1020,'Counties and Regions'!$G$3:$J$74,3,FALSE)","v":"Buffalo County"},"Hospital Inpatient","O"]
[{"$f":"IF(COUNTIF($A$9:A1020,A1020)<24,A1020,A1020+1)","v":43},{"$f":"VLOOKUP(A1021,'Counties and Regions'!$G$3:$J$74,4,FALSE)","v":"Western"},{"$f":"VLOOKUP(A1021,'Counties and Regions'!$G$3:$J$74,3,FALSE)","v":"Buffalo County"},"Hospital Outpatient","F"]
[{"$f":"IF(COUNTIF($A$9:A1021,A1021)<24,A1021,A1021+1)","v":43},{"$f":"VLOOKUP(A1022,'Counties and Regions'!$G$3:$J$74,4,FALSE)","v":"Western"},{"$f":"VLOOKUP(A1022,'Counties and Regions'!$G$3:$J$74,3,FALSE)","v":"Buffalo County"},"Hospital Outpatient","D"]
[{"$f":"IF(COUNTIF($A$9:A1022,A1022)<24,A1022,A1022+1)","v":43},{"$f":"VLOOKUP(A1023,'Counties and Regions'!$G$3:$J$74,4,FALSE)","v":"Western"},{"$f":"VLOOKUP(A1023,'Counties and Regions'!$G$3:$J$74,3,FALSE)","v":"Buffalo County"},"Hospital Outpatient","B"]
[{"$f":"IF(COUNTIF($A$9:A1023,A1023)<24,A1023,A1023+1)","v":43},{"$f":"VLOOKUP(A1024,'Counties and Regions'!$G$3:$J$74,4,FALSE)","v":"Western"},{"$f":"VLOOKUP(A1024,'Counties and Regions'!$G$3:$J$74,3,FALSE)","v":"Buffalo County"},"Hospital Outpatient","O"]
[{"$f":"IF(COUNTIF($A$9:A1024,A1024)<24,A1024,A1024+1)","v":43},{"$f":"VLOOKUP(A1025,'Counties and Regions'!$G$3:$J$74,4,FALSE)","v":"Western"},{"$f":"VLOOKUP(A1025,'Counties and Regions'!$G$3:$J$74,3,FALSE)","v":"Buffalo County"},"Other Facility","F"]
[{"$f":"IF(COUNTIF($A$9:A1025,A1025)<24,A1025,A1025+1)","v":43},{"$f":"VLOOKUP(A1026,'Counties and Regions'!$G$3:$J$74,4,FALSE)","v":"Western"},{"$f":"VLOOKUP(A1026,'Counties and Regions'!$G$3:$J$74,3,FALSE)","v":"Buffalo County"},"Other Facility","D"]
[{"$f":"IF(COUNTIF($A$9:A1026,A1026)<24,A1026,A1026+1)","v":43},{"$f":"VLOOKUP(A1027,'Counties and Regions'!$G$3:$J$74,4,FALSE)","v":"Western"},{"$f":"VLOOKUP(A1027,'Counties and Regions'!$G$3:$J$74,3,FALSE)","v":"Buffalo County"},"Other Facility","B"]
[{"$f":"IF(COUNTIF($A$9:A1027,A1027)<24,A1027,A1027+1)","v":43},{"$f":"VLOOKUP(A1028,'Counties and Regions'!$G$3:$J$74,4,FALSE)","v":"Western"},{"$f":"VLOOKUP(A1028,'Counties and Regions'!$G$3:$J$74,3,FALSE)","v":"Buffalo County"},"Other Facility","O"]
[{"$f":"IF(COUNTIF($A$9:A1028,A1028)<24,A1028,A1028+1)","v":43},{"$f":"VLOOKUP(A1029,'Counties and Regions'!$G$3:$J$74,4,FALSE)","v":"Western"},{"$f":"VLOOKUP(A1029,'Counties and Regions'!$G$3:$J$74,3,FALSE)","v":"Buffalo County"},"Physician Services","F"]
[{"$f":"IF(COUNTIF($A$9:A1029,A1029)<24,A1029,A1029+1)","v":43},{"$f":"VLOOKUP(A1030,'Counties and Regions'!$G$3:$J$74,4,FALSE)","v":"Western"},{"$f":"VLOOKUP(A1030,'Counties and Regions'!$G$3:$J$74,3,FALSE)","v":"Buffalo County"},"Physician Services","D"]
[{"$f":"IF(COUNTIF($A$9:A1030,A1030)<24,A1030,A1030+1)","v":43},{"$f":"VLOOKUP(A1031,'Counties and Regions'!$G$3:$J$74,4,FALSE)","v":"Western"},{"$f":"VLOOKUP(A1031,'Counties and Regions'!$G$3:$J$74,3,FALSE)","v":"Buffalo County"},"Physician Services","B"]
[{"$f":"IF(COUNTIF($A$9:A1031,A1031)<24,A1031,A1031+1)","v":43},{"$f":"VLOOKUP(A1032,'Counties and Regions'!$G$3:$J$74,4,FALSE)","v":"Western"},{"$f":"VLOOKUP(A1032,'Counties and Regions'!$G$3:$J$74,3,FALSE)","v":"Buffalo County"},"Physician Services","O"]
[{"$f":"IF(COUNTIF($A$9:A1032,A1032)<24,A1032,A1032+1)","v":43},{"$f":"VLOOKUP(A1033,'Counties and Regions'!$G$3:$J$74,4,FALSE)","v":"Western"},{"$f":"VLOOKUP(A1033,'Counties and Regions'!$G$3:$J$74,3,FALSE)","v":"Buffalo County"},"Other Services","F"]
[{"$f":"IF(COUNTIF($A$9:A1033,A1033)<24,A1033,A1033+1)","v":43},{"$f":"VLOOKUP(A1034,'Counties and Regions'!$G$3:$J$74,4,FALSE)","v":"Western"},{"$f":"VLOOKUP(A1034,'Counties and Regions'!$G$3:$J$74,3,FALSE)","v":"Buffalo County"},"Other Services","D"]
[{"$f":"IF(COUNTIF($A$9:A1034,A1034)<24,A1034,A1034+1)","v":43},{"$f":"VLOOKUP(A1035,'Counties and Regions'!$G$3:$J$74,4,FALSE)","v":"Western"},{"$f":"VLOOKUP(A1035,'Counties and Regions'!$G$3:$J$74,3,FALSE)","v":"Buffalo County"},"Other Services","B"]
[{"$f":"IF(COUNTIF($A$9:A1035,A1035)<24,A1035,A1035+1)","v":43},{"$f":"VLOOKUP(A1036,'Counties and Regions'!$G$3:$J$74,4,FALSE)","v":"Western"},{"$f":"VLOOKUP(A1036,'Counties and Regions'!$G$3:$J$74,3,FALSE)","v":"Buffalo County"},"Other Services","O"]
[{"$f":"IF(COUNTIF($A$9:A1036,A1036)<24,A1036,A1036+1)","v":43},{"$f":"VLOOKUP(A1037,'Counties and Regions'!$G$3:$J$74,4,FALSE)","v":"Western"},{"$f":"VLOOKUP(A1037,'Counties and Regions'!$G$3:$J$74,3,FALSE)","v":"Buffalo County"},"Additional Services","F"]
[{"$f":"IF(COUNTIF($A$9:A1037,A1037)<24,A1037,A1037+1)","v":43},{"$f":"VLOOKUP(A1038,'Counties and Regions'!$G$3:$J$74,4,FALSE)","v":"Western"},{"$f":"VLOOKUP(A1038,'Counties and Regions'!$G$3:$J$74,3,FALSE)","v":"Buffalo County"},"Additional Services","D"]
[{"$f":"IF(COUNTIF($A$9:A1038,A1038)<24,A1038,A1038+1)","v":43},{"$f":"VLOOKUP(A1039,'Counties and Regions'!$G$3:$J$74,4,FALSE)","v":"Western"},{"$f":"VLOOKUP(A1039,'Counties and Regions'!$G$3:$J$74,3,FALSE)","v":"Buffalo County"},"Additional Services","B"]
[{"$f":"IF(COUNTIF($A$9:A1039,A1039)<24,A1039,A1039+1)","v":43},{"$f":"VLOOKUP(A1040,'Counties and Regions'!$G$3:$J$74,4,FALSE)","v":"Western"},{"$f":"VLOOKUP(A1040,'Counties and Regions'!$G$3:$J$74,3,FALSE)","v":"Buffalo County"},"Additional Services","O"]
[{"$f":"IF(COUNTIF($A$9:A1040,A1040)<24,A1040,A1040+1)","v":44},{"$f":"VLOOKUP(A1041,'Counties and Regions'!$G$3:$J$74,4,FALSE)","v":"Western"},{"$f":"VLOOKUP(A1041,'Counties and Regions'!$G$3:$J$74,3,FALSE)","v":"Burnett County"},"Hospital Inpatient","F"]
[{"$f":"IF(COUNTIF($A$9:A1041,A1041)<24,A1041,A1041+1)","v":44},{"$f":"VLOOKUP(A1042,'Counties and Regions'!$G$3:$J$74,4,FALSE)","v":"Western"},{"$f":"VLOOKUP(A1042,'Counties and Regions'!$G$3:$J$74,3,FALSE)","v":"Burnett County"},"Hospital Inpatient","D"]
[{"$f":"IF(COUNTIF($A$9:A1042,A1042)<24,A1042,A1042+1)","v":44},{"$f":"VLOOKUP(A1043,'Counties and Regions'!$G$3:$J$74,4,FALSE)","v":"Western"},{"$f":"VLOOKUP(A1043,'Counties and Regions'!$G$3:$J$74,3,FALSE)","v":"Burnett County"},"Hospital Inpatient","B"]
[{"$f":"IF(COUNTIF($A$9:A1043,A1043)<24,A1043,A1043+1)","v":44},{"$f":"VLOOKUP(A1044,'Counties and Regions'!$G$3:$J$74,4,FALSE)","v":"Western"},{"$f":"VLOOKUP(A1044,'Counties and Regions'!$G$3:$J$74,3,FALSE)","v":"Burnett County"},"Hospital Inpatient","O"]
[{"$f":"IF(COUNTIF($A$9:A1044,A1044)<24,A1044,A1044+1)","v":44},{"$f":"VLOOKUP(A1045,'Counties and Regions'!$G$3:$J$74,4,FALSE)","v":"Western"},{"$f":"VLOOKUP(A1045,'Counties and Regions'!$G$3:$J$74,3,FALSE)","v":"Burnett County"},"Hospital Outpatient","F"]
[{"$f":"IF(COUNTIF($A$9:A1045,A1045)<24,A1045,A1045+1)","v":44},{"$f":"VLOOKUP(A1046,'Counties and Regions'!$G$3:$J$74,4,FALSE)","v":"Western"},{"$f":"VLOOKUP(A1046,'Counties and Regions'!$G$3:$J$74,3,FALSE)","v":"Burnett County"},"Hospital Outpatient","D"]
[{"$f":"IF(COUNTIF($A$9:A1046,A1046)<24,A1046,A1046+1)","v":44},{"$f":"VLOOKUP(A1047,'Counties and Regions'!$G$3:$J$74,4,FALSE)","v":"Western"},{"$f":"VLOOKUP(A1047,'Counties and Regions'!$G$3:$J$74,3,FALSE)","v":"Burnett County"},"Hospital Outpatient","B"]
[{"$f":"IF(COUNTIF($A$9:A1047,A1047)<24,A1047,A1047+1)","v":44},{"$f":"VLOOKUP(A1048,'Counties and Regions'!$G$3:$J$74,4,FALSE)","v":"Western"},{"$f":"VLOOKUP(A1048,'Counties and Regions'!$G$3:$J$74,3,FALSE)","v":"Burnett County"},"Hospital Outpatient","O"]
[{"$f":"IF(COUNTIF($A$9:A1048,A1048)<24,A1048,A1048+1)","v":44},{"$f":"VLOOKUP(A1049,'Counties and Regions'!$G$3:$J$74,4,FALSE)","v":"Western"},{"$f":"VLOOKUP(A1049,'Counties and Regions'!$G$3:$J$74,3,FALSE)","v":"Burnett County"},"Other Facility","F"]
[{"$f":"IF(COUNTIF($A$9:A1049,A1049)<24,A1049,A1049+1)","v":44},{"$f":"VLOOKUP(A1050,'Counties and Regions'!$G$3:$J$74,4,FALSE)","v":"Western"},{"$f":"VLOOKUP(A1050,'Counties and Regions'!$G$3:$J$74,3,FALSE)","v":"Burnett County"},"Other Facility","D"]
[{"$f":"IF(COUNTIF($A$9:A1050,A1050)<24,A1050,A1050+1)","v":44},{"$f":"VLOOKUP(A1051,'Counties and Regions'!$G$3:$J$74,4,FALSE)","v":"Western"},{"$f":"VLOOKUP(A1051,'Counties and Regions'!$G$3:$J$74,3,FALSE)","v":"Burnett County"},"Other Facility","B"]
[{"$f":"IF(COUNTIF($A$9:A1051,A1051)<24,A1051,A1051+1)","v":44},{"$f":"VLOOKUP(A1052,'Counties and Regions'!$G$3:$J$74,4,FALSE)","v":"Western"},{"$f":"VLOOKUP(A1052,'Counties and Regions'!$G$3:$J$74,3,FALSE)","v":"Burnett County"},"Other Facility","O"]
[{"$f":"IF(COUNTIF($A$9:A1052,A1052)<24,A1052,A1052+1)","v":44},{"$f":"VLOOKUP(A1053,'Counties and Regions'!$G$3:$J$74,4,FALSE)","v":"Western"},{"$f":"VLOOKUP(A1053,'Counties and Regions'!$G$3:$J$74,3,FALSE)","v":"Burnett County"},"Physician Services","F"]
[{"$f":"IF(COUNTIF($A$9:A1053,A1053)<24,A1053,A1053+1)","v":44},{"$f":"VLOOKUP(A1054,'Counties and Regions'!$G$3:$J$74,4,FALSE)","v":"Western"},{"$f":"VLOOKUP(A1054,'Counties and Regions'!$G$3:$J$74,3,FALSE)","v":"Burnett County"},"Physician Services","D"]
[{"$f":"IF(COUNTIF($A$9:A1054,A1054)<24,A1054,A1054+1)","v":44},{"$f":"VLOOKUP(A1055,'Counties and Regions'!$G$3:$J$74,4,FALSE)","v":"Western"},{"$f":"VLOOKUP(A1055,'Counties and Regions'!$G$3:$J$74,3,FALSE)","v":"Burnett County"},"Physician Services","B"]
[{"$f":"IF(COUNTIF($A$9:A1055,A1055)<24,A1055,A1055+1)","v":44},{"$f":"VLOOKUP(A1056,'Counties and Regions'!$G$3:$J$74,4,FALSE)","v":"Western"},{"$f":"VLOOKUP(A1056,'Counties and Regions'!$G$3:$J$74,3,FALSE)","v":"Burnett County"},"Physician Services","O"]
[{"$f":"IF(COUNTIF($A$9:A1056,A1056)<24,A1056,A1056+1)","v":44},{"$f":"VLOOKUP(A1057,'Counties and Regions'!$G$3:$J$74,4,FALSE)","v":"Western"},{"$f":"VLOOKUP(A1057,'Counties and Regions'!$G$3:$J$74,3,FALSE)","v":"Burnett County"},"Other Services","F"]
[{"$f":"IF(COUNTIF($A$9:A1057,A1057)<24,A1057,A1057+1)","v":44},{"$f":"VLOOKUP(A1058,'Counties and Regions'!$G$3:$J$74,4,FALSE)","v":"Western"},{"$f":"VLOOKUP(A1058,'Counties and Regions'!$G$3:$J$74,3,FALSE)","v":"Burnett County"},"Other Services","D"]
[{"$f":"IF(COUNTIF($A$9:A1058,A1058)<24,A1058,A1058+1)","v":44},{"$f":"VLOOKUP(A1059,'Counties and Regions'!$G$3:$J$74,4,FALSE)","v":"Western"},{"$f":"VLOOKUP(A1059,'Counties and Regions'!$G$3:$J$74,3,FALSE)","v":"Burnett County"},"Other Services","B"]
[{"$f":"IF(COUNTIF($A$9:A1059,A1059)<24,A1059,A1059+1)","v":44},{"$f":"VLOOKUP(A1060,'Counties and Regions'!$G$3:$J$74,4,FALSE)","v":"Western"},{"$f":"VLOOKUP(A1060,'Counties and Regions'!$G$3:$J$74,3,FALSE)","v":"Burnett County"},"Other Services","O"]
[{"$f":"IF(COUNTIF($A$9:A1060,A1060)<24,A1060,A1060+1)","v":44},{"$f":"VLOOKUP(A1061,'Counties and Regions'!$G$3:$J$74,4,FALSE)","v":"Western"},{"$f":"VLOOKUP(A1061,'Counties and Regions'!$G$3:$J$74,3,FALSE)","v":"Burnett County"},"Additional Services","F"]
[{"$f":"IF(COUNTIF($A$9:A1061,A1061)<24,A1061,A1061+1)","v":44},{"$f":"VLOOKUP(A1062,'Counties and Regions'!$G$3:$J$74,4,FALSE)","v":"Western"},{"$f":"VLOOKUP(A1062,'Counties and Regions'!$G$3:$J$74,3,FALSE)","v":"Burnett County"},"Additional Services","D"]
[{"$f":"IF(COUNTIF($A$9:A1062,A1062)<24,A1062,A1062+1)","v":44},{"$f":"VLOOKUP(A1063,'Counties and Regions'!$G$3:$J$74,4,FALSE)","v":"Western"},{"$f":"VLOOKUP(A1063,'Counties and Regions'!$G$3:$J$74,3,FALSE)","v":"Burnett County"},"Additional Services","B"]
[{"$f":"IF(COUNTIF($A$9:A1063,A1063)<24,A1063,A1063+1)","v":44},{"$f":"VLOOKUP(A1064,'Counties and Regions'!$G$3:$J$74,4,FALSE)","v":"Western"},{"$f":"VLOOKUP(A1064,'Counties and Regions'!$G$3:$J$74,3,FALSE)","v":"Burnett County"},"Additional Services","O"]
[{"$f":"IF(COUNTIF($A$9:A1064,A1064)<24,A1064,A1064+1)","v":45},{"$f":"VLOOKUP(A1065,'Counties and Regions'!$G$3:$J$74,4,FALSE)","v":"Western"},{"$f":"VLOOKUP(A1065,'Counties and Regions'!$G$3:$J$74,3,FALSE)","v":"Chippewa County"},"Hospital Inpatient","F"]
[{"$f":"IF(COUNTIF($A$9:A1065,A1065)<24,A1065,A1065+1)","v":45},{"$f":"VLOOKUP(A1066,'Counties and Regions'!$G$3:$J$74,4,FALSE)","v":"Western"},{"$f":"VLOOKUP(A1066,'Counties and Regions'!$G$3:$J$74,3,FALSE)","v":"Chippewa County"},"Hospital Inpatient","D"]
[{"$f":"IF(COUNTIF($A$9:A1066,A1066)<24,A1066,A1066+1)","v":45},{"$f":"VLOOKUP(A1067,'Counties and Regions'!$G$3:$J$74,4,FALSE)","v":"Western"},{"$f":"VLOOKUP(A1067,'Counties and Regions'!$G$3:$J$74,3,FALSE)","v":"Chippewa County"},"Hospital Inpatient","B"]
[{"$f":"IF(COUNTIF($A$9:A1067,A1067)<24,A1067,A1067+1)","v":45},{"$f":"VLOOKUP(A1068,'Counties and Regions'!$G$3:$J$74,4,FALSE)","v":"Western"},{"$f":"VLOOKUP(A1068,'Counties and Regions'!$G$3:$J$74,3,FALSE)","v":"Chippewa County"},"Hospital Inpatient","O"]
[{"$f":"IF(COUNTIF($A$9:A1068,A1068)<24,A1068,A1068+1)","v":45},{"$f":"VLOOKUP(A1069,'Counties and Regions'!$G$3:$J$74,4,FALSE)","v":"Western"},{"$f":"VLOOKUP(A1069,'Counties and Regions'!$G$3:$J$74,3,FALSE)","v":"Chippewa County"},"Hospital Outpatient","F"]
[{"$f":"IF(COUNTIF($A$9:A1069,A1069)<24,A1069,A1069+1)","v":45},{"$f":"VLOOKUP(A1070,'Counties and Regions'!$G$3:$J$74,4,FALSE)","v":"Western"},{"$f":"VLOOKUP(A1070,'Counties and Regions'!$G$3:$J$74,3,FALSE)","v":"Chippewa County"},"Hospital Outpatient","D"]
[{"$f":"IF(COUNTIF($A$9:A1070,A1070)<24,A1070,A1070+1)","v":45},{"$f":"VLOOKUP(A1071,'Counties and Regions'!$G$3:$J$74,4,FALSE)","v":"Western"},{"$f":"VLOOKUP(A1071,'Counties and Regions'!$G$3:$J$74,3,FALSE)","v":"Chippewa County"},"Hospital Outpatient","B"]
[{"$f":"IF(COUNTIF($A$9:A1071,A1071)<24,A1071,A1071+1)","v":45},{"$f":"VLOOKUP(A1072,'Counties and Regions'!$G$3:$J$74,4,FALSE)","v":"Western"},{"$f":"VLOOKUP(A1072,'Counties and Regions'!$G$3:$J$74,3,FALSE)","v":"Chippewa County"},"Hospital Outpatient","O"]
[{"$f":"IF(COUNTIF($A$9:A1072,A1072)<24,A1072,A1072+1)","v":45},{"$f":"VLOOKUP(A1073,'Counties and Regions'!$G$3:$J$74,4,FALSE)","v":"Western"},{"$f":"VLOOKUP(A1073,'Counties and Regions'!$G$3:$J$74,3,FALSE)","v":"Chippewa County"},"Other Facility","F"]
[{"$f":"IF(COUNTIF($A$9:A1073,A1073)<24,A1073,A1073+1)","v":45},{"$f":"VLOOKUP(A1074,'Counties and Regions'!$G$3:$J$74,4,FALSE)","v":"Western"},{"$f":"VLOOKUP(A1074,'Counties and Regions'!$G$3:$J$74,3,FALSE)","v":"Chippewa County"},"Other Facility","D"]
[{"$f":"IF(COUNTIF($A$9:A1074,A1074)<24,A1074,A1074+1)","v":45},{"$f":"VLOOKUP(A1075,'Counties and Regions'!$G$3:$J$74,4,FALSE)","v":"Western"},{"$f":"VLOOKUP(A1075,'Counties and Regions'!$G$3:$J$74,3,FALSE)","v":"Chippewa County"},"Other Facility","B"]
[{"$f":"IF(COUNTIF($A$9:A1075,A1075)<24,A1075,A1075+1)","v":45},{"$f":"VLOOKUP(A1076,'Counties and Regions'!$G$3:$J$74,4,FALSE)","v":"Western"},{"$f":"VLOOKUP(A1076,'Counties and Regions'!$G$3:$J$74,3,FALSE)","v":"Chippewa County"},"Other Facility","O"]
[{"$f":"IF(COUNTIF($A$9:A1076,A1076)<24,A1076,A1076+1)","v":45},{"$f":"VLOOKUP(A1077,'Counties and Regions'!$G$3:$J$74,4,FALSE)","v":"Western"},{"$f":"VLOOKUP(A1077,'Counties and Regions'!$G$3:$J$74,3,FALSE)","v":"Chippewa County"},"Physician Services","F"]
[{"$f":"IF(COUNTIF($A$9:A1077,A1077)<24,A1077,A1077+1)","v":45},{"$f":"VLOOKUP(A1078,'Counties and Regions'!$G$3:$J$74,4,FALSE)","v":"Western"},{"$f":"VLOOKUP(A1078,'Counties and Regions'!$G$3:$J$74,3,FALSE)","v":"Chippewa County"},"Physician Services","D"]
[{"$f":"IF(COUNTIF($A$9:A1078,A1078)<24,A1078,A1078+1)","v":45},{"$f":"VLOOKUP(A1079,'Counties and Regions'!$G$3:$J$74,4,FALSE)","v":"Western"},{"$f":"VLOOKUP(A1079,'Counties and Regions'!$G$3:$J$74,3,FALSE)","v":"Chippewa County"},"Physician Services","B"]
[{"$f":"IF(COUNTIF($A$9:A1079,A1079)<24,A1079,A1079+1)","v":45},{"$f":"VLOOKUP(A1080,'Counties and Regions'!$G$3:$J$74,4,FALSE)","v":"Western"},{"$f":"VLOOKUP(A1080,'Counties and Regions'!$G$3:$J$74,3,FALSE)","v":"Chippewa County"},"Physician Services","O"]
[{"$f":"IF(COUNTIF($A$9:A1080,A1080)<24,A1080,A1080+1)","v":45},{"$f":"VLOOKUP(A1081,'Counties and Regions'!$G$3:$J$74,4,FALSE)","v":"Western"},{"$f":"VLOOKUP(A1081,'Counties and Regions'!$G$3:$J$74,3,FALSE)","v":"Chippewa County"},"Other Services","F"]
[{"$f":"IF(COUNTIF($A$9:A1081,A1081)<24,A1081,A1081+1)","v":45},{"$f":"VLOOKUP(A1082,'Counties and Regions'!$G$3:$J$74,4,FALSE)","v":"Western"},{"$f":"VLOOKUP(A1082,'Counties and Regions'!$G$3:$J$74,3,FALSE)","v":"Chippewa County"},"Other Services","D"]
[{"$f":"IF(COUNTIF($A$9:A1082,A1082)<24,A1082,A1082+1)","v":45},{"$f":"VLOOKUP(A1083,'Counties and Regions'!$G$3:$J$74,4,FALSE)","v":"Western"},{"$f":"VLOOKUP(A1083,'Counties and Regions'!$G$3:$J$74,3,FALSE)","v":"Chippewa County"},"Other Services","B"]
[{"$f":"IF(COUNTIF($A$9:A1083,A1083)<24,A1083,A1083+1)","v":45},{"$f":"VLOOKUP(A1084,'Counties and Regions'!$G$3:$J$74,4,FALSE)","v":"Western"},{"$f":"VLOOKUP(A1084,'Counties and Regions'!$G$3:$J$74,3,FALSE)","v":"Chippewa County"},"Other Services","O"]
[{"$f":"IF(COUNTIF($A$9:A1084,A1084)<24,A1084,A1084+1)","v":45},{"$f":"VLOOKUP(A1085,'Counties and Regions'!$G$3:$J$74,4,FALSE)","v":"Western"},{"$f":"VLOOKUP(A1085,'Counties and Regions'!$G$3:$J$74,3,FALSE)","v":"Chippewa County"},"Additional Services","F"]
[{"$f":"IF(COUNTIF($A$9:A1085,A1085)<24,A1085,A1085+1)","v":45},{"$f":"VLOOKUP(A1086,'Counties and Regions'!$G$3:$J$74,4,FALSE)","v":"Western"},{"$f":"VLOOKUP(A1086,'Counties and Regions'!$G$3:$J$74,3,FALSE)","v":"Chippewa County"},"Additional Services","D"]
[{"$f":"IF(COUNTIF($A$9:A1086,A1086)<24,A1086,A1086+1)","v":45},{"$f":"VLOOKUP(A1087,'Counties and Regions'!$G$3:$J$74,4,FALSE)","v":"Western"},{"$f":"VLOOKUP(A1087,'Counties and Regions'!$G$3:$J$74,3,FALSE)","v":"Chippewa County"},"Additional Services","B"]
[{"$f":"IF(COUNTIF($A$9:A1087,A1087)<24,A1087,A1087+1)","v":45},{"$f":"VLOOKUP(A1088,'Counties and Regions'!$G$3:$J$74,4,FALSE)","v":"Western"},{"$f":"VLOOKUP(A1088,'Counties and Regions'!$G$3:$J$74,3,FALSE)","v":"Chippewa County"},"Additional Services","O"]
[{"$f":"IF(COUNTIF($A$9:A1088,A1088)<24,A1088,A1088+1)","v":46},{"$f":"VLOOKUP(A1089,'Counties and Regions'!$G$3:$J$74,4,FALSE)","v":"Western"},{"$f":"VLOOKUP(A1089,'Counties and Regions'!$G$3:$J$74,3,FALSE)","v":"Clark County"},"Hospital Inpatient","F"]
[{"$f":"IF(COUNTIF($A$9:A1089,A1089)<24,A1089,A1089+1)","v":46},{"$f":"VLOOKUP(A1090,'Counties and Regions'!$G$3:$J$74,4,FALSE)","v":"Western"},{"$f":"VLOOKUP(A1090,'Counties and Regions'!$G$3:$J$74,3,FALSE)","v":"Clark County"},"Hospital Inpatient","D"]
[{"$f":"IF(COUNTIF($A$9:A1090,A1090)<24,A1090,A1090+1)","v":46},{"$f":"VLOOKUP(A1091,'Counties and Regions'!$G$3:$J$74,4,FALSE)","v":"Western"},{"$f":"VLOOKUP(A1091,'Counties and Regions'!$G$3:$J$74,3,FALSE)","v":"Clark County"},"Hospital Inpatient","B"]
[{"$f":"IF(COUNTIF($A$9:A1091,A1091)<24,A1091,A1091+1)","v":46},{"$f":"VLOOKUP(A1092,'Counties and Regions'!$G$3:$J$74,4,FALSE)","v":"Western"},{"$f":"VLOOKUP(A1092,'Counties and Regions'!$G$3:$J$74,3,FALSE)","v":"Clark County"},"Hospital Inpatient","O"]
[{"$f":"IF(COUNTIF($A$9:A1092,A1092)<24,A1092,A1092+1)","v":46},{"$f":"VLOOKUP(A1093,'Counties and Regions'!$G$3:$J$74,4,FALSE)","v":"Western"},{"$f":"VLOOKUP(A1093,'Counties and Regions'!$G$3:$J$74,3,FALSE)","v":"Clark County"},"Hospital Outpatient","F"]
[{"$f":"IF(COUNTIF($A$9:A1093,A1093)<24,A1093,A1093+1)","v":46},{"$f":"VLOOKUP(A1094,'Counties and Regions'!$G$3:$J$74,4,FALSE)","v":"Western"},{"$f":"VLOOKUP(A1094,'Counties and Regions'!$G$3:$J$74,3,FALSE)","v":"Clark County"},"Hospital Outpatient","D"]
[{"$f":"IF(COUNTIF($A$9:A1094,A1094)<24,A1094,A1094+1)","v":46},{"$f":"VLOOKUP(A1095,'Counties and Regions'!$G$3:$J$74,4,FALSE)","v":"Western"},{"$f":"VLOOKUP(A1095,'Counties and Regions'!$G$3:$J$74,3,FALSE)","v":"Clark County"},"Hospital Outpatient","B"]
[{"$f":"IF(COUNTIF($A$9:A1095,A1095)<24,A1095,A1095+1)","v":46},{"$f":"VLOOKUP(A1096,'Counties and Regions'!$G$3:$J$74,4,FALSE)","v":"Western"},{"$f":"VLOOKUP(A1096,'Counties and Regions'!$G$3:$J$74,3,FALSE)","v":"Clark County"},"Hospital Outpatient","O"]
[{"$f":"IF(COUNTIF($A$9:A1096,A1096)<24,A1096,A1096+1)","v":46},{"$f":"VLOOKUP(A1097,'Counties and Regions'!$G$3:$J$74,4,FALSE)","v":"Western"},{"$f":"VLOOKUP(A1097,'Counties and Regions'!$G$3:$J$74,3,FALSE)","v":"Clark County"},"Other Facility","F"]
[{"$f":"IF(COUNTIF($A$9:A1097,A1097)<24,A1097,A1097+1)","v":46},{"$f":"VLOOKUP(A1098,'Counties and Regions'!$G$3:$J$74,4,FALSE)","v":"Western"},{"$f":"VLOOKUP(A1098,'Counties and Regions'!$G$3:$J$74,3,FALSE)","v":"Clark County"},"Other Facility","D"]
[{"$f":"IF(COUNTIF($A$9:A1098,A1098)<24,A1098,A1098+1)","v":46},{"$f":"VLOOKUP(A1099,'Counties and Regions'!$G$3:$J$74,4,FALSE)","v":"Western"},{"$f":"VLOOKUP(A1099,'Counties and Regions'!$G$3:$J$74,3,FALSE)","v":"Clark County"},"Other Facility","B"]
[{"$f":"IF(COUNTIF($A$9:A1099,A1099)<24,A1099,A1099+1)","v":46},{"$f":"VLOOKUP(A1100,'Counties and Regions'!$G$3:$J$74,4,FALSE)","v":"Western"},{"$f":"VLOOKUP(A1100,'Counties and Regions'!$G$3:$J$74,3,FALSE)","v":"Clark County"},"Other Facility","O"]
[{"$f":"IF(COUNTIF($A$9:A1100,A1100)<24,A1100,A1100+1)","v":46},{"$f":"VLOOKUP(A1101,'Counties and Regions'!$G$3:$J$74,4,FALSE)","v":"Western"},{"$f":"VLOOKUP(A1101,'Counties and Regions'!$G$3:$J$74,3,FALSE)","v":"Clark County"},"Physician Services","F"]
[{"$f":"IF(COUNTIF($A$9:A1101,A1101)<24,A1101,A1101+1)","v":46},{"$f":"VLOOKUP(A1102,'Counties and Regions'!$G$3:$J$74,4,FALSE)","v":"Western"},{"$f":"VLOOKUP(A1102,'Counties and Regions'!$G$3:$J$74,3,FALSE)","v":"Clark County"},"Physician Services","D"]
[{"$f":"IF(COUNTIF($A$9:A1102,A1102)<24,A1102,A1102+1)","v":46},{"$f":"VLOOKUP(A1103,'Counties and Regions'!$G$3:$J$74,4,FALSE)","v":"Western"},{"$f":"VLOOKUP(A1103,'Counties and Regions'!$G$3:$J$74,3,FALSE)","v":"Clark County"},"Physician Services","B"]
[{"$f":"IF(COUNTIF($A$9:A1103,A1103)<24,A1103,A1103+1)","v":46},{"$f":"VLOOKUP(A1104,'Counties and Regions'!$G$3:$J$74,4,FALSE)","v":"Western"},{"$f":"VLOOKUP(A1104,'Counties and Regions'!$G$3:$J$74,3,FALSE)","v":"Clark County"},"Physician Services","O"]
[{"$f":"IF(COUNTIF($A$9:A1104,A1104)<24,A1104,A1104+1)","v":46},{"$f":"VLOOKUP(A1105,'Counties and Regions'!$G$3:$J$74,4,FALSE)","v":"Western"},{"$f":"VLOOKUP(A1105,'Counties and Regions'!$G$3:$J$74,3,FALSE)","v":"Clark County"},"Other Services","F"]
[{"$f":"IF(COUNTIF($A$9:A1105,A1105)<24,A1105,A1105+1)","v":46},{"$f":"VLOOKUP(A1106,'Counties and Regions'!$G$3:$J$74,4,FALSE)","v":"Western"},{"$f":"VLOOKUP(A1106,'Counties and Regions'!$G$3:$J$74,3,FALSE)","v":"Clark County"},"Other Services","D"]
[{"$f":"IF(COUNTIF($A$9:A1106,A1106)<24,A1106,A1106+1)","v":46},{"$f":"VLOOKUP(A1107,'Counties and Regions'!$G$3:$J$74,4,FALSE)","v":"Western"},{"$f":"VLOOKUP(A1107,'Counties and Regions'!$G$3:$J$74,3,FALSE)","v":"Clark County"},"Other Services","B"]
[{"$f":"IF(COUNTIF($A$9:A1107,A1107)<24,A1107,A1107+1)","v":46},{"$f":"VLOOKUP(A1108,'Counties and Regions'!$G$3:$J$74,4,FALSE)","v":"Western"},{"$f":"VLOOKUP(A1108,'Counties and Regions'!$G$3:$J$74,3,FALSE)","v":"Clark County"},"Other Services","O"]
[{"$f":"IF(COUNTIF($A$9:A1108,A1108)<24,A1108,A1108+1)","v":46},{"$f":"VLOOKUP(A1109,'Counties and Regions'!$G$3:$J$74,4,FALSE)","v":"Western"},{"$f":"VLOOKUP(A1109,'Counties and Regions'!$G$3:$J$74,3,FALSE)","v":"Clark County"},"Additional Services","F"]
[{"$f":"IF(COUNTIF($A$9:A1109,A1109)<24,A1109,A1109+1)","v":46},{"$f":"VLOOKUP(A1110,'Counties and Regions'!$G$3:$J$74,4,FALSE)","v":"Western"},{"$f":"VLOOKUP(A1110,'Counties and Regions'!$G$3:$J$74,3,FALSE)","v":"Clark County"},"Additional Services","D"]
[{"$f":"IF(COUNTIF($A$9:A1110,A1110)<24,A1110,A1110+1)","v":46},{"$f":"VLOOKUP(A1111,'Counties and Regions'!$G$3:$J$74,4,FALSE)","v":"Western"},{"$f":"VLOOKUP(A1111,'Counties and Regions'!$G$3:$J$74,3,FALSE)","v":"Clark County"},"Additional Services","B"]
[{"$f":"IF(COUNTIF($A$9:A1111,A1111)<24,A1111,A1111+1)","v":46},{"$f":"VLOOKUP(A1112,'Counties and Regions'!$G$3:$J$74,4,FALSE)","v":"Western"},{"$f":"VLOOKUP(A1112,'Counties and Regions'!$G$3:$J$74,3,FALSE)","v":"Clark County"},"Additional Services","O"]
[{"$f":"IF(COUNTIF($A$9:A1112,A1112)<24,A1112,A1112+1)","v":47},{"$f":"VLOOKUP(A1113,'Counties and Regions'!$G$3:$J$74,4,FALSE)","v":"Western"},{"$f":"VLOOKUP(A1113,'Counties and Regions'!$G$3:$J$74,3,FALSE)","v":"Douglas County"},"Hospital Inpatient","F"]
[{"$f":"IF(COUNTIF($A$9:A1113,A1113)<24,A1113,A1113+1)","v":47},{"$f":"VLOOKUP(A1114,'Counties and Regions'!$G$3:$J$74,4,FALSE)","v":"Western"},{"$f":"VLOOKUP(A1114,'Counties and Regions'!$G$3:$J$74,3,FALSE)","v":"Douglas County"},"Hospital Inpatient","D"]
[{"$f":"IF(COUNTIF($A$9:A1114,A1114)<24,A1114,A1114+1)","v":47},{"$f":"VLOOKUP(A1115,'Counties and Regions'!$G$3:$J$74,4,FALSE)","v":"Western"},{"$f":"VLOOKUP(A1115,'Counties and Regions'!$G$3:$J$74,3,FALSE)","v":"Douglas County"},"Hospital Inpatient","B"]
[{"$f":"IF(COUNTIF($A$9:A1115,A1115)<24,A1115,A1115+1)","v":47},{"$f":"VLOOKUP(A1116,'Counties and Regions'!$G$3:$J$74,4,FALSE)","v":"Western"},{"$f":"VLOOKUP(A1116,'Counties and Regions'!$G$3:$J$74,3,FALSE)","v":"Douglas County"},"Hospital Inpatient","O"]
[{"$f":"IF(COUNTIF($A$9:A1116,A1116)<24,A1116,A1116+1)","v":47},{"$f":"VLOOKUP(A1117,'Counties and Regions'!$G$3:$J$74,4,FALSE)","v":"Western"},{"$f":"VLOOKUP(A1117,'Counties and Regions'!$G$3:$J$74,3,FALSE)","v":"Douglas County"},"Hospital Outpatient","F"]
[{"$f":"IF(COUNTIF($A$9:A1117,A1117)<24,A1117,A1117+1)","v":47},{"$f":"VLOOKUP(A1118,'Counties and Regions'!$G$3:$J$74,4,FALSE)","v":"Western"},{"$f":"VLOOKUP(A1118,'Counties and Regions'!$G$3:$J$74,3,FALSE)","v":"Douglas County"},"Hospital Outpatient","D"]
[{"$f":"IF(COUNTIF($A$9:A1118,A1118)<24,A1118,A1118+1)","v":47},{"$f":"VLOOKUP(A1119,'Counties and Regions'!$G$3:$J$74,4,FALSE)","v":"Western"},{"$f":"VLOOKUP(A1119,'Counties and Regions'!$G$3:$J$74,3,FALSE)","v":"Douglas County"},"Hospital Outpatient","B"]
[{"$f":"IF(COUNTIF($A$9:A1119,A1119)<24,A1119,A1119+1)","v":47},{"$f":"VLOOKUP(A1120,'Counties and Regions'!$G$3:$J$74,4,FALSE)","v":"Western"},{"$f":"VLOOKUP(A1120,'Counties and Regions'!$G$3:$J$74,3,FALSE)","v":"Douglas County"},"Hospital Outpatient","O"]
[{"$f":"IF(COUNTIF($A$9:A1120,A1120)<24,A1120,A1120+1)","v":47},{"$f":"VLOOKUP(A1121,'Counties and Regions'!$G$3:$J$74,4,FALSE)","v":"Western"},{"$f":"VLOOKUP(A1121,'Counties and Regions'!$G$3:$J$74,3,FALSE)","v":"Douglas County"},"Other Facility","F"]
[{"$f":"IF(COUNTIF($A$9:A1121,A1121)<24,A1121,A1121+1)","v":47},{"$f":"VLOOKUP(A1122,'Counties and Regions'!$G$3:$J$74,4,FALSE)","v":"Western"},{"$f":"VLOOKUP(A1122,'Counties and Regions'!$G$3:$J$74,3,FALSE)","v":"Douglas County"},"Other Facility","D"]
[{"$f":"IF(COUNTIF($A$9:A1122,A1122)<24,A1122,A1122+1)","v":47},{"$f":"VLOOKUP(A1123,'Counties and Regions'!$G$3:$J$74,4,FALSE)","v":"Western"},{"$f":"VLOOKUP(A1123,'Counties and Regions'!$G$3:$J$74,3,FALSE)","v":"Douglas County"},"Other Facility","B"]
[{"$f":"IF(COUNTIF($A$9:A1123,A1123)<24,A1123,A1123+1)","v":47},{"$f":"VLOOKUP(A1124,'Counties and Regions'!$G$3:$J$74,4,FALSE)","v":"Western"},{"$f":"VLOOKUP(A1124,'Counties and Regions'!$G$3:$J$74,3,FALSE)","v":"Douglas County"},"Other Facility","O"]
[{"$f":"IF(COUNTIF($A$9:A1124,A1124)<24,A1124,A1124+1)","v":47},{"$f":"VLOOKUP(A1125,'Counties and Regions'!$G$3:$J$74,4,FALSE)","v":"Western"},{"$f":"VLOOKUP(A1125,'Counties and Regions'!$G$3:$J$74,3,FALSE)","v":"Douglas County"},"Physician Services","F"]
[{"$f":"IF(COUNTIF($A$9:A1125,A1125)<24,A1125,A1125+1)","v":47},{"$f":"VLOOKUP(A1126,'Counties and Regions'!$G$3:$J$74,4,FALSE)","v":"Western"},{"$f":"VLOOKUP(A1126,'Counties and Regions'!$G$3:$J$74,3,FALSE)","v":"Douglas County"},"Physician Services","D"]
[{"$f":"IF(COUNTIF($A$9:A1126,A1126)<24,A1126,A1126+1)","v":47},{"$f":"VLOOKUP(A1127,'Counties and Regions'!$G$3:$J$74,4,FALSE)","v":"Western"},{"$f":"VLOOKUP(A1127,'Counties and Regions'!$G$3:$J$74,3,FALSE)","v":"Douglas County"},"Physician Services","B"]
[{"$f":"IF(COUNTIF($A$9:A1127,A1127)<24,A1127,A1127+1)","v":47},{"$f":"VLOOKUP(A1128,'Counties and Regions'!$G$3:$J$74,4,FALSE)","v":"Western"},{"$f":"VLOOKUP(A1128,'Counties and Regions'!$G$3:$J$74,3,FALSE)","v":"Douglas County"},"Physician Services","O"]
[{"$f":"IF(COUNTIF($A$9:A1128,A1128)<24,A1128,A1128+1)","v":47},{"$f":"VLOOKUP(A1129,'Counties and Regions'!$G$3:$J$74,4,FALSE)","v":"Western"},{"$f":"VLOOKUP(A1129,'Counties and Regions'!$G$3:$J$74,3,FALSE)","v":"Douglas County"},"Other Services","F"]
[{"$f":"IF(COUNTIF($A$9:A1129,A1129)<24,A1129,A1129+1)","v":47},{"$f":"VLOOKUP(A1130,'Counties and Regions'!$G$3:$J$74,4,FALSE)","v":"Western"},{"$f":"VLOOKUP(A1130,'Counties and Regions'!$G$3:$J$74,3,FALSE)","v":"Douglas County"},"Other Services","D"]
[{"$f":"IF(COUNTIF($A$9:A1130,A1130)<24,A1130,A1130+1)","v":47},{"$f":"VLOOKUP(A1131,'Counties and Regions'!$G$3:$J$74,4,FALSE)","v":"Western"},{"$f":"VLOOKUP(A1131,'Counties and Regions'!$G$3:$J$74,3,FALSE)","v":"Douglas County"},"Other Services","B"]
[{"$f":"IF(COUNTIF($A$9:A1131,A1131)<24,A1131,A1131+1)","v":47},{"$f":"VLOOKUP(A1132,'Counties and Regions'!$G$3:$J$74,4,FALSE)","v":"Western"},{"$f":"VLOOKUP(A1132,'Counties and Regions'!$G$3:$J$74,3,FALSE)","v":"Douglas County"},"Other Services","O"]
[{"$f":"IF(COUNTIF($A$9:A1132,A1132)<24,A1132,A1132+1)","v":47},{"$f":"VLOOKUP(A1133,'Counties and Regions'!$G$3:$J$74,4,FALSE)","v":"Western"},{"$f":"VLOOKUP(A1133,'Counties and Regions'!$G$3:$J$74,3,FALSE)","v":"Douglas County"},"Additional Services","F"]
[{"$f":"IF(COUNTIF($A$9:A1133,A1133)<24,A1133,A1133+1)","v":47},{"$f":"VLOOKUP(A1134,'Counties and Regions'!$G$3:$J$74,4,FALSE)","v":"Western"},{"$f":"VLOOKUP(A1134,'Counties and Regions'!$G$3:$J$74,3,FALSE)","v":"Douglas County"},"Additional Services","D"]
[{"$f":"IF(COUNTIF($A$9:A1134,A1134)<24,A1134,A1134+1)","v":47},{"$f":"VLOOKUP(A1135,'Counties and Regions'!$G$3:$J$74,4,FALSE)","v":"Western"},{"$f":"VLOOKUP(A1135,'Counties and Regions'!$G$3:$J$74,3,FALSE)","v":"Douglas County"},"Additional Services","B"]
[{"$f":"IF(COUNTIF($A$9:A1135,A1135)<24,A1135,A1135+1)","v":47},{"$f":"VLOOKUP(A1136,'Counties and Regions'!$G$3:$J$74,4,FALSE)","v":"Western"},{"$f":"VLOOKUP(A1136,'Counties and Regions'!$G$3:$J$74,3,FALSE)","v":"Douglas County"},"Additional Services","O"]
[{"$f":"IF(COUNTIF($A$9:A1136,A1136)<24,A1136,A1136+1)","v":48},{"$f":"VLOOKUP(A1137,'Counties and Regions'!$G$3:$J$74,4,FALSE)","v":"Western"},{"$f":"VLOOKUP(A1137,'Counties and Regions'!$G$3:$J$74,3,FALSE)","v":"Dunn County"},"Hospital Inpatient","F"]
[{"$f":"IF(COUNTIF($A$9:A1137,A1137)<24,A1137,A1137+1)","v":48},{"$f":"VLOOKUP(A1138,'Counties and Regions'!$G$3:$J$74,4,FALSE)","v":"Western"},{"$f":"VLOOKUP(A1138,'Counties and Regions'!$G$3:$J$74,3,FALSE)","v":"Dunn County"},"Hospital Inpatient","D"]
[{"$f":"IF(COUNTIF($A$9:A1138,A1138)<24,A1138,A1138+1)","v":48},{"$f":"VLOOKUP(A1139,'Counties and Regions'!$G$3:$J$74,4,FALSE)","v":"Western"},{"$f":"VLOOKUP(A1139,'Counties and Regions'!$G$3:$J$74,3,FALSE)","v":"Dunn County"},"Hospital Inpatient","B"]
[{"$f":"IF(COUNTIF($A$9:A1139,A1139)<24,A1139,A1139+1)","v":48},{"$f":"VLOOKUP(A1140,'Counties and Regions'!$G$3:$J$74,4,FALSE)","v":"Western"},{"$f":"VLOOKUP(A1140,'Counties and Regions'!$G$3:$J$74,3,FALSE)","v":"Dunn County"},"Hospital Inpatient","O"]
[{"$f":"IF(COUNTIF($A$9:A1140,A1140)<24,A1140,A1140+1)","v":48},{"$f":"VLOOKUP(A1141,'Counties and Regions'!$G$3:$J$74,4,FALSE)","v":"Western"},{"$f":"VLOOKUP(A1141,'Counties and Regions'!$G$3:$J$74,3,FALSE)","v":"Dunn County"},"Hospital Outpatient","F"]
[{"$f":"IF(COUNTIF($A$9:A1141,A1141)<24,A1141,A1141+1)","v":48},{"$f":"VLOOKUP(A1142,'Counties and Regions'!$G$3:$J$74,4,FALSE)","v":"Western"},{"$f":"VLOOKUP(A1142,'Counties and Regions'!$G$3:$J$74,3,FALSE)","v":"Dunn County"},"Hospital Outpatient","D"]
[{"$f":"IF(COUNTIF($A$9:A1142,A1142)<24,A1142,A1142+1)","v":48},{"$f":"VLOOKUP(A1143,'Counties and Regions'!$G$3:$J$74,4,FALSE)","v":"Western"},{"$f":"VLOOKUP(A1143,'Counties and Regions'!$G$3:$J$74,3,FALSE)","v":"Dunn County"},"Hospital Outpatient","B"]
[{"$f":"IF(COUNTIF($A$9:A1143,A1143)<24,A1143,A1143+1)","v":48},{"$f":"VLOOKUP(A1144,'Counties and Regions'!$G$3:$J$74,4,FALSE)","v":"Western"},{"$f":"VLOOKUP(A1144,'Counties and Regions'!$G$3:$J$74,3,FALSE)","v":"Dunn County"},"Hospital Outpatient","O"]
[{"$f":"IF(COUNTIF($A$9:A1144,A1144)<24,A1144,A1144+1)","v":48},{"$f":"VLOOKUP(A1145,'Counties and Regions'!$G$3:$J$74,4,FALSE)","v":"Western"},{"$f":"VLOOKUP(A1145,'Counties and Regions'!$G$3:$J$74,3,FALSE)","v":"Dunn County"},"Other Facility","F"]
[{"$f":"IF(COUNTIF($A$9:A1145,A1145)<24,A1145,A1145+1)","v":48},{"$f":"VLOOKUP(A1146,'Counties and Regions'!$G$3:$J$74,4,FALSE)","v":"Western"},{"$f":"VLOOKUP(A1146,'Counties and Regions'!$G$3:$J$74,3,FALSE)","v":"Dunn County"},"Other Facility","D"]
[{"$f":"IF(COUNTIF($A$9:A1146,A1146)<24,A1146,A1146+1)","v":48},{"$f":"VLOOKUP(A1147,'Counties and Regions'!$G$3:$J$74,4,FALSE)","v":"Western"},{"$f":"VLOOKUP(A1147,'Counties and Regions'!$G$3:$J$74,3,FALSE)","v":"Dunn County"},"Other Facility","B"]
[{"$f":"IF(COUNTIF($A$9:A1147,A1147)<24,A1147,A1147+1)","v":48},{"$f":"VLOOKUP(A1148,'Counties and Regions'!$G$3:$J$74,4,FALSE)","v":"Western"},{"$f":"VLOOKUP(A1148,'Counties and Regions'!$G$3:$J$74,3,FALSE)","v":"Dunn County"},"Other Facility","O"]
[{"$f":"IF(COUNTIF($A$9:A1148,A1148)<24,A1148,A1148+1)","v":48},{"$f":"VLOOKUP(A1149,'Counties and Regions'!$G$3:$J$74,4,FALSE)","v":"Western"},{"$f":"VLOOKUP(A1149,'Counties and Regions'!$G$3:$J$74,3,FALSE)","v":"Dunn County"},"Physician Services","F"]
[{"$f":"IF(COUNTIF($A$9:A1149,A1149)<24,A1149,A1149+1)","v":48},{"$f":"VLOOKUP(A1150,'Counties and Regions'!$G$3:$J$74,4,FALSE)","v":"Western"},{"$f":"VLOOKUP(A1150,'Counties and Regions'!$G$3:$J$74,3,FALSE)","v":"Dunn County"},"Physician Services","D"]
[{"$f":"IF(COUNTIF($A$9:A1150,A1150)<24,A1150,A1150+1)","v":48},{"$f":"VLOOKUP(A1151,'Counties and Regions'!$G$3:$J$74,4,FALSE)","v":"Western"},{"$f":"VLOOKUP(A1151,'Counties and Regions'!$G$3:$J$74,3,FALSE)","v":"Dunn County"},"Physician Services","B"]
[{"$f":"IF(COUNTIF($A$9:A1151,A1151)<24,A1151,A1151+1)","v":48},{"$f":"VLOOKUP(A1152,'Counties and Regions'!$G$3:$J$74,4,FALSE)","v":"Western"},{"$f":"VLOOKUP(A1152,'Counties and Regions'!$G$3:$J$74,3,FALSE)","v":"Dunn County"},"Physician Services","O"]
[{"$f":"IF(COUNTIF($A$9:A1152,A1152)<24,A1152,A1152+1)","v":48},{"$f":"VLOOKUP(A1153,'Counties and Regions'!$G$3:$J$74,4,FALSE)","v":"Western"},{"$f":"VLOOKUP(A1153,'Counties and Regions'!$G$3:$J$74,3,FALSE)","v":"Dunn County"},"Other Services","F"]
[{"$f":"IF(COUNTIF($A$9:A1153,A1153)<24,A1153,A1153+1)","v":48},{"$f":"VLOOKUP(A1154,'Counties and Regions'!$G$3:$J$74,4,FALSE)","v":"Western"},{"$f":"VLOOKUP(A1154,'Counties and Regions'!$G$3:$J$74,3,FALSE)","v":"Dunn County"},"Other Services","D"]
[{"$f":"IF(COUNTIF($A$9:A1154,A1154)<24,A1154,A1154+1)","v":48},{"$f":"VLOOKUP(A1155,'Counties and Regions'!$G$3:$J$74,4,FALSE)","v":"Western"},{"$f":"VLOOKUP(A1155,'Counties and Regions'!$G$3:$J$74,3,FALSE)","v":"Dunn County"},"Other Services","B"]
[{"$f":"IF(COUNTIF($A$9:A1155,A1155)<24,A1155,A1155+1)","v":48},{"$f":"VLOOKUP(A1156,'Counties and Regions'!$G$3:$J$74,4,FALSE)","v":"Western"},{"$f":"VLOOKUP(A1156,'Counties and Regions'!$G$3:$J$74,3,FALSE)","v":"Dunn County"},"Other Services","O"]
[{"$f":"IF(COUNTIF($A$9:A1156,A1156)<24,A1156,A1156+1)","v":48},{"$f":"VLOOKUP(A1157,'Counties and Regions'!$G$3:$J$74,4,FALSE)","v":"Western"},{"$f":"VLOOKUP(A1157,'Counties and Regions'!$G$3:$J$74,3,FALSE)","v":"Dunn County"},"Additional Services","F"]
[{"$f":"IF(COUNTIF($A$9:A1157,A1157)<24,A1157,A1157+1)","v":48},{"$f":"VLOOKUP(A1158,'Counties and Regions'!$G$3:$J$74,4,FALSE)","v":"Western"},{"$f":"VLOOKUP(A1158,'Counties and Regions'!$G$3:$J$74,3,FALSE)","v":"Dunn County"},"Additional Services","D"]
[{"$f":"IF(COUNTIF($A$9:A1158,A1158)<24,A1158,A1158+1)","v":48},{"$f":"VLOOKUP(A1159,'Counties and Regions'!$G$3:$J$74,4,FALSE)","v":"Western"},{"$f":"VLOOKUP(A1159,'Counties and Regions'!$G$3:$J$74,3,FALSE)","v":"Dunn County"},"Additional Services","B"]
[{"$f":"IF(COUNTIF($A$9:A1159,A1159)<24,A1159,A1159+1)","v":48},{"$f":"VLOOKUP(A1160,'Counties and Regions'!$G$3:$J$74,4,FALSE)","v":"Western"},{"$f":"VLOOKUP(A1160,'Counties and Regions'!$G$3:$J$74,3,FALSE)","v":"Dunn County"},"Additional Services","O"]
[{"$f":"IF(COUNTIF($A$9:A1160,A1160)<24,A1160,A1160+1)","v":49},{"$f":"VLOOKUP(A1161,'Counties and Regions'!$G$3:$J$74,4,FALSE)","v":"Western"},{"$f":"VLOOKUP(A1161,'Counties and Regions'!$G$3:$J$74,3,FALSE)","v":"Eau Claire County"},"Hospital Inpatient","F"]
[{"$f":"IF(COUNTIF($A$9:A1161,A1161)<24,A1161,A1161+1)","v":49},{"$f":"VLOOKUP(A1162,'Counties and Regions'!$G$3:$J$74,4,FALSE)","v":"Western"},{"$f":"VLOOKUP(A1162,'Counties and Regions'!$G$3:$J$74,3,FALSE)","v":"Eau Claire County"},"Hospital Inpatient","D"]
[{"$f":"IF(COUNTIF($A$9:A1162,A1162)<24,A1162,A1162+1)","v":49},{"$f":"VLOOKUP(A1163,'Counties and Regions'!$G$3:$J$74,4,FALSE)","v":"Western"},{"$f":"VLOOKUP(A1163,'Counties and Regions'!$G$3:$J$74,3,FALSE)","v":"Eau Claire County"},"Hospital Inpatient","B"]
[{"$f":"IF(COUNTIF($A$9:A1163,A1163)<24,A1163,A1163+1)","v":49},{"$f":"VLOOKUP(A1164,'Counties and Regions'!$G$3:$J$74,4,FALSE)","v":"Western"},{"$f":"VLOOKUP(A1164,'Counties and Regions'!$G$3:$J$74,3,FALSE)","v":"Eau Claire County"},"Hospital Inpatient","O"]
[{"$f":"IF(COUNTIF($A$9:A1164,A1164)<24,A1164,A1164+1)","v":49},{"$f":"VLOOKUP(A1165,'Counties and Regions'!$G$3:$J$74,4,FALSE)","v":"Western"},{"$f":"VLOOKUP(A1165,'Counties and Regions'!$G$3:$J$74,3,FALSE)","v":"Eau Claire County"},"Hospital Outpatient","F"]
[{"$f":"IF(COUNTIF($A$9:A1165,A1165)<24,A1165,A1165+1)","v":49},{"$f":"VLOOKUP(A1166,'Counties and Regions'!$G$3:$J$74,4,FALSE)","v":"Western"},{"$f":"VLOOKUP(A1166,'Counties and Regions'!$G$3:$J$74,3,FALSE)","v":"Eau Claire County"},"Hospital Outpatient","D"]
[{"$f":"IF(COUNTIF($A$9:A1166,A1166)<24,A1166,A1166+1)","v":49},{"$f":"VLOOKUP(A1167,'Counties and Regions'!$G$3:$J$74,4,FALSE)","v":"Western"},{"$f":"VLOOKUP(A1167,'Counties and Regions'!$G$3:$J$74,3,FALSE)","v":"Eau Claire County"},"Hospital Outpatient","B"]
[{"$f":"IF(COUNTIF($A$9:A1167,A1167)<24,A1167,A1167+1)","v":49},{"$f":"VLOOKUP(A1168,'Counties and Regions'!$G$3:$J$74,4,FALSE)","v":"Western"},{"$f":"VLOOKUP(A1168,'Counties and Regions'!$G$3:$J$74,3,FALSE)","v":"Eau Claire County"},"Hospital Outpatient","O"]
[{"$f":"IF(COUNTIF($A$9:A1168,A1168)<24,A1168,A1168+1)","v":49},{"$f":"VLOOKUP(A1169,'Counties and Regions'!$G$3:$J$74,4,FALSE)","v":"Western"},{"$f":"VLOOKUP(A1169,'Counties and Regions'!$G$3:$J$74,3,FALSE)","v":"Eau Claire County"},"Other Facility","F"]
[{"$f":"IF(COUNTIF($A$9:A1169,A1169)<24,A1169,A1169+1)","v":49},{"$f":"VLOOKUP(A1170,'Counties and Regions'!$G$3:$J$74,4,FALSE)","v":"Western"},{"$f":"VLOOKUP(A1170,'Counties and Regions'!$G$3:$J$74,3,FALSE)","v":"Eau Claire County"},"Other Facility","D"]
[{"$f":"IF(COUNTIF($A$9:A1170,A1170)<24,A1170,A1170+1)","v":49},{"$f":"VLOOKUP(A1171,'Counties and Regions'!$G$3:$J$74,4,FALSE)","v":"Western"},{"$f":"VLOOKUP(A1171,'Counties and Regions'!$G$3:$J$74,3,FALSE)","v":"Eau Claire County"},"Other Facility","B"]
[{"$f":"IF(COUNTIF($A$9:A1171,A1171)<24,A1171,A1171+1)","v":49},{"$f":"VLOOKUP(A1172,'Counties and Regions'!$G$3:$J$74,4,FALSE)","v":"Western"},{"$f":"VLOOKUP(A1172,'Counties and Regions'!$G$3:$J$74,3,FALSE)","v":"Eau Claire County"},"Other Facility","O"]
[{"$f":"IF(COUNTIF($A$9:A1172,A1172)<24,A1172,A1172+1)","v":49},{"$f":"VLOOKUP(A1173,'Counties and Regions'!$G$3:$J$74,4,FALSE)","v":"Western"},{"$f":"VLOOKUP(A1173,'Counties and Regions'!$G$3:$J$74,3,FALSE)","v":"Eau Claire County"},"Physician Services","F"]
[{"$f":"IF(COUNTIF($A$9:A1173,A1173)<24,A1173,A1173+1)","v":49},{"$f":"VLOOKUP(A1174,'Counties and Regions'!$G$3:$J$74,4,FALSE)","v":"Western"},{"$f":"VLOOKUP(A1174,'Counties and Regions'!$G$3:$J$74,3,FALSE)","v":"Eau Claire County"},"Physician Services","D"]
[{"$f":"IF(COUNTIF($A$9:A1174,A1174)<24,A1174,A1174+1)","v":49},{"$f":"VLOOKUP(A1175,'Counties and Regions'!$G$3:$J$74,4,FALSE)","v":"Western"},{"$f":"VLOOKUP(A1175,'Counties and Regions'!$G$3:$J$74,3,FALSE)","v":"Eau Claire County"},"Physician Services","B"]
[{"$f":"IF(COUNTIF($A$9:A1175,A1175)<24,A1175,A1175+1)","v":49},{"$f":"VLOOKUP(A1176,'Counties and Regions'!$G$3:$J$74,4,FALSE)","v":"Western"},{"$f":"VLOOKUP(A1176,'Counties and Regions'!$G$3:$J$74,3,FALSE)","v":"Eau Claire County"},"Physician Services","O"]
[{"$f":"IF(COUNTIF($A$9:A1176,A1176)<24,A1176,A1176+1)","v":49},{"$f":"VLOOKUP(A1177,'Counties and Regions'!$G$3:$J$74,4,FALSE)","v":"Western"},{"$f":"VLOOKUP(A1177,'Counties and Regions'!$G$3:$J$74,3,FALSE)","v":"Eau Claire County"},"Other Services","F"]
[{"$f":"IF(COUNTIF($A$9:A1177,A1177)<24,A1177,A1177+1)","v":49},{"$f":"VLOOKUP(A1178,'Counties and Regions'!$G$3:$J$74,4,FALSE)","v":"Western"},{"$f":"VLOOKUP(A1178,'Counties and Regions'!$G$3:$J$74,3,FALSE)","v":"Eau Claire County"},"Other Services","D"]
[{"$f":"IF(COUNTIF($A$9:A1178,A1178)<24,A1178,A1178+1)","v":49},{"$f":"VLOOKUP(A1179,'Counties and Regions'!$G$3:$J$74,4,FALSE)","v":"Western"},{"$f":"VLOOKUP(A1179,'Counties and Regions'!$G$3:$J$74,3,FALSE)","v":"Eau Claire County"},"Other Services","B"]
[{"$f":"IF(COUNTIF($A$9:A1179,A1179)<24,A1179,A1179+1)","v":49},{"$f":"VLOOKUP(A1180,'Counties and Regions'!$G$3:$J$74,4,FALSE)","v":"Western"},{"$f":"VLOOKUP(A1180,'Counties and Regions'!$G$3:$J$74,3,FALSE)","v":"Eau Claire County"},"Other Services","O"]
[{"$f":"IF(COUNTIF($A$9:A1180,A1180)<24,A1180,A1180+1)","v":49},{"$f":"VLOOKUP(A1181,'Counties and Regions'!$G$3:$J$74,4,FALSE)","v":"Western"},{"$f":"VLOOKUP(A1181,'Counties and Regions'!$G$3:$J$74,3,FALSE)","v":"Eau Claire County"},"Additional Services","F"]
[{"$f":"IF(COUNTIF($A$9:A1181,A1181)<24,A1181,A1181+1)","v":49},{"$f":"VLOOKUP(A1182,'Counties and Regions'!$G$3:$J$74,4,FALSE)","v":"Western"},{"$f":"VLOOKUP(A1182,'Counties and Regions'!$G$3:$J$74,3,FALSE)","v":"Eau Claire County"},"Additional Services","D"]
[{"$f":"IF(COUNTIF($A$9:A1182,A1182)<24,A1182,A1182+1)","v":49},{"$f":"VLOOKUP(A1183,'Counties and Regions'!$G$3:$J$74,4,FALSE)","v":"Western"},{"$f":"VLOOKUP(A1183,'Counties and Regions'!$G$3:$J$74,3,FALSE)","v":"Eau Claire County"},"Additional Services","B"]
[{"$f":"IF(COUNTIF($A$9:A1183,A1183)<24,A1183,A1183+1)","v":49},{"$f":"VLOOKUP(A1184,'Counties and Regions'!$G$3:$J$74,4,FALSE)","v":"Western"},{"$f":"VLOOKUP(A1184,'Counties and Regions'!$G$3:$J$74,3,FALSE)","v":"Eau Claire County"},"Additional Services","O"]
[{"$f":"IF(COUNTIF($A$9:A1184,A1184)<24,A1184,A1184+1)","v":50},{"$f":"VLOOKUP(A1185,'Counties and Regions'!$G$3:$J$74,4,FALSE)","v":"Western"},{"$f":"VLOOKUP(A1185,'Counties and Regions'!$G$3:$J$74,3,FALSE)","v":"Jackson County"},"Hospital Inpatient","F"]
[{"$f":"IF(COUNTIF($A$9:A1185,A1185)<24,A1185,A1185+1)","v":50},{"$f":"VLOOKUP(A1186,'Counties and Regions'!$G$3:$J$74,4,FALSE)","v":"Western"},{"$f":"VLOOKUP(A1186,'Counties and Regions'!$G$3:$J$74,3,FALSE)","v":"Jackson County"},"Hospital Inpatient","D"]
[{"$f":"IF(COUNTIF($A$9:A1186,A1186)<24,A1186,A1186+1)","v":50},{"$f":"VLOOKUP(A1187,'Counties and Regions'!$G$3:$J$74,4,FALSE)","v":"Western"},{"$f":"VLOOKUP(A1187,'Counties and Regions'!$G$3:$J$74,3,FALSE)","v":"Jackson County"},"Hospital Inpatient","B"]
[{"$f":"IF(COUNTIF($A$9:A1187,A1187)<24,A1187,A1187+1)","v":50},{"$f":"VLOOKUP(A1188,'Counties and Regions'!$G$3:$J$74,4,FALSE)","v":"Western"},{"$f":"VLOOKUP(A1188,'Counties and Regions'!$G$3:$J$74,3,FALSE)","v":"Jackson County"},"Hospital Inpatient","O"]
[{"$f":"IF(COUNTIF($A$9:A1188,A1188)<24,A1188,A1188+1)","v":50},{"$f":"VLOOKUP(A1189,'Counties and Regions'!$G$3:$J$74,4,FALSE)","v":"Western"},{"$f":"VLOOKUP(A1189,'Counties and Regions'!$G$3:$J$74,3,FALSE)","v":"Jackson County"},"Hospital Outpatient","F"]
[{"$f":"IF(COUNTIF($A$9:A1189,A1189)<24,A1189,A1189+1)","v":50},{"$f":"VLOOKUP(A1190,'Counties and Regions'!$G$3:$J$74,4,FALSE)","v":"Western"},{"$f":"VLOOKUP(A1190,'Counties and Regions'!$G$3:$J$74,3,FALSE)","v":"Jackson County"},"Hospital Outpatient","D"]
[{"$f":"IF(COUNTIF($A$9:A1190,A1190)<24,A1190,A1190+1)","v":50},{"$f":"VLOOKUP(A1191,'Counties and Regions'!$G$3:$J$74,4,FALSE)","v":"Western"},{"$f":"VLOOKUP(A1191,'Counties and Regions'!$G$3:$J$74,3,FALSE)","v":"Jackson County"},"Hospital Outpatient","B"]
[{"$f":"IF(COUNTIF($A$9:A1191,A1191)<24,A1191,A1191+1)","v":50},{"$f":"VLOOKUP(A1192,'Counties and Regions'!$G$3:$J$74,4,FALSE)","v":"Western"},{"$f":"VLOOKUP(A1192,'Counties and Regions'!$G$3:$J$74,3,FALSE)","v":"Jackson County"},"Hospital Outpatient","O"]
[{"$f":"IF(COUNTIF($A$9:A1192,A1192)<24,A1192,A1192+1)","v":50},{"$f":"VLOOKUP(A1193,'Counties and Regions'!$G$3:$J$74,4,FALSE)","v":"Western"},{"$f":"VLOOKUP(A1193,'Counties and Regions'!$G$3:$J$74,3,FALSE)","v":"Jackson County"},"Other Facility","F"]
[{"$f":"IF(COUNTIF($A$9:A1193,A1193)<24,A1193,A1193+1)","v":50},{"$f":"VLOOKUP(A1194,'Counties and Regions'!$G$3:$J$74,4,FALSE)","v":"Western"},{"$f":"VLOOKUP(A1194,'Counties and Regions'!$G$3:$J$74,3,FALSE)","v":"Jackson County"},"Other Facility","D"]
[{"$f":"IF(COUNTIF($A$9:A1194,A1194)<24,A1194,A1194+1)","v":50},{"$f":"VLOOKUP(A1195,'Counties and Regions'!$G$3:$J$74,4,FALSE)","v":"Western"},{"$f":"VLOOKUP(A1195,'Counties and Regions'!$G$3:$J$74,3,FALSE)","v":"Jackson County"},"Other Facility","B"]
[{"$f":"IF(COUNTIF($A$9:A1195,A1195)<24,A1195,A1195+1)","v":50},{"$f":"VLOOKUP(A1196,'Counties and Regions'!$G$3:$J$74,4,FALSE)","v":"Western"},{"$f":"VLOOKUP(A1196,'Counties and Regions'!$G$3:$J$74,3,FALSE)","v":"Jackson County"},"Other Facility","O"]
[{"$f":"IF(COUNTIF($A$9:A1196,A1196)<24,A1196,A1196+1)","v":50},{"$f":"VLOOKUP(A1197,'Counties and Regions'!$G$3:$J$74,4,FALSE)","v":"Western"},{"$f":"VLOOKUP(A1197,'Counties and Regions'!$G$3:$J$74,3,FALSE)","v":"Jackson County"},"Physician Services","F"]
[{"$f":"IF(COUNTIF($A$9:A1197,A1197)<24,A1197,A1197+1)","v":50},{"$f":"VLOOKUP(A1198,'Counties and Regions'!$G$3:$J$74,4,FALSE)","v":"Western"},{"$f":"VLOOKUP(A1198,'Counties and Regions'!$G$3:$J$74,3,FALSE)","v":"Jackson County"},"Physician Services","D"]
[{"$f":"IF(COUNTIF($A$9:A1198,A1198)<24,A1198,A1198+1)","v":50},{"$f":"VLOOKUP(A1199,'Counties and Regions'!$G$3:$J$74,4,FALSE)","v":"Western"},{"$f":"VLOOKUP(A1199,'Counties and Regions'!$G$3:$J$74,3,FALSE)","v":"Jackson County"},"Physician Services","B"]
[{"$f":"IF(COUNTIF($A$9:A1199,A1199)<24,A1199,A1199+1)","v":50},{"$f":"VLOOKUP(A1200,'Counties and Regions'!$G$3:$J$74,4,FALSE)","v":"Western"},{"$f":"VLOOKUP(A1200,'Counties and Regions'!$G$3:$J$74,3,FALSE)","v":"Jackson County"},"Physician Services","O"]
[{"$f":"IF(COUNTIF($A$9:A1200,A1200)<24,A1200,A1200+1)","v":50},{"$f":"VLOOKUP(A1201,'Counties and Regions'!$G$3:$J$74,4,FALSE)","v":"Western"},{"$f":"VLOOKUP(A1201,'Counties and Regions'!$G$3:$J$74,3,FALSE)","v":"Jackson County"},"Other Services","F"]
[{"$f":"IF(COUNTIF($A$9:A1201,A1201)<24,A1201,A1201+1)","v":50},{"$f":"VLOOKUP(A1202,'Counties and Regions'!$G$3:$J$74,4,FALSE)","v":"Western"},{"$f":"VLOOKUP(A1202,'Counties and Regions'!$G$3:$J$74,3,FALSE)","v":"Jackson County"},"Other Services","D"]
[{"$f":"IF(COUNTIF($A$9:A1202,A1202)<24,A1202,A1202+1)","v":50},{"$f":"VLOOKUP(A1203,'Counties and Regions'!$G$3:$J$74,4,FALSE)","v":"Western"},{"$f":"VLOOKUP(A1203,'Counties and Regions'!$G$3:$J$74,3,FALSE)","v":"Jackson County"},"Other Services","B"]
[{"$f":"IF(COUNTIF($A$9:A1203,A1203)<24,A1203,A1203+1)","v":50},{"$f":"VLOOKUP(A1204,'Counties and Regions'!$G$3:$J$74,4,FALSE)","v":"Western"},{"$f":"VLOOKUP(A1204,'Counties and Regions'!$G$3:$J$74,3,FALSE)","v":"Jackson County"},"Other Services","O"]
[{"$f":"IF(COUNTIF($A$9:A1204,A1204)<24,A1204,A1204+1)","v":50},{"$f":"VLOOKUP(A1205,'Counties and Regions'!$G$3:$J$74,4,FALSE)","v":"Western"},{"$f":"VLOOKUP(A1205,'Counties and Regions'!$G$3:$J$74,3,FALSE)","v":"Jackson County"},"Additional Services","F"]
[{"$f":"IF(COUNTIF($A$9:A1205,A1205)<24,A1205,A1205+1)","v":50},{"$f":"VLOOKUP(A1206,'Counties and Regions'!$G$3:$J$74,4,FALSE)","v":"Western"},{"$f":"VLOOKUP(A1206,'Counties and Regions'!$G$3:$J$74,3,FALSE)","v":"Jackson County"},"Additional Services","D"]
[{"$f":"IF(COUNTIF($A$9:A1206,A1206)<24,A1206,A1206+1)","v":50},{"$f":"VLOOKUP(A1207,'Counties and Regions'!$G$3:$J$74,4,FALSE)","v":"Western"},{"$f":"VLOOKUP(A1207,'Counties and Regions'!$G$3:$J$74,3,FALSE)","v":"Jackson County"},"Additional Services","B"]
[{"$f":"IF(COUNTIF($A$9:A1207,A1207)<24,A1207,A1207+1)","v":50},{"$f":"VLOOKUP(A1208,'Counties and Regions'!$G$3:$J$74,4,FALSE)","v":"Western"},{"$f":"VLOOKUP(A1208,'Counties and Regions'!$G$3:$J$74,3,FALSE)","v":"Jackson County"},"Additional Services","O"]
[{"$f":"IF(COUNTIF($A$9:A1208,A1208)<24,A1208,A1208+1)","v":51},{"$f":"VLOOKUP(A1209,'Counties and Regions'!$G$3:$J$74,4,FALSE)","v":"Western"},{"$f":"VLOOKUP(A1209,'Counties and Regions'!$G$3:$J$74,3,FALSE)","v":"Pepin County"},"Hospital Inpatient","F"]
[{"$f":"IF(COUNTIF($A$9:A1209,A1209)<24,A1209,A1209+1)","v":51},{"$f":"VLOOKUP(A1210,'Counties and Regions'!$G$3:$J$74,4,FALSE)","v":"Western"},{"$f":"VLOOKUP(A1210,'Counties and Regions'!$G$3:$J$74,3,FALSE)","v":"Pepin County"},"Hospital Inpatient","D"]
[{"$f":"IF(COUNTIF($A$9:A1210,A1210)<24,A1210,A1210+1)","v":51},{"$f":"VLOOKUP(A1211,'Counties and Regions'!$G$3:$J$74,4,FALSE)","v":"Western"},{"$f":"VLOOKUP(A1211,'Counties and Regions'!$G$3:$J$74,3,FALSE)","v":"Pepin County"},"Hospital Inpatient","B"]
[{"$f":"IF(COUNTIF($A$9:A1211,A1211)<24,A1211,A1211+1)","v":51},{"$f":"VLOOKUP(A1212,'Counties and Regions'!$G$3:$J$74,4,FALSE)","v":"Western"},{"$f":"VLOOKUP(A1212,'Counties and Regions'!$G$3:$J$74,3,FALSE)","v":"Pepin County"},"Hospital Inpatient","O"]
[{"$f":"IF(COUNTIF($A$9:A1212,A1212)<24,A1212,A1212+1)","v":51},{"$f":"VLOOKUP(A1213,'Counties and Regions'!$G$3:$J$74,4,FALSE)","v":"Western"},{"$f":"VLOOKUP(A1213,'Counties and Regions'!$G$3:$J$74,3,FALSE)","v":"Pepin County"},"Hospital Outpatient","F"]
[{"$f":"IF(COUNTIF($A$9:A1213,A1213)<24,A1213,A1213+1)","v":51},{"$f":"VLOOKUP(A1214,'Counties and Regions'!$G$3:$J$74,4,FALSE)","v":"Western"},{"$f":"VLOOKUP(A1214,'Counties and Regions'!$G$3:$J$74,3,FALSE)","v":"Pepin County"},"Hospital Outpatient","D"]
[{"$f":"IF(COUNTIF($A$9:A1214,A1214)<24,A1214,A1214+1)","v":51},{"$f":"VLOOKUP(A1215,'Counties and Regions'!$G$3:$J$74,4,FALSE)","v":"Western"},{"$f":"VLOOKUP(A1215,'Counties and Regions'!$G$3:$J$74,3,FALSE)","v":"Pepin County"},"Hospital Outpatient","B"]
[{"$f":"IF(COUNTIF($A$9:A1215,A1215)<24,A1215,A1215+1)","v":51},{"$f":"VLOOKUP(A1216,'Counties and Regions'!$G$3:$J$74,4,FALSE)","v":"Western"},{"$f":"VLOOKUP(A1216,'Counties and Regions'!$G$3:$J$74,3,FALSE)","v":"Pepin County"},"Hospital Outpatient","O"]
[{"$f":"IF(COUNTIF($A$9:A1216,A1216)<24,A1216,A1216+1)","v":51},{"$f":"VLOOKUP(A1217,'Counties and Regions'!$G$3:$J$74,4,FALSE)","v":"Western"},{"$f":"VLOOKUP(A1217,'Counties and Regions'!$G$3:$J$74,3,FALSE)","v":"Pepin County"},"Other Facility","F"]
[{"$f":"IF(COUNTIF($A$9:A1217,A1217)<24,A1217,A1217+1)","v":51},{"$f":"VLOOKUP(A1218,'Counties and Regions'!$G$3:$J$74,4,FALSE)","v":"Western"},{"$f":"VLOOKUP(A1218,'Counties and Regions'!$G$3:$J$74,3,FALSE)","v":"Pepin County"},"Other Facility","D"]
[{"$f":"IF(COUNTIF($A$9:A1218,A1218)<24,A1218,A1218+1)","v":51},{"$f":"VLOOKUP(A1219,'Counties and Regions'!$G$3:$J$74,4,FALSE)","v":"Western"},{"$f":"VLOOKUP(A1219,'Counties and Regions'!$G$3:$J$74,3,FALSE)","v":"Pepin County"},"Other Facility","B"]
[{"$f":"IF(COUNTIF($A$9:A1219,A1219)<24,A1219,A1219+1)","v":51},{"$f":"VLOOKUP(A1220,'Counties and Regions'!$G$3:$J$74,4,FALSE)","v":"Western"},{"$f":"VLOOKUP(A1220,'Counties and Regions'!$G$3:$J$74,3,FALSE)","v":"Pepin County"},"Other Facility","O"]
[{"$f":"IF(COUNTIF($A$9:A1220,A1220)<24,A1220,A1220+1)","v":51},{"$f":"VLOOKUP(A1221,'Counties and Regions'!$G$3:$J$74,4,FALSE)","v":"Western"},{"$f":"VLOOKUP(A1221,'Counties and Regions'!$G$3:$J$74,3,FALSE)","v":"Pepin County"},"Physician Services","F"]
[{"$f":"IF(COUNTIF($A$9:A1221,A1221)<24,A1221,A1221+1)","v":51},{"$f":"VLOOKUP(A1222,'Counties and Regions'!$G$3:$J$74,4,FALSE)","v":"Western"},{"$f":"VLOOKUP(A1222,'Counties and Regions'!$G$3:$J$74,3,FALSE)","v":"Pepin County"},"Physician Services","D"]
[{"$f":"IF(COUNTIF($A$9:A1222,A1222)<24,A1222,A1222+1)","v":51},{"$f":"VLOOKUP(A1223,'Counties and Regions'!$G$3:$J$74,4,FALSE)","v":"Western"},{"$f":"VLOOKUP(A1223,'Counties and Regions'!$G$3:$J$74,3,FALSE)","v":"Pepin County"},"Physician Services","B"]
[{"$f":"IF(COUNTIF($A$9:A1223,A1223)<24,A1223,A1223+1)","v":51},{"$f":"VLOOKUP(A1224,'Counties and Regions'!$G$3:$J$74,4,FALSE)","v":"Western"},{"$f":"VLOOKUP(A1224,'Counties and Regions'!$G$3:$J$74,3,FALSE)","v":"Pepin County"},"Physician Services","O"]
[{"$f":"IF(COUNTIF($A$9:A1224,A1224)<24,A1224,A1224+1)","v":51},{"$f":"VLOOKUP(A1225,'Counties and Regions'!$G$3:$J$74,4,FALSE)","v":"Western"},{"$f":"VLOOKUP(A1225,'Counties and Regions'!$G$3:$J$74,3,FALSE)","v":"Pepin County"},"Other Services","F"]
[{"$f":"IF(COUNTIF($A$9:A1225,A1225)<24,A1225,A1225+1)","v":51},{"$f":"VLOOKUP(A1226,'Counties and Regions'!$G$3:$J$74,4,FALSE)","v":"Western"},{"$f":"VLOOKUP(A1226,'Counties and Regions'!$G$3:$J$74,3,FALSE)","v":"Pepin County"},"Other Services","D"]
[{"$f":"IF(COUNTIF($A$9:A1226,A1226)<24,A1226,A1226+1)","v":51},{"$f":"VLOOKUP(A1227,'Counties and Regions'!$G$3:$J$74,4,FALSE)","v":"Western"},{"$f":"VLOOKUP(A1227,'Counties and Regions'!$G$3:$J$74,3,FALSE)","v":"Pepin County"},"Other Services","B"]
[{"$f":"IF(COUNTIF($A$9:A1227,A1227)<24,A1227,A1227+1)","v":51},{"$f":"VLOOKUP(A1228,'Counties and Regions'!$G$3:$J$74,4,FALSE)","v":"Western"},{"$f":"VLOOKUP(A1228,'Counties and Regions'!$G$3:$J$74,3,FALSE)","v":"Pepin County"},"Other Services","O"]
[{"$f":"IF(COUNTIF($A$9:A1228,A1228)<24,A1228,A1228+1)","v":51},{"$f":"VLOOKUP(A1229,'Counties and Regions'!$G$3:$J$74,4,FALSE)","v":"Western"},{"$f":"VLOOKUP(A1229,'Counties and Regions'!$G$3:$J$74,3,FALSE)","v":"Pepin County"},"Additional Services","F"]
[{"$f":"IF(COUNTIF($A$9:A1229,A1229)<24,A1229,A1229+1)","v":51},{"$f":"VLOOKUP(A1230,'Counties and Regions'!$G$3:$J$74,4,FALSE)","v":"Western"},{"$f":"VLOOKUP(A1230,'Counties and Regions'!$G$3:$J$74,3,FALSE)","v":"Pepin County"},"Additional Services","D"]
[{"$f":"IF(COUNTIF($A$9:A1230,A1230)<24,A1230,A1230+1)","v":51},{"$f":"VLOOKUP(A1231,'Counties and Regions'!$G$3:$J$74,4,FALSE)","v":"Western"},{"$f":"VLOOKUP(A1231,'Counties and Regions'!$G$3:$J$74,3,FALSE)","v":"Pepin County"},"Additional Services","B"]
[{"$f":"IF(COUNTIF($A$9:A1231,A1231)<24,A1231,A1231+1)","v":51},{"$f":"VLOOKUP(A1232,'Counties and Regions'!$G$3:$J$74,4,FALSE)","v":"Western"},{"$f":"VLOOKUP(A1232,'Counties and Regions'!$G$3:$J$74,3,FALSE)","v":"Pepin County"},"Additional Services","O"]
[{"$f":"IF(COUNTIF($A$9:A1232,A1232)<24,A1232,A1232+1)","v":52},{"$f":"VLOOKUP(A1233,'Counties and Regions'!$G$3:$J$74,4,FALSE)","v":"Western"},{"$f":"VLOOKUP(A1233,'Counties and Regions'!$G$3:$J$74,3,FALSE)","v":"Pierce County"},"Hospital Inpatient","F"]
[{"$f":"IF(COUNTIF($A$9:A1233,A1233)<24,A1233,A1233+1)","v":52},{"$f":"VLOOKUP(A1234,'Counties and Regions'!$G$3:$J$74,4,FALSE)","v":"Western"},{"$f":"VLOOKUP(A1234,'Counties and Regions'!$G$3:$J$74,3,FALSE)","v":"Pierce County"},"Hospital Inpatient","D"]
[{"$f":"IF(COUNTIF($A$9:A1234,A1234)<24,A1234,A1234+1)","v":52},{"$f":"VLOOKUP(A1235,'Counties and Regions'!$G$3:$J$74,4,FALSE)","v":"Western"},{"$f":"VLOOKUP(A1235,'Counties and Regions'!$G$3:$J$74,3,FALSE)","v":"Pierce County"},"Hospital Inpatient","B"]
[{"$f":"IF(COUNTIF($A$9:A1235,A1235)<24,A1235,A1235+1)","v":52},{"$f":"VLOOKUP(A1236,'Counties and Regions'!$G$3:$J$74,4,FALSE)","v":"Western"},{"$f":"VLOOKUP(A1236,'Counties and Regions'!$G$3:$J$74,3,FALSE)","v":"Pierce County"},"Hospital Inpatient","O"]
[{"$f":"IF(COUNTIF($A$9:A1236,A1236)<24,A1236,A1236+1)","v":52},{"$f":"VLOOKUP(A1237,'Counties and Regions'!$G$3:$J$74,4,FALSE)","v":"Western"},{"$f":"VLOOKUP(A1237,'Counties and Regions'!$G$3:$J$74,3,FALSE)","v":"Pierce County"},"Hospital Outpatient","F"]
[{"$f":"IF(COUNTIF($A$9:A1237,A1237)<24,A1237,A1237+1)","v":52},{"$f":"VLOOKUP(A1238,'Counties and Regions'!$G$3:$J$74,4,FALSE)","v":"Western"},{"$f":"VLOOKUP(A1238,'Counties and Regions'!$G$3:$J$74,3,FALSE)","v":"Pierce County"},"Hospital Outpatient","D"]
[{"$f":"IF(COUNTIF($A$9:A1238,A1238)<24,A1238,A1238+1)","v":52},{"$f":"VLOOKUP(A1239,'Counties and Regions'!$G$3:$J$74,4,FALSE)","v":"Western"},{"$f":"VLOOKUP(A1239,'Counties and Regions'!$G$3:$J$74,3,FALSE)","v":"Pierce County"},"Hospital Outpatient","B"]
[{"$f":"IF(COUNTIF($A$9:A1239,A1239)<24,A1239,A1239+1)","v":52},{"$f":"VLOOKUP(A1240,'Counties and Regions'!$G$3:$J$74,4,FALSE)","v":"Western"},{"$f":"VLOOKUP(A1240,'Counties and Regions'!$G$3:$J$74,3,FALSE)","v":"Pierce County"},"Hospital Outpatient","O"]
[{"$f":"IF(COUNTIF($A$9:A1240,A1240)<24,A1240,A1240+1)","v":52},{"$f":"VLOOKUP(A1241,'Counties and Regions'!$G$3:$J$74,4,FALSE)","v":"Western"},{"$f":"VLOOKUP(A1241,'Counties and Regions'!$G$3:$J$74,3,FALSE)","v":"Pierce County"},"Other Facility","F"]
[{"$f":"IF(COUNTIF($A$9:A1241,A1241)<24,A1241,A1241+1)","v":52},{"$f":"VLOOKUP(A1242,'Counties and Regions'!$G$3:$J$74,4,FALSE)","v":"Western"},{"$f":"VLOOKUP(A1242,'Counties and Regions'!$G$3:$J$74,3,FALSE)","v":"Pierce County"},"Other Facility","D"]
[{"$f":"IF(COUNTIF($A$9:A1242,A1242)<24,A1242,A1242+1)","v":52},{"$f":"VLOOKUP(A1243,'Counties and Regions'!$G$3:$J$74,4,FALSE)","v":"Western"},{"$f":"VLOOKUP(A1243,'Counties and Regions'!$G$3:$J$74,3,FALSE)","v":"Pierce County"},"Other Facility","B"]
[{"$f":"IF(COUNTIF($A$9:A1243,A1243)<24,A1243,A1243+1)","v":52},{"$f":"VLOOKUP(A1244,'Counties and Regions'!$G$3:$J$74,4,FALSE)","v":"Western"},{"$f":"VLOOKUP(A1244,'Counties and Regions'!$G$3:$J$74,3,FALSE)","v":"Pierce County"},"Other Facility","O"]
[{"$f":"IF(COUNTIF($A$9:A1244,A1244)<24,A1244,A1244+1)","v":52},{"$f":"VLOOKUP(A1245,'Counties and Regions'!$G$3:$J$74,4,FALSE)","v":"Western"},{"$f":"VLOOKUP(A1245,'Counties and Regions'!$G$3:$J$74,3,FALSE)","v":"Pierce County"},"Physician Services","F"]
[{"$f":"IF(COUNTIF($A$9:A1245,A1245)<24,A1245,A1245+1)","v":52},{"$f":"VLOOKUP(A1246,'Counties and Regions'!$G$3:$J$74,4,FALSE)","v":"Western"},{"$f":"VLOOKUP(A1246,'Counties and Regions'!$G$3:$J$74,3,FALSE)","v":"Pierce County"},"Physician Services","D"]
[{"$f":"IF(COUNTIF($A$9:A1246,A1246)<24,A1246,A1246+1)","v":52},{"$f":"VLOOKUP(A1247,'Counties and Regions'!$G$3:$J$74,4,FALSE)","v":"Western"},{"$f":"VLOOKUP(A1247,'Counties and Regions'!$G$3:$J$74,3,FALSE)","v":"Pierce County"},"Physician Services","B"]
[{"$f":"IF(COUNTIF($A$9:A1247,A1247)<24,A1247,A1247+1)","v":52},{"$f":"VLOOKUP(A1248,'Counties and Regions'!$G$3:$J$74,4,FALSE)","v":"Western"},{"$f":"VLOOKUP(A1248,'Counties and Regions'!$G$3:$J$74,3,FALSE)","v":"Pierce County"},"Physician Services","O"]
[{"$f":"IF(COUNTIF($A$9:A1248,A1248)<24,A1248,A1248+1)","v":52},{"$f":"VLOOKUP(A1249,'Counties and Regions'!$G$3:$J$74,4,FALSE)","v":"Western"},{"$f":"VLOOKUP(A1249,'Counties and Regions'!$G$3:$J$74,3,FALSE)","v":"Pierce County"},"Other Services","F"]
[{"$f":"IF(COUNTIF($A$9:A1249,A1249)<24,A1249,A1249+1)","v":52},{"$f":"VLOOKUP(A1250,'Counties and Regions'!$G$3:$J$74,4,FALSE)","v":"Western"},{"$f":"VLOOKUP(A1250,'Counties and Regions'!$G$3:$J$74,3,FALSE)","v":"Pierce County"},"Other Services","D"]
[{"$f":"IF(COUNTIF($A$9:A1250,A1250)<24,A1250,A1250+1)","v":52},{"$f":"VLOOKUP(A1251,'Counties and Regions'!$G$3:$J$74,4,FALSE)","v":"Western"},{"$f":"VLOOKUP(A1251,'Counties and Regions'!$G$3:$J$74,3,FALSE)","v":"Pierce County"},"Other Services","B"]
[{"$f":"IF(COUNTIF($A$9:A1251,A1251)<24,A1251,A1251+1)","v":52},{"$f":"VLOOKUP(A1252,'Counties and Regions'!$G$3:$J$74,4,FALSE)","v":"Western"},{"$f":"VLOOKUP(A1252,'Counties and Regions'!$G$3:$J$74,3,FALSE)","v":"Pierce County"},"Other Services","O"]
[{"$f":"IF(COUNTIF($A$9:A1252,A1252)<24,A1252,A1252+1)","v":52},{"$f":"VLOOKUP(A1253,'Counties and Regions'!$G$3:$J$74,4,FALSE)","v":"Western"},{"$f":"VLOOKUP(A1253,'Counties and Regions'!$G$3:$J$74,3,FALSE)","v":"Pierce County"},"Additional Services","F"]
[{"$f":"IF(COUNTIF($A$9:A1253,A1253)<24,A1253,A1253+1)","v":52},{"$f":"VLOOKUP(A1254,'Counties and Regions'!$G$3:$J$74,4,FALSE)","v":"Western"},{"$f":"VLOOKUP(A1254,'Counties and Regions'!$G$3:$J$74,3,FALSE)","v":"Pierce County"},"Additional Services","D"]
[{"$f":"IF(COUNTIF($A$9:A1254,A1254)<24,A1254,A1254+1)","v":52},{"$f":"VLOOKUP(A1255,'Counties and Regions'!$G$3:$J$74,4,FALSE)","v":"Western"},{"$f":"VLOOKUP(A1255,'Counties and Regions'!$G$3:$J$74,3,FALSE)","v":"Pierce County"},"Additional Services","B"]
[{"$f":"IF(COUNTIF($A$9:A1255,A1255)<24,A1255,A1255+1)","v":52},{"$f":"VLOOKUP(A1256,'Counties and Regions'!$G$3:$J$74,4,FALSE)","v":"Western"},{"$f":"VLOOKUP(A1256,'Counties and Regions'!$G$3:$J$74,3,FALSE)","v":"Pierce County"},"Additional Services","O"]
[{"$f":"IF(COUNTIF($A$9:A1256,A1256)<24,A1256,A1256+1)","v":53},{"$f":"VLOOKUP(A1257,'Counties and Regions'!$G$3:$J$74,4,FALSE)","v":"Western"},{"$f":"VLOOKUP(A1257,'Counties and Regions'!$G$3:$J$74,3,FALSE)","v":"Polk County"},"Hospital Inpatient","F"]
[{"$f":"IF(COUNTIF($A$9:A1257,A1257)<24,A1257,A1257+1)","v":53},{"$f":"VLOOKUP(A1258,'Counties and Regions'!$G$3:$J$74,4,FALSE)","v":"Western"},{"$f":"VLOOKUP(A1258,'Counties and Regions'!$G$3:$J$74,3,FALSE)","v":"Polk County"},"Hospital Inpatient","D"]
[{"$f":"IF(COUNTIF($A$9:A1258,A1258)<24,A1258,A1258+1)","v":53},{"$f":"VLOOKUP(A1259,'Counties and Regions'!$G$3:$J$74,4,FALSE)","v":"Western"},{"$f":"VLOOKUP(A1259,'Counties and Regions'!$G$3:$J$74,3,FALSE)","v":"Polk County"},"Hospital Inpatient","B"]
[{"$f":"IF(COUNTIF($A$9:A1259,A1259)<24,A1259,A1259+1)","v":53},{"$f":"VLOOKUP(A1260,'Counties and Regions'!$G$3:$J$74,4,FALSE)","v":"Western"},{"$f":"VLOOKUP(A1260,'Counties and Regions'!$G$3:$J$74,3,FALSE)","v":"Polk County"},"Hospital Inpatient","O"]
[{"$f":"IF(COUNTIF($A$9:A1260,A1260)<24,A1260,A1260+1)","v":53},{"$f":"VLOOKUP(A1261,'Counties and Regions'!$G$3:$J$74,4,FALSE)","v":"Western"},{"$f":"VLOOKUP(A1261,'Counties and Regions'!$G$3:$J$74,3,FALSE)","v":"Polk County"},"Hospital Outpatient","F"]
[{"$f":"IF(COUNTIF($A$9:A1261,A1261)<24,A1261,A1261+1)","v":53},{"$f":"VLOOKUP(A1262,'Counties and Regions'!$G$3:$J$74,4,FALSE)","v":"Western"},{"$f":"VLOOKUP(A1262,'Counties and Regions'!$G$3:$J$74,3,FALSE)","v":"Polk County"},"Hospital Outpatient","D"]
[{"$f":"IF(COUNTIF($A$9:A1262,A1262)<24,A1262,A1262+1)","v":53},{"$f":"VLOOKUP(A1263,'Counties and Regions'!$G$3:$J$74,4,FALSE)","v":"Western"},{"$f":"VLOOKUP(A1263,'Counties and Regions'!$G$3:$J$74,3,FALSE)","v":"Polk County"},"Hospital Outpatient","B"]
[{"$f":"IF(COUNTIF($A$9:A1263,A1263)<24,A1263,A1263+1)","v":53},{"$f":"VLOOKUP(A1264,'Counties and Regions'!$G$3:$J$74,4,FALSE)","v":"Western"},{"$f":"VLOOKUP(A1264,'Counties and Regions'!$G$3:$J$74,3,FALSE)","v":"Polk County"},"Hospital Outpatient","O"]
[{"$f":"IF(COUNTIF($A$9:A1264,A1264)<24,A1264,A1264+1)","v":53},{"$f":"VLOOKUP(A1265,'Counties and Regions'!$G$3:$J$74,4,FALSE)","v":"Western"},{"$f":"VLOOKUP(A1265,'Counties and Regions'!$G$3:$J$74,3,FALSE)","v":"Polk County"},"Other Facility","F"]
[{"$f":"IF(COUNTIF($A$9:A1265,A1265)<24,A1265,A1265+1)","v":53},{"$f":"VLOOKUP(A1266,'Counties and Regions'!$G$3:$J$74,4,FALSE)","v":"Western"},{"$f":"VLOOKUP(A1266,'Counties and Regions'!$G$3:$J$74,3,FALSE)","v":"Polk County"},"Other Facility","D"]
[{"$f":"IF(COUNTIF($A$9:A1266,A1266)<24,A1266,A1266+1)","v":53},{"$f":"VLOOKUP(A1267,'Counties and Regions'!$G$3:$J$74,4,FALSE)","v":"Western"},{"$f":"VLOOKUP(A1267,'Counties and Regions'!$G$3:$J$74,3,FALSE)","v":"Polk County"},"Other Facility","B"]
[{"$f":"IF(COUNTIF($A$9:A1267,A1267)<24,A1267,A1267+1)","v":53},{"$f":"VLOOKUP(A1268,'Counties and Regions'!$G$3:$J$74,4,FALSE)","v":"Western"},{"$f":"VLOOKUP(A1268,'Counties and Regions'!$G$3:$J$74,3,FALSE)","v":"Polk County"},"Other Facility","O"]
[{"$f":"IF(COUNTIF($A$9:A1268,A1268)<24,A1268,A1268+1)","v":53},{"$f":"VLOOKUP(A1269,'Counties and Regions'!$G$3:$J$74,4,FALSE)","v":"Western"},{"$f":"VLOOKUP(A1269,'Counties and Regions'!$G$3:$J$74,3,FALSE)","v":"Polk County"},"Physician Services","F"]
[{"$f":"IF(COUNTIF($A$9:A1269,A1269)<24,A1269,A1269+1)","v":53},{"$f":"VLOOKUP(A1270,'Counties and Regions'!$G$3:$J$74,4,FALSE)","v":"Western"},{"$f":"VLOOKUP(A1270,'Counties and Regions'!$G$3:$J$74,3,FALSE)","v":"Polk County"},"Physician Services","D"]
[{"$f":"IF(COUNTIF($A$9:A1270,A1270)<24,A1270,A1270+1)","v":53},{"$f":"VLOOKUP(A1271,'Counties and Regions'!$G$3:$J$74,4,FALSE)","v":"Western"},{"$f":"VLOOKUP(A1271,'Counties and Regions'!$G$3:$J$74,3,FALSE)","v":"Polk County"},"Physician Services","B"]
[{"$f":"IF(COUNTIF($A$9:A1271,A1271)<24,A1271,A1271+1)","v":53},{"$f":"VLOOKUP(A1272,'Counties and Regions'!$G$3:$J$74,4,FALSE)","v":"Western"},{"$f":"VLOOKUP(A1272,'Counties and Regions'!$G$3:$J$74,3,FALSE)","v":"Polk County"},"Physician Services","O"]
[{"$f":"IF(COUNTIF($A$9:A1272,A1272)<24,A1272,A1272+1)","v":53},{"$f":"VLOOKUP(A1273,'Counties and Regions'!$G$3:$J$74,4,FALSE)","v":"Western"},{"$f":"VLOOKUP(A1273,'Counties and Regions'!$G$3:$J$74,3,FALSE)","v":"Polk County"},"Other Services","F"]
[{"$f":"IF(COUNTIF($A$9:A1273,A1273)<24,A1273,A1273+1)","v":53},{"$f":"VLOOKUP(A1274,'Counties and Regions'!$G$3:$J$74,4,FALSE)","v":"Western"},{"$f":"VLOOKUP(A1274,'Counties and Regions'!$G$3:$J$74,3,FALSE)","v":"Polk County"},"Other Services","D"]
[{"$f":"IF(COUNTIF($A$9:A1274,A1274)<24,A1274,A1274+1)","v":53},{"$f":"VLOOKUP(A1275,'Counties and Regions'!$G$3:$J$74,4,FALSE)","v":"Western"},{"$f":"VLOOKUP(A1275,'Counties and Regions'!$G$3:$J$74,3,FALSE)","v":"Polk County"},"Other Services","B"]
[{"$f":"IF(COUNTIF($A$9:A1275,A1275)<24,A1275,A1275+1)","v":53},{"$f":"VLOOKUP(A1276,'Counties and Regions'!$G$3:$J$74,4,FALSE)","v":"Western"},{"$f":"VLOOKUP(A1276,'Counties and Regions'!$G$3:$J$74,3,FALSE)","v":"Polk County"},"Other Services","O"]
[{"$f":"IF(COUNTIF($A$9:A1276,A1276)<24,A1276,A1276+1)","v":53},{"$f":"VLOOKUP(A1277,'Counties and Regions'!$G$3:$J$74,4,FALSE)","v":"Western"},{"$f":"VLOOKUP(A1277,'Counties and Regions'!$G$3:$J$74,3,FALSE)","v":"Polk County"},"Additional Services","F"]
[{"$f":"IF(COUNTIF($A$9:A1277,A1277)<24,A1277,A1277+1)","v":53},{"$f":"VLOOKUP(A1278,'Counties and Regions'!$G$3:$J$74,4,FALSE)","v":"Western"},{"$f":"VLOOKUP(A1278,'Counties and Regions'!$G$3:$J$74,3,FALSE)","v":"Polk County"},"Additional Services","D"]
[{"$f":"IF(COUNTIF($A$9:A1278,A1278)<24,A1278,A1278+1)","v":53},{"$f":"VLOOKUP(A1279,'Counties and Regions'!$G$3:$J$74,4,FALSE)","v":"Western"},{"$f":"VLOOKUP(A1279,'Counties and Regions'!$G$3:$J$74,3,FALSE)","v":"Polk County"},"Additional Services","B"]
[{"$f":"IF(COUNTIF($A$9:A1279,A1279)<24,A1279,A1279+1)","v":53},{"$f":"VLOOKUP(A1280,'Counties and Regions'!$G$3:$J$74,4,FALSE)","v":"Western"},{"$f":"VLOOKUP(A1280,'Counties and Regions'!$G$3:$J$74,3,FALSE)","v":"Polk County"},"Additional Services","O"]
[{"$f":"IF(COUNTIF($A$9:A1280,A1280)<24,A1280,A1280+1)","v":54},{"$f":"VLOOKUP(A1281,'Counties and Regions'!$G$3:$J$74,4,FALSE)","v":"Western"},{"$f":"VLOOKUP(A1281,'Counties and Regions'!$G$3:$J$74,3,FALSE)","v":"Rusk County"},"Hospital Inpatient","F"]
[{"$f":"IF(COUNTIF($A$9:A1281,A1281)<24,A1281,A1281+1)","v":54},{"$f":"VLOOKUP(A1282,'Counties and Regions'!$G$3:$J$74,4,FALSE)","v":"Western"},{"$f":"VLOOKUP(A1282,'Counties and Regions'!$G$3:$J$74,3,FALSE)","v":"Rusk County"},"Hospital Inpatient","D"]
[{"$f":"IF(COUNTIF($A$9:A1282,A1282)<24,A1282,A1282+1)","v":54},{"$f":"VLOOKUP(A1283,'Counties and Regions'!$G$3:$J$74,4,FALSE)","v":"Western"},{"$f":"VLOOKUP(A1283,'Counties and Regions'!$G$3:$J$74,3,FALSE)","v":"Rusk County"},"Hospital Inpatient","B"]
[{"$f":"IF(COUNTIF($A$9:A1283,A1283)<24,A1283,A1283+1)","v":54},{"$f":"VLOOKUP(A1284,'Counties and Regions'!$G$3:$J$74,4,FALSE)","v":"Western"},{"$f":"VLOOKUP(A1284,'Counties and Regions'!$G$3:$J$74,3,FALSE)","v":"Rusk County"},"Hospital Inpatient","O"]
[{"$f":"IF(COUNTIF($A$9:A1284,A1284)<24,A1284,A1284+1)","v":54},{"$f":"VLOOKUP(A1285,'Counties and Regions'!$G$3:$J$74,4,FALSE)","v":"Western"},{"$f":"VLOOKUP(A1285,'Counties and Regions'!$G$3:$J$74,3,FALSE)","v":"Rusk County"},"Hospital Outpatient","F"]
[{"$f":"IF(COUNTIF($A$9:A1285,A1285)<24,A1285,A1285+1)","v":54},{"$f":"VLOOKUP(A1286,'Counties and Regions'!$G$3:$J$74,4,FALSE)","v":"Western"},{"$f":"VLOOKUP(A1286,'Counties and Regions'!$G$3:$J$74,3,FALSE)","v":"Rusk County"},"Hospital Outpatient","D"]
[{"$f":"IF(COUNTIF($A$9:A1286,A1286)<24,A1286,A1286+1)","v":54},{"$f":"VLOOKUP(A1287,'Counties and Regions'!$G$3:$J$74,4,FALSE)","v":"Western"},{"$f":"VLOOKUP(A1287,'Counties and Regions'!$G$3:$J$74,3,FALSE)","v":"Rusk County"},"Hospital Outpatient","B"]
[{"$f":"IF(COUNTIF($A$9:A1287,A1287)<24,A1287,A1287+1)","v":54},{"$f":"VLOOKUP(A1288,'Counties and Regions'!$G$3:$J$74,4,FALSE)","v":"Western"},{"$f":"VLOOKUP(A1288,'Counties and Regions'!$G$3:$J$74,3,FALSE)","v":"Rusk County"},"Hospital Outpatient","O"]
[{"$f":"IF(COUNTIF($A$9:A1288,A1288)<24,A1288,A1288+1)","v":54},{"$f":"VLOOKUP(A1289,'Counties and Regions'!$G$3:$J$74,4,FALSE)","v":"Western"},{"$f":"VLOOKUP(A1289,'Counties and Regions'!$G$3:$J$74,3,FALSE)","v":"Rusk County"},"Other Facility","F"]
[{"$f":"IF(COUNTIF($A$9:A1289,A1289)<24,A1289,A1289+1)","v":54},{"$f":"VLOOKUP(A1290,'Counties and Regions'!$G$3:$J$74,4,FALSE)","v":"Western"},{"$f":"VLOOKUP(A1290,'Counties and Regions'!$G$3:$J$74,3,FALSE)","v":"Rusk County"},"Other Facility","D"]
[{"$f":"IF(COUNTIF($A$9:A1290,A1290)<24,A1290,A1290+1)","v":54},{"$f":"VLOOKUP(A1291,'Counties and Regions'!$G$3:$J$74,4,FALSE)","v":"Western"},{"$f":"VLOOKUP(A1291,'Counties and Regions'!$G$3:$J$74,3,FALSE)","v":"Rusk County"},"Other Facility","B"]
[{"$f":"IF(COUNTIF($A$9:A1291,A1291)<24,A1291,A1291+1)","v":54},{"$f":"VLOOKUP(A1292,'Counties and Regions'!$G$3:$J$74,4,FALSE)","v":"Western"},{"$f":"VLOOKUP(A1292,'Counties and Regions'!$G$3:$J$74,3,FALSE)","v":"Rusk County"},"Other Facility","O"]
[{"$f":"IF(COUNTIF($A$9:A1292,A1292)<24,A1292,A1292+1)","v":54},{"$f":"VLOOKUP(A1293,'Counties and Regions'!$G$3:$J$74,4,FALSE)","v":"Western"},{"$f":"VLOOKUP(A1293,'Counties and Regions'!$G$3:$J$74,3,FALSE)","v":"Rusk County"},"Physician Services","F"]
[{"$f":"IF(COUNTIF($A$9:A1293,A1293)<24,A1293,A1293+1)","v":54},{"$f":"VLOOKUP(A1294,'Counties and Regions'!$G$3:$J$74,4,FALSE)","v":"Western"},{"$f":"VLOOKUP(A1294,'Counties and Regions'!$G$3:$J$74,3,FALSE)","v":"Rusk County"},"Physician Services","D"]
[{"$f":"IF(COUNTIF($A$9:A1294,A1294)<24,A1294,A1294+1)","v":54},{"$f":"VLOOKUP(A1295,'Counties and Regions'!$G$3:$J$74,4,FALSE)","v":"Western"},{"$f":"VLOOKUP(A1295,'Counties and Regions'!$G$3:$J$74,3,FALSE)","v":"Rusk County"},"Physician Services","B"]
[{"$f":"IF(COUNTIF($A$9:A1295,A1295)<24,A1295,A1295+1)","v":54},{"$f":"VLOOKUP(A1296,'Counties and Regions'!$G$3:$J$74,4,FALSE)","v":"Western"},{"$f":"VLOOKUP(A1296,'Counties and Regions'!$G$3:$J$74,3,FALSE)","v":"Rusk County"},"Physician Services","O"]
[{"$f":"IF(COUNTIF($A$9:A1296,A1296)<24,A1296,A1296+1)","v":54},{"$f":"VLOOKUP(A1297,'Counties and Regions'!$G$3:$J$74,4,FALSE)","v":"Western"},{"$f":"VLOOKUP(A1297,'Counties and Regions'!$G$3:$J$74,3,FALSE)","v":"Rusk County"},"Other Services","F"]
[{"$f":"IF(COUNTIF($A$9:A1297,A1297)<24,A1297,A1297+1)","v":54},{"$f":"VLOOKUP(A1298,'Counties and Regions'!$G$3:$J$74,4,FALSE)","v":"Western"},{"$f":"VLOOKUP(A1298,'Counties and Regions'!$G$3:$J$74,3,FALSE)","v":"Rusk County"},"Other Services","D"]
[{"$f":"IF(COUNTIF($A$9:A1298,A1298)<24,A1298,A1298+1)","v":54},{"$f":"VLOOKUP(A1299,'Counties and Regions'!$G$3:$J$74,4,FALSE)","v":"Western"},{"$f":"VLOOKUP(A1299,'Counties and Regions'!$G$3:$J$74,3,FALSE)","v":"Rusk County"},"Other Services","B"]
[{"$f":"IF(COUNTIF($A$9:A1299,A1299)<24,A1299,A1299+1)","v":54},{"$f":"VLOOKUP(A1300,'Counties and Regions'!$G$3:$J$74,4,FALSE)","v":"Western"},{"$f":"VLOOKUP(A1300,'Counties and Regions'!$G$3:$J$74,3,FALSE)","v":"Rusk County"},"Other Services","O"]
[{"$f":"IF(COUNTIF($A$9:A1300,A1300)<24,A1300,A1300+1)","v":54},{"$f":"VLOOKUP(A1301,'Counties and Regions'!$G$3:$J$74,4,FALSE)","v":"Western"},{"$f":"VLOOKUP(A1301,'Counties and Regions'!$G$3:$J$74,3,FALSE)","v":"Rusk County"},"Additional Services","F"]
[{"$f":"IF(COUNTIF($A$9:A1301,A1301)<24,A1301,A1301+1)","v":54},{"$f":"VLOOKUP(A1302,'Counties and Regions'!$G$3:$J$74,4,FALSE)","v":"Western"},{"$f":"VLOOKUP(A1302,'Counties and Regions'!$G$3:$J$74,3,FALSE)","v":"Rusk County"},"Additional Services","D"]
[{"$f":"IF(COUNTIF($A$9:A1302,A1302)<24,A1302,A1302+1)","v":54},{"$f":"VLOOKUP(A1303,'Counties and Regions'!$G$3:$J$74,4,FALSE)","v":"Western"},{"$f":"VLOOKUP(A1303,'Counties and Regions'!$G$3:$J$74,3,FALSE)","v":"Rusk County"},"Additional Services","B"]
[{"$f":"IF(COUNTIF($A$9:A1303,A1303)<24,A1303,A1303+1)","v":54},{"$f":"VLOOKUP(A1304,'Counties and Regions'!$G$3:$J$74,4,FALSE)","v":"Western"},{"$f":"VLOOKUP(A1304,'Counties and Regions'!$G$3:$J$74,3,FALSE)","v":"Rusk County"},"Additional Services","O"]
[{"$f":"IF(COUNTIF($A$9:A1304,A1304)<24,A1304,A1304+1)","v":55},{"$f":"VLOOKUP(A1305,'Counties and Regions'!$G$3:$J$74,4,FALSE)","v":"Western"},{"$f":"VLOOKUP(A1305,'Counties and Regions'!$G$3:$J$74,3,FALSE)","v":"St. Croix County"},"Hospital Inpatient","F"]
[{"$f":"IF(COUNTIF($A$9:A1305,A1305)<24,A1305,A1305+1)","v":55},{"$f":"VLOOKUP(A1306,'Counties and Regions'!$G$3:$J$74,4,FALSE)","v":"Western"},{"$f":"VLOOKUP(A1306,'Counties and Regions'!$G$3:$J$74,3,FALSE)","v":"St. Croix County"},"Hospital Inpatient","D"]
[{"$f":"IF(COUNTIF($A$9:A1306,A1306)<24,A1306,A1306+1)","v":55},{"$f":"VLOOKUP(A1307,'Counties and Regions'!$G$3:$J$74,4,FALSE)","v":"Western"},{"$f":"VLOOKUP(A1307,'Counties and Regions'!$G$3:$J$74,3,FALSE)","v":"St. Croix County"},"Hospital Inpatient","B"]
[{"$f":"IF(COUNTIF($A$9:A1307,A1307)<24,A1307,A1307+1)","v":55},{"$f":"VLOOKUP(A1308,'Counties and Regions'!$G$3:$J$74,4,FALSE)","v":"Western"},{"$f":"VLOOKUP(A1308,'Counties and Regions'!$G$3:$J$74,3,FALSE)","v":"St. Croix County"},"Hospital Inpatient","O"]
[{"$f":"IF(COUNTIF($A$9:A1308,A1308)<24,A1308,A1308+1)","v":55},{"$f":"VLOOKUP(A1309,'Counties and Regions'!$G$3:$J$74,4,FALSE)","v":"Western"},{"$f":"VLOOKUP(A1309,'Counties and Regions'!$G$3:$J$74,3,FALSE)","v":"St. Croix County"},"Hospital Outpatient","F"]
[{"$f":"IF(COUNTIF($A$9:A1309,A1309)<24,A1309,A1309+1)","v":55},{"$f":"VLOOKUP(A1310,'Counties and Regions'!$G$3:$J$74,4,FALSE)","v":"Western"},{"$f":"VLOOKUP(A1310,'Counties and Regions'!$G$3:$J$74,3,FALSE)","v":"St. Croix County"},"Hospital Outpatient","D"]
[{"$f":"IF(COUNTIF($A$9:A1310,A1310)<24,A1310,A1310+1)","v":55},{"$f":"VLOOKUP(A1311,'Counties and Regions'!$G$3:$J$74,4,FALSE)","v":"Western"},{"$f":"VLOOKUP(A1311,'Counties and Regions'!$G$3:$J$74,3,FALSE)","v":"St. Croix County"},"Hospital Outpatient","B"]
[{"$f":"IF(COUNTIF($A$9:A1311,A1311)<24,A1311,A1311+1)","v":55},{"$f":"VLOOKUP(A1312,'Counties and Regions'!$G$3:$J$74,4,FALSE)","v":"Western"},{"$f":"VLOOKUP(A1312,'Counties and Regions'!$G$3:$J$74,3,FALSE)","v":"St. Croix County"},"Hospital Outpatient","O"]
[{"$f":"IF(COUNTIF($A$9:A1312,A1312)<24,A1312,A1312+1)","v":55},{"$f":"VLOOKUP(A1313,'Counties and Regions'!$G$3:$J$74,4,FALSE)","v":"Western"},{"$f":"VLOOKUP(A1313,'Counties and Regions'!$G$3:$J$74,3,FALSE)","v":"St. Croix County"},"Other Facility","F"]
[{"$f":"IF(COUNTIF($A$9:A1313,A1313)<24,A1313,A1313+1)","v":55},{"$f":"VLOOKUP(A1314,'Counties and Regions'!$G$3:$J$74,4,FALSE)","v":"Western"},{"$f":"VLOOKUP(A1314,'Counties and Regions'!$G$3:$J$74,3,FALSE)","v":"St. Croix County"},"Other Facility","D"]
[{"$f":"IF(COUNTIF($A$9:A1314,A1314)<24,A1314,A1314+1)","v":55},{"$f":"VLOOKUP(A1315,'Counties and Regions'!$G$3:$J$74,4,FALSE)","v":"Western"},{"$f":"VLOOKUP(A1315,'Counties and Regions'!$G$3:$J$74,3,FALSE)","v":"St. Croix County"},"Other Facility","B"]
[{"$f":"IF(COUNTIF($A$9:A1315,A1315)<24,A1315,A1315+1)","v":55},{"$f":"VLOOKUP(A1316,'Counties and Regions'!$G$3:$J$74,4,FALSE)","v":"Western"},{"$f":"VLOOKUP(A1316,'Counties and Regions'!$G$3:$J$74,3,FALSE)","v":"St. Croix County"},"Other Facility","O"]
[{"$f":"IF(COUNTIF($A$9:A1316,A1316)<24,A1316,A1316+1)","v":55},{"$f":"VLOOKUP(A1317,'Counties and Regions'!$G$3:$J$74,4,FALSE)","v":"Western"},{"$f":"VLOOKUP(A1317,'Counties and Regions'!$G$3:$J$74,3,FALSE)","v":"St. Croix County"},"Physician Services","F"]
[{"$f":"IF(COUNTIF($A$9:A1317,A1317)<24,A1317,A1317+1)","v":55},{"$f":"VLOOKUP(A1318,'Counties and Regions'!$G$3:$J$74,4,FALSE)","v":"Western"},{"$f":"VLOOKUP(A1318,'Counties and Regions'!$G$3:$J$74,3,FALSE)","v":"St. Croix County"},"Physician Services","D"]
[{"$f":"IF(COUNTIF($A$9:A1318,A1318)<24,A1318,A1318+1)","v":55},{"$f":"VLOOKUP(A1319,'Counties and Regions'!$G$3:$J$74,4,FALSE)","v":"Western"},{"$f":"VLOOKUP(A1319,'Counties and Regions'!$G$3:$J$74,3,FALSE)","v":"St. Croix County"},"Physician Services","B"]
[{"$f":"IF(COUNTIF($A$9:A1319,A1319)<24,A1319,A1319+1)","v":55},{"$f":"VLOOKUP(A1320,'Counties and Regions'!$G$3:$J$74,4,FALSE)","v":"Western"},{"$f":"VLOOKUP(A1320,'Counties and Regions'!$G$3:$J$74,3,FALSE)","v":"St. Croix County"},"Physician Services","O"]
[{"$f":"IF(COUNTIF($A$9:A1320,A1320)<24,A1320,A1320+1)","v":55},{"$f":"VLOOKUP(A1321,'Counties and Regions'!$G$3:$J$74,4,FALSE)","v":"Western"},{"$f":"VLOOKUP(A1321,'Counties and Regions'!$G$3:$J$74,3,FALSE)","v":"St. Croix County"},"Other Services","F"]
[{"$f":"IF(COUNTIF($A$9:A1321,A1321)<24,A1321,A1321+1)","v":55},{"$f":"VLOOKUP(A1322,'Counties and Regions'!$G$3:$J$74,4,FALSE)","v":"Western"},{"$f":"VLOOKUP(A1322,'Counties and Regions'!$G$3:$J$74,3,FALSE)","v":"St. Croix County"},"Other Services","D"]
[{"$f":"IF(COUNTIF($A$9:A1322,A1322)<24,A1322,A1322+1)","v":55},{"$f":"VLOOKUP(A1323,'Counties and Regions'!$G$3:$J$74,4,FALSE)","v":"Western"},{"$f":"VLOOKUP(A1323,'Counties and Regions'!$G$3:$J$74,3,FALSE)","v":"St. Croix County"},"Other Services","B"]
[{"$f":"IF(COUNTIF($A$9:A1323,A1323)<24,A1323,A1323+1)","v":55},{"$f":"VLOOKUP(A1324,'Counties and Regions'!$G$3:$J$74,4,FALSE)","v":"Western"},{"$f":"VLOOKUP(A1324,'Counties and Regions'!$G$3:$J$74,3,FALSE)","v":"St. Croix County"},"Other Services","O"]
[{"$f":"IF(COUNTIF($A$9:A1324,A1324)<24,A1324,A1324+1)","v":55},{"$f":"VLOOKUP(A1325,'Counties and Regions'!$G$3:$J$74,4,FALSE)","v":"Western"},{"$f":"VLOOKUP(A1325,'Counties and Regions'!$G$3:$J$74,3,FALSE)","v":"St. Croix County"},"Additional Services","F"]
[{"$f":"IF(COUNTIF($A$9:A1325,A1325)<24,A1325,A1325+1)","v":55},{"$f":"VLOOKUP(A1326,'Counties and Regions'!$G$3:$J$74,4,FALSE)","v":"Western"},{"$f":"VLOOKUP(A1326,'Counties and Regions'!$G$3:$J$74,3,FALSE)","v":"St. Croix County"},"Additional Services","D"]
[{"$f":"IF(COUNTIF($A$9:A1326,A1326)<24,A1326,A1326+1)","v":55},{"$f":"VLOOKUP(A1327,'Counties and Regions'!$G$3:$J$74,4,FALSE)","v":"Western"},{"$f":"VLOOKUP(A1327,'Counties and Regions'!$G$3:$J$74,3,FALSE)","v":"St. Croix County"},"Additional Services","B"]
[{"$f":"IF(COUNTIF($A$9:A1327,A1327)<24,A1327,A1327+1)","v":55},{"$f":"VLOOKUP(A1328,'Counties and Regions'!$G$3:$J$74,4,FALSE)","v":"Western"},{"$f":"VLOOKUP(A1328,'Counties and Regions'!$G$3:$J$74,3,FALSE)","v":"St. Croix County"},"Additional Services","O"]
[{"$f":"IF(COUNTIF($A$9:A1328,A1328)<24,A1328,A1328+1)","v":56},{"$f":"VLOOKUP(A1329,'Counties and Regions'!$G$3:$J$74,4,FALSE)","v":"Western"},{"$f":"VLOOKUP(A1329,'Counties and Regions'!$G$3:$J$74,3,FALSE)","v":"Trempealeau County"},"Hospital Inpatient","F"]
[{"$f":"IF(COUNTIF($A$9:A1329,A1329)<24,A1329,A1329+1)","v":56},{"$f":"VLOOKUP(A1330,'Counties and Regions'!$G$3:$J$74,4,FALSE)","v":"Western"},{"$f":"VLOOKUP(A1330,'Counties and Regions'!$G$3:$J$74,3,FALSE)","v":"Trempealeau County"},"Hospital Inpatient","D"]
[{"$f":"IF(COUNTIF($A$9:A1330,A1330)<24,A1330,A1330+1)","v":56},{"$f":"VLOOKUP(A1331,'Counties and Regions'!$G$3:$J$74,4,FALSE)","v":"Western"},{"$f":"VLOOKUP(A1331,'Counties and Regions'!$G$3:$J$74,3,FALSE)","v":"Trempealeau County"},"Hospital Inpatient","B"]
[{"$f":"IF(COUNTIF($A$9:A1331,A1331)<24,A1331,A1331+1)","v":56},{"$f":"VLOOKUP(A1332,'Counties and Regions'!$G$3:$J$74,4,FALSE)","v":"Western"},{"$f":"VLOOKUP(A1332,'Counties and Regions'!$G$3:$J$74,3,FALSE)","v":"Trempealeau County"},"Hospital Inpatient","O"]
[{"$f":"IF(COUNTIF($A$9:A1332,A1332)<24,A1332,A1332+1)","v":56},{"$f":"VLOOKUP(A1333,'Counties and Regions'!$G$3:$J$74,4,FALSE)","v":"Western"},{"$f":"VLOOKUP(A1333,'Counties and Regions'!$G$3:$J$74,3,FALSE)","v":"Trempealeau County"},"Hospital Outpatient","F"]
[{"$f":"IF(COUNTIF($A$9:A1333,A1333)<24,A1333,A1333+1)","v":56},{"$f":"VLOOKUP(A1334,'Counties and Regions'!$G$3:$J$74,4,FALSE)","v":"Western"},{"$f":"VLOOKUP(A1334,'Counties and Regions'!$G$3:$J$74,3,FALSE)","v":"Trempealeau County"},"Hospital Outpatient","D"]
[{"$f":"IF(COUNTIF($A$9:A1334,A1334)<24,A1334,A1334+1)","v":56},{"$f":"VLOOKUP(A1335,'Counties and Regions'!$G$3:$J$74,4,FALSE)","v":"Western"},{"$f":"VLOOKUP(A1335,'Counties and Regions'!$G$3:$J$74,3,FALSE)","v":"Trempealeau County"},"Hospital Outpatient","B"]
[{"$f":"IF(COUNTIF($A$9:A1335,A1335)<24,A1335,A1335+1)","v":56},{"$f":"VLOOKUP(A1336,'Counties and Regions'!$G$3:$J$74,4,FALSE)","v":"Western"},{"$f":"VLOOKUP(A1336,'Counties and Regions'!$G$3:$J$74,3,FALSE)","v":"Trempealeau County"},"Hospital Outpatient","O"]
[{"$f":"IF(COUNTIF($A$9:A1336,A1336)<24,A1336,A1336+1)","v":56},{"$f":"VLOOKUP(A1337,'Counties and Regions'!$G$3:$J$74,4,FALSE)","v":"Western"},{"$f":"VLOOKUP(A1337,'Counties and Regions'!$G$3:$J$74,3,FALSE)","v":"Trempealeau County"},"Other Facility","F"]
[{"$f":"IF(COUNTIF($A$9:A1337,A1337)<24,A1337,A1337+1)","v":56},{"$f":"VLOOKUP(A1338,'Counties and Regions'!$G$3:$J$74,4,FALSE)","v":"Western"},{"$f":"VLOOKUP(A1338,'Counties and Regions'!$G$3:$J$74,3,FALSE)","v":"Trempealeau County"},"Other Facility","D"]
[{"$f":"IF(COUNTIF($A$9:A1338,A1338)<24,A1338,A1338+1)","v":56},{"$f":"VLOOKUP(A1339,'Counties and Regions'!$G$3:$J$74,4,FALSE)","v":"Western"},{"$f":"VLOOKUP(A1339,'Counties and Regions'!$G$3:$J$74,3,FALSE)","v":"Trempealeau County"},"Other Facility","B"]
[{"$f":"IF(COUNTIF($A$9:A1339,A1339)<24,A1339,A1339+1)","v":56},{"$f":"VLOOKUP(A1340,'Counties and Regions'!$G$3:$J$74,4,FALSE)","v":"Western"},{"$f":"VLOOKUP(A1340,'Counties and Regions'!$G$3:$J$74,3,FALSE)","v":"Trempealeau County"},"Other Facility","O"]
[{"$f":"IF(COUNTIF($A$9:A1340,A1340)<24,A1340,A1340+1)","v":56},{"$f":"VLOOKUP(A1341,'Counties and Regions'!$G$3:$J$74,4,FALSE)","v":"Western"},{"$f":"VLOOKUP(A1341,'Counties and Regions'!$G$3:$J$74,3,FALSE)","v":"Trempealeau County"},"Physician Services","F"]
[{"$f":"IF(COUNTIF($A$9:A1341,A1341)<24,A1341,A1341+1)","v":56},{"$f":"VLOOKUP(A1342,'Counties and Regions'!$G$3:$J$74,4,FALSE)","v":"Western"},{"$f":"VLOOKUP(A1342,'Counties and Regions'!$G$3:$J$74,3,FALSE)","v":"Trempealeau County"},"Physician Services","D"]
[{"$f":"IF(COUNTIF($A$9:A1342,A1342)<24,A1342,A1342+1)","v":56},{"$f":"VLOOKUP(A1343,'Counties and Regions'!$G$3:$J$74,4,FALSE)","v":"Western"},{"$f":"VLOOKUP(A1343,'Counties and Regions'!$G$3:$J$74,3,FALSE)","v":"Trempealeau County"},"Physician Services","B"]
[{"$f":"IF(COUNTIF($A$9:A1343,A1343)<24,A1343,A1343+1)","v":56},{"$f":"VLOOKUP(A1344,'Counties and Regions'!$G$3:$J$74,4,FALSE)","v":"Western"},{"$f":"VLOOKUP(A1344,'Counties and Regions'!$G$3:$J$74,3,FALSE)","v":"Trempealeau County"},"Physician Services","O"]
[{"$f":"IF(COUNTIF($A$9:A1344,A1344)<24,A1344,A1344+1)","v":56},{"$f":"VLOOKUP(A1345,'Counties and Regions'!$G$3:$J$74,4,FALSE)","v":"Western"},{"$f":"VLOOKUP(A1345,'Counties and Regions'!$G$3:$J$74,3,FALSE)","v":"Trempealeau County"},"Other Services","F"]
[{"$f":"IF(COUNTIF($A$9:A1345,A1345)<24,A1345,A1345+1)","v":56},{"$f":"VLOOKUP(A1346,'Counties and Regions'!$G$3:$J$74,4,FALSE)","v":"Western"},{"$f":"VLOOKUP(A1346,'Counties and Regions'!$G$3:$J$74,3,FALSE)","v":"Trempealeau County"},"Other Services","D"]
[{"$f":"IF(COUNTIF($A$9:A1346,A1346)<24,A1346,A1346+1)","v":56},{"$f":"VLOOKUP(A1347,'Counties and Regions'!$G$3:$J$74,4,FALSE)","v":"Western"},{"$f":"VLOOKUP(A1347,'Counties and Regions'!$G$3:$J$74,3,FALSE)","v":"Trempealeau County"},"Other Services","B"]
[{"$f":"IF(COUNTIF($A$9:A1347,A1347)<24,A1347,A1347+1)","v":56},{"$f":"VLOOKUP(A1348,'Counties and Regions'!$G$3:$J$74,4,FALSE)","v":"Western"},{"$f":"VLOOKUP(A1348,'Counties and Regions'!$G$3:$J$74,3,FALSE)","v":"Trempealeau County"},"Other Services","O"]
[{"$f":"IF(COUNTIF($A$9:A1348,A1348)<24,A1348,A1348+1)","v":56},{"$f":"VLOOKUP(A1349,'Counties and Regions'!$G$3:$J$74,4,FALSE)","v":"Western"},{"$f":"VLOOKUP(A1349,'Counties and Regions'!$G$3:$J$74,3,FALSE)","v":"Trempealeau County"},"Additional Services","F"]
[{"$f":"IF(COUNTIF($A$9:A1349,A1349)<24,A1349,A1349+1)","v":56},{"$f":"VLOOKUP(A1350,'Counties and Regions'!$G$3:$J$74,4,FALSE)","v":"Western"},{"$f":"VLOOKUP(A1350,'Counties and Regions'!$G$3:$J$74,3,FALSE)","v":"Trempealeau County"},"Additional Services","D"]
[{"$f":"IF(COUNTIF($A$9:A1350,A1350)<24,A1350,A1350+1)","v":56},{"$f":"VLOOKUP(A1351,'Counties and Regions'!$G$3:$J$74,4,FALSE)","v":"Western"},{"$f":"VLOOKUP(A1351,'Counties and Regions'!$G$3:$J$74,3,FALSE)","v":"Trempealeau County"},"Additional Services","B"]
[{"$f":"IF(COUNTIF($A$9:A1351,A1351)<24,A1351,A1351+1)","v":56},{"$f":"VLOOKUP(A1352,'Counties and Regions'!$G$3:$J$74,4,FALSE)","v":"Western"},{"$f":"VLOOKUP(A1352,'Counties and Regions'!$G$3:$J$74,3,FALSE)","v":"Trempealeau County"},"Additional Services","O"]
[{"$f":"IF(COUNTIF($A$9:A1352,A1352)<24,A1352,A1352+1)","v":57},{"$f":"VLOOKUP(A1353,'Counties and Regions'!$G$3:$J$74,4,FALSE)","v":"Western"},{"$f":"VLOOKUP(A1353,'Counties and Regions'!$G$3:$J$74,3,FALSE)","v":"Washburn County"},"Hospital Inpatient","F"]
[{"$f":"IF(COUNTIF($A$9:A1353,A1353)<24,A1353,A1353+1)","v":57},{"$f":"VLOOKUP(A1354,'Counties and Regions'!$G$3:$J$74,4,FALSE)","v":"Western"},{"$f":"VLOOKUP(A1354,'Counties and Regions'!$G$3:$J$74,3,FALSE)","v":"Washburn County"},"Hospital Inpatient","D"]
[{"$f":"IF(COUNTIF($A$9:A1354,A1354)<24,A1354,A1354+1)","v":57},{"$f":"VLOOKUP(A1355,'Counties and Regions'!$G$3:$J$74,4,FALSE)","v":"Western"},{"$f":"VLOOKUP(A1355,'Counties and Regions'!$G$3:$J$74,3,FALSE)","v":"Washburn County"},"Hospital Inpatient","B"]
[{"$f":"IF(COUNTIF($A$9:A1355,A1355)<24,A1355,A1355+1)","v":57},{"$f":"VLOOKUP(A1356,'Counties and Regions'!$G$3:$J$74,4,FALSE)","v":"Western"},{"$f":"VLOOKUP(A1356,'Counties and Regions'!$G$3:$J$74,3,FALSE)","v":"Washburn County"},"Hospital Inpatient","O"]
[{"$f":"IF(COUNTIF($A$9:A1356,A1356)<24,A1356,A1356+1)","v":57},{"$f":"VLOOKUP(A1357,'Counties and Regions'!$G$3:$J$74,4,FALSE)","v":"Western"},{"$f":"VLOOKUP(A1357,'Counties and Regions'!$G$3:$J$74,3,FALSE)","v":"Washburn County"},"Hospital Outpatient","F"]
[{"$f":"IF(COUNTIF($A$9:A1357,A1357)<24,A1357,A1357+1)","v":57},{"$f":"VLOOKUP(A1358,'Counties and Regions'!$G$3:$J$74,4,FALSE)","v":"Western"},{"$f":"VLOOKUP(A1358,'Counties and Regions'!$G$3:$J$74,3,FALSE)","v":"Washburn County"},"Hospital Outpatient","D"]
[{"$f":"IF(COUNTIF($A$9:A1358,A1358)<24,A1358,A1358+1)","v":57},{"$f":"VLOOKUP(A1359,'Counties and Regions'!$G$3:$J$74,4,FALSE)","v":"Western"},{"$f":"VLOOKUP(A1359,'Counties and Regions'!$G$3:$J$74,3,FALSE)","v":"Washburn County"},"Hospital Outpatient","B"]
[{"$f":"IF(COUNTIF($A$9:A1359,A1359)<24,A1359,A1359+1)","v":57},{"$f":"VLOOKUP(A1360,'Counties and Regions'!$G$3:$J$74,4,FALSE)","v":"Western"},{"$f":"VLOOKUP(A1360,'Counties and Regions'!$G$3:$J$74,3,FALSE)","v":"Washburn County"},"Hospital Outpatient","O"]
[{"$f":"IF(COUNTIF($A$9:A1360,A1360)<24,A1360,A1360+1)","v":57},{"$f":"VLOOKUP(A1361,'Counties and Regions'!$G$3:$J$74,4,FALSE)","v":"Western"},{"$f":"VLOOKUP(A1361,'Counties and Regions'!$G$3:$J$74,3,FALSE)","v":"Washburn County"},"Other Facility","F"]
[{"$f":"IF(COUNTIF($A$9:A1361,A1361)<24,A1361,A1361+1)","v":57},{"$f":"VLOOKUP(A1362,'Counties and Regions'!$G$3:$J$74,4,FALSE)","v":"Western"},{"$f":"VLOOKUP(A1362,'Counties and Regions'!$G$3:$J$74,3,FALSE)","v":"Washburn County"},"Other Facility","D"]
[{"$f":"IF(COUNTIF($A$9:A1362,A1362)<24,A1362,A1362+1)","v":57},{"$f":"VLOOKUP(A1363,'Counties and Regions'!$G$3:$J$74,4,FALSE)","v":"Western"},{"$f":"VLOOKUP(A1363,'Counties and Regions'!$G$3:$J$74,3,FALSE)","v":"Washburn County"},"Other Facility","B"]
[{"$f":"IF(COUNTIF($A$9:A1363,A1363)<24,A1363,A1363+1)","v":57},{"$f":"VLOOKUP(A1364,'Counties and Regions'!$G$3:$J$74,4,FALSE)","v":"Western"},{"$f":"VLOOKUP(A1364,'Counties and Regions'!$G$3:$J$74,3,FALSE)","v":"Washburn County"},"Other Facility","O"]
[{"$f":"IF(COUNTIF($A$9:A1364,A1364)<24,A1364,A1364+1)","v":57},{"$f":"VLOOKUP(A1365,'Counties and Regions'!$G$3:$J$74,4,FALSE)","v":"Western"},{"$f":"VLOOKUP(A1365,'Counties and Regions'!$G$3:$J$74,3,FALSE)","v":"Washburn County"},"Physician Services","F"]
[{"$f":"IF(COUNTIF($A$9:A1365,A1365)<24,A1365,A1365+1)","v":57},{"$f":"VLOOKUP(A1366,'Counties and Regions'!$G$3:$J$74,4,FALSE)","v":"Western"},{"$f":"VLOOKUP(A1366,'Counties and Regions'!$G$3:$J$74,3,FALSE)","v":"Washburn County"},"Physician Services","D"]
[{"$f":"IF(COUNTIF($A$9:A1366,A1366)<24,A1366,A1366+1)","v":57},{"$f":"VLOOKUP(A1367,'Counties and Regions'!$G$3:$J$74,4,FALSE)","v":"Western"},{"$f":"VLOOKUP(A1367,'Counties and Regions'!$G$3:$J$74,3,FALSE)","v":"Washburn County"},"Physician Services","B"]
[{"$f":"IF(COUNTIF($A$9:A1367,A1367)<24,A1367,A1367+1)","v":57},{"$f":"VLOOKUP(A1368,'Counties and Regions'!$G$3:$J$74,4,FALSE)","v":"Western"},{"$f":"VLOOKUP(A1368,'Counties and Regions'!$G$3:$J$74,3,FALSE)","v":"Washburn County"},"Physician Services","O"]
[{"$f":"IF(COUNTIF($A$9:A1368,A1368)<24,A1368,A1368+1)","v":57},{"$f":"VLOOKUP(A1369,'Counties and Regions'!$G$3:$J$74,4,FALSE)","v":"Western"},{"$f":"VLOOKUP(A1369,'Counties and Regions'!$G$3:$J$74,3,FALSE)","v":"Washburn County"},"Other Services","F"]
[{"$f":"IF(COUNTIF($A$9:A1369,A1369)<24,A1369,A1369+1)","v":57},{"$f":"VLOOKUP(A1370,'Counties and Regions'!$G$3:$J$74,4,FALSE)","v":"Western"},{"$f":"VLOOKUP(A1370,'Counties and Regions'!$G$3:$J$74,3,FALSE)","v":"Washburn County"},"Other Services","D"]
[{"$f":"IF(COUNTIF($A$9:A1370,A1370)<24,A1370,A1370+1)","v":57},{"$f":"VLOOKUP(A1371,'Counties and Regions'!$G$3:$J$74,4,FALSE)","v":"Western"},{"$f":"VLOOKUP(A1371,'Counties and Regions'!$G$3:$J$74,3,FALSE)","v":"Washburn County"},"Other Services","B"]
[{"$f":"IF(COUNTIF($A$9:A1371,A1371)<24,A1371,A1371+1)","v":57},{"$f":"VLOOKUP(A1372,'Counties and Regions'!$G$3:$J$74,4,FALSE)","v":"Western"},{"$f":"VLOOKUP(A1372,'Counties and Regions'!$G$3:$J$74,3,FALSE)","v":"Washburn County"},"Other Services","O"]
[{"$f":"IF(COUNTIF($A$9:A1372,A1372)<24,A1372,A1372+1)","v":57},{"$f":"VLOOKUP(A1373,'Counties and Regions'!$G$3:$J$74,4,FALSE)","v":"Western"},{"$f":"VLOOKUP(A1373,'Counties and Regions'!$G$3:$J$74,3,FALSE)","v":"Washburn County"},"Additional Services","F"]
[{"$f":"IF(COUNTIF($A$9:A1373,A1373)<24,A1373,A1373+1)","v":57},{"$f":"VLOOKUP(A1374,'Counties and Regions'!$G$3:$J$74,4,FALSE)","v":"Western"},{"$f":"VLOOKUP(A1374,'Counties and Regions'!$G$3:$J$74,3,FALSE)","v":"Washburn County"},"Additional Services","D"]
[{"$f":"IF(COUNTIF($A$9:A1374,A1374)<24,A1374,A1374+1)","v":57},{"$f":"VLOOKUP(A1375,'Counties and Regions'!$G$3:$J$74,4,FALSE)","v":"Western"},{"$f":"VLOOKUP(A1375,'Counties and Regions'!$G$3:$J$74,3,FALSE)","v":"Washburn County"},"Additional Services","B"]
[{"$f":"IF(COUNTIF($A$9:A1375,A1375)<24,A1375,A1375+1)","v":57},{"$f":"VLOOKUP(A1376,'Counties and Regions'!$G$3:$J$74,4,FALSE)","v":"Western"},{"$f":"VLOOKUP(A1376,'Counties and Regions'!$G$3:$J$74,3,FALSE)","v":"Washburn County"},"Additional Services","O"]
[{"$f":"IF(COUNTIF($A$9:A1376,A1376)<24,A1376,A1376+1)","v":58},{"$f":"VLOOKUP(A1377,'Counties and Regions'!$G$3:$J$74,4,FALSE)","v":"Northern"},{"$f":"VLOOKUP(A1377,'Counties and Regions'!$G$3:$J$74,3,FALSE)","v":"Ashland County"},"Hospital Inpatient","F"]
[{"$f":"IF(COUNTIF($A$9:A1377,A1377)<24,A1377,A1377+1)","v":58},{"$f":"VLOOKUP(A1378,'Counties and Regions'!$G$3:$J$74,4,FALSE)","v":"Northern"},{"$f":"VLOOKUP(A1378,'Counties and Regions'!$G$3:$J$74,3,FALSE)","v":"Ashland County"},"Hospital Inpatient","D"]
[{"$f":"IF(COUNTIF($A$9:A1378,A1378)<24,A1378,A1378+1)","v":58},{"$f":"VLOOKUP(A1379,'Counties and Regions'!$G$3:$J$74,4,FALSE)","v":"Northern"},{"$f":"VLOOKUP(A1379,'Counties and Regions'!$G$3:$J$74,3,FALSE)","v":"Ashland County"},"Hospital Inpatient","B"]
[{"$f":"IF(COUNTIF($A$9:A1379,A1379)<24,A1379,A1379+1)","v":58},{"$f":"VLOOKUP(A1380,'Counties and Regions'!$G$3:$J$74,4,FALSE)","v":"Northern"},{"$f":"VLOOKUP(A1380,'Counties and Regions'!$G$3:$J$74,3,FALSE)","v":"Ashland County"},"Hospital Inpatient","O"]
[{"$f":"IF(COUNTIF($A$9:A1380,A1380)<24,A1380,A1380+1)","v":58},{"$f":"VLOOKUP(A1381,'Counties and Regions'!$G$3:$J$74,4,FALSE)","v":"Northern"},{"$f":"VLOOKUP(A1381,'Counties and Regions'!$G$3:$J$74,3,FALSE)","v":"Ashland County"},"Hospital Outpatient","F"]
[{"$f":"IF(COUNTIF($A$9:A1381,A1381)<24,A1381,A1381+1)","v":58},{"$f":"VLOOKUP(A1382,'Counties and Regions'!$G$3:$J$74,4,FALSE)","v":"Northern"},{"$f":"VLOOKUP(A1382,'Counties and Regions'!$G$3:$J$74,3,FALSE)","v":"Ashland County"},"Hospital Outpatient","D"]
[{"$f":"IF(COUNTIF($A$9:A1382,A1382)<24,A1382,A1382+1)","v":58},{"$f":"VLOOKUP(A1383,'Counties and Regions'!$G$3:$J$74,4,FALSE)","v":"Northern"},{"$f":"VLOOKUP(A1383,'Counties and Regions'!$G$3:$J$74,3,FALSE)","v":"Ashland County"},"Hospital Outpatient","B"]
[{"$f":"IF(COUNTIF($A$9:A1383,A1383)<24,A1383,A1383+1)","v":58},{"$f":"VLOOKUP(A1384,'Counties and Regions'!$G$3:$J$74,4,FALSE)","v":"Northern"},{"$f":"VLOOKUP(A1384,'Counties and Regions'!$G$3:$J$74,3,FALSE)","v":"Ashland County"},"Hospital Outpatient","O"]
[{"$f":"IF(COUNTIF($A$9:A1384,A1384)<24,A1384,A1384+1)","v":58},{"$f":"VLOOKUP(A1385,'Counties and Regions'!$G$3:$J$74,4,FALSE)","v":"Northern"},{"$f":"VLOOKUP(A1385,'Counties and Regions'!$G$3:$J$74,3,FALSE)","v":"Ashland County"},"Other Facility","F"]
[{"$f":"IF(COUNTIF($A$9:A1385,A1385)<24,A1385,A1385+1)","v":58},{"$f":"VLOOKUP(A1386,'Counties and Regions'!$G$3:$J$74,4,FALSE)","v":"Northern"},{"$f":"VLOOKUP(A1386,'Counties and Regions'!$G$3:$J$74,3,FALSE)","v":"Ashland County"},"Other Facility","D"]
[{"$f":"IF(COUNTIF($A$9:A1386,A1386)<24,A1386,A1386+1)","v":58},{"$f":"VLOOKUP(A1387,'Counties and Regions'!$G$3:$J$74,4,FALSE)","v":"Northern"},{"$f":"VLOOKUP(A1387,'Counties and Regions'!$G$3:$J$74,3,FALSE)","v":"Ashland County"},"Other Facility","B"]
[{"$f":"IF(COUNTIF($A$9:A1387,A1387)<24,A1387,A1387+1)","v":58},{"$f":"VLOOKUP(A1388,'Counties and Regions'!$G$3:$J$74,4,FALSE)","v":"Northern"},{"$f":"VLOOKUP(A1388,'Counties and Regions'!$G$3:$J$74,3,FALSE)","v":"Ashland County"},"Other Facility","O"]
[{"$f":"IF(COUNTIF($A$9:A1388,A1388)<24,A1388,A1388+1)","v":58},{"$f":"VLOOKUP(A1389,'Counties and Regions'!$G$3:$J$74,4,FALSE)","v":"Northern"},{"$f":"VLOOKUP(A1389,'Counties and Regions'!$G$3:$J$74,3,FALSE)","v":"Ashland County"},"Physician Services","F"]
[{"$f":"IF(COUNTIF($A$9:A1389,A1389)<24,A1389,A1389+1)","v":58},{"$f":"VLOOKUP(A1390,'Counties and Regions'!$G$3:$J$74,4,FALSE)","v":"Northern"},{"$f":"VLOOKUP(A1390,'Counties and Regions'!$G$3:$J$74,3,FALSE)","v":"Ashland County"},"Physician Services","D"]
[{"$f":"IF(COUNTIF($A$9:A1390,A1390)<24,A1390,A1390+1)","v":58},{"$f":"VLOOKUP(A1391,'Counties and Regions'!$G$3:$J$74,4,FALSE)","v":"Northern"},{"$f":"VLOOKUP(A1391,'Counties and Regions'!$G$3:$J$74,3,FALSE)","v":"Ashland County"},"Physician Services","B"]
[{"$f":"IF(COUNTIF($A$9:A1391,A1391)<24,A1391,A1391+1)","v":58},{"$f":"VLOOKUP(A1392,'Counties and Regions'!$G$3:$J$74,4,FALSE)","v":"Northern"},{"$f":"VLOOKUP(A1392,'Counties and Regions'!$G$3:$J$74,3,FALSE)","v":"Ashland County"},"Physician Services","O"]
[{"$f":"IF(COUNTIF($A$9:A1392,A1392)<24,A1392,A1392+1)","v":58},{"$f":"VLOOKUP(A1393,'Counties and Regions'!$G$3:$J$74,4,FALSE)","v":"Northern"},{"$f":"VLOOKUP(A1393,'Counties and Regions'!$G$3:$J$74,3,FALSE)","v":"Ashland County"},"Other Services","F"]
[{"$f":"IF(COUNTIF($A$9:A1393,A1393)<24,A1393,A1393+1)","v":58},{"$f":"VLOOKUP(A1394,'Counties and Regions'!$G$3:$J$74,4,FALSE)","v":"Northern"},{"$f":"VLOOKUP(A1394,'Counties and Regions'!$G$3:$J$74,3,FALSE)","v":"Ashland County"},"Other Services","D"]
[{"$f":"IF(COUNTIF($A$9:A1394,A1394)<24,A1394,A1394+1)","v":58},{"$f":"VLOOKUP(A1395,'Counties and Regions'!$G$3:$J$74,4,FALSE)","v":"Northern"},{"$f":"VLOOKUP(A1395,'Counties and Regions'!$G$3:$J$74,3,FALSE)","v":"Ashland County"},"Other Services","B"]
[{"$f":"IF(COUNTIF($A$9:A1395,A1395)<24,A1395,A1395+1)","v":58},{"$f":"VLOOKUP(A1396,'Counties and Regions'!$G$3:$J$74,4,FALSE)","v":"Northern"},{"$f":"VLOOKUP(A1396,'Counties and Regions'!$G$3:$J$74,3,FALSE)","v":"Ashland County"},"Other Services","O"]
[{"$f":"IF(COUNTIF($A$9:A1396,A1396)<24,A1396,A1396+1)","v":58},{"$f":"VLOOKUP(A1397,'Counties and Regions'!$G$3:$J$74,4,FALSE)","v":"Northern"},{"$f":"VLOOKUP(A1397,'Counties and Regions'!$G$3:$J$74,3,FALSE)","v":"Ashland County"},"Additional Services","F"]
[{"$f":"IF(COUNTIF($A$9:A1397,A1397)<24,A1397,A1397+1)","v":58},{"$f":"VLOOKUP(A1398,'Counties and Regions'!$G$3:$J$74,4,FALSE)","v":"Northern"},{"$f":"VLOOKUP(A1398,'Counties and Regions'!$G$3:$J$74,3,FALSE)","v":"Ashland County"},"Additional Services","D"]
[{"$f":"IF(COUNTIF($A$9:A1398,A1398)<24,A1398,A1398+1)","v":58},{"$f":"VLOOKUP(A1399,'Counties and Regions'!$G$3:$J$74,4,FALSE)","v":"Northern"},{"$f":"VLOOKUP(A1399,'Counties and Regions'!$G$3:$J$74,3,FALSE)","v":"Ashland County"},"Additional Services","B"]
[{"$f":"IF(COUNTIF($A$9:A1399,A1399)<24,A1399,A1399+1)","v":58},{"$f":"VLOOKUP(A1400,'Counties and Regions'!$G$3:$J$74,4,FALSE)","v":"Northern"},{"$f":"VLOOKUP(A1400,'Counties and Regions'!$G$3:$J$74,3,FALSE)","v":"Ashland County"},"Additional Services","O"]
[{"$f":"IF(COUNTIF($A$9:A1400,A1400)<24,A1400,A1400+1)","v":59},{"$f":"VLOOKUP(A1401,'Counties and Regions'!$G$3:$J$74,4,FALSE)","v":"Northern"},{"$f":"VLOOKUP(A1401,'Counties and Regions'!$G$3:$J$74,3,FALSE)","v":"Bayfield County"},"Hospital Inpatient","F"]
[{"$f":"IF(COUNTIF($A$9:A1401,A1401)<24,A1401,A1401+1)","v":59},{"$f":"VLOOKUP(A1402,'Counties and Regions'!$G$3:$J$74,4,FALSE)","v":"Northern"},{"$f":"VLOOKUP(A1402,'Counties and Regions'!$G$3:$J$74,3,FALSE)","v":"Bayfield County"},"Hospital Inpatient","D"]
[{"$f":"IF(COUNTIF($A$9:A1402,A1402)<24,A1402,A1402+1)","v":59},{"$f":"VLOOKUP(A1403,'Counties and Regions'!$G$3:$J$74,4,FALSE)","v":"Northern"},{"$f":"VLOOKUP(A1403,'Counties and Regions'!$G$3:$J$74,3,FALSE)","v":"Bayfield County"},"Hospital Inpatient","B"]
[{"$f":"IF(COUNTIF($A$9:A1403,A1403)<24,A1403,A1403+1)","v":59},{"$f":"VLOOKUP(A1404,'Counties and Regions'!$G$3:$J$74,4,FALSE)","v":"Northern"},{"$f":"VLOOKUP(A1404,'Counties and Regions'!$G$3:$J$74,3,FALSE)","v":"Bayfield County"},"Hospital Inpatient","O"]
[{"$f":"IF(COUNTIF($A$9:A1404,A1404)<24,A1404,A1404+1)","v":59},{"$f":"VLOOKUP(A1405,'Counties and Regions'!$G$3:$J$74,4,FALSE)","v":"Northern"},{"$f":"VLOOKUP(A1405,'Counties and Regions'!$G$3:$J$74,3,FALSE)","v":"Bayfield County"},"Hospital Outpatient","F"]
[{"$f":"IF(COUNTIF($A$9:A1405,A1405)<24,A1405,A1405+1)","v":59},{"$f":"VLOOKUP(A1406,'Counties and Regions'!$G$3:$J$74,4,FALSE)","v":"Northern"},{"$f":"VLOOKUP(A1406,'Counties and Regions'!$G$3:$J$74,3,FALSE)","v":"Bayfield County"},"Hospital Outpatient","D"]
[{"$f":"IF(COUNTIF($A$9:A1406,A1406)<24,A1406,A1406+1)","v":59},{"$f":"VLOOKUP(A1407,'Counties and Regions'!$G$3:$J$74,4,FALSE)","v":"Northern"},{"$f":"VLOOKUP(A1407,'Counties and Regions'!$G$3:$J$74,3,FALSE)","v":"Bayfield County"},"Hospital Outpatient","B"]
[{"$f":"IF(COUNTIF($A$9:A1407,A1407)<24,A1407,A1407+1)","v":59},{"$f":"VLOOKUP(A1408,'Counties and Regions'!$G$3:$J$74,4,FALSE)","v":"Northern"},{"$f":"VLOOKUP(A1408,'Counties and Regions'!$G$3:$J$74,3,FALSE)","v":"Bayfield County"},"Hospital Outpatient","O"]
[{"$f":"IF(COUNTIF($A$9:A1408,A1408)<24,A1408,A1408+1)","v":59},{"$f":"VLOOKUP(A1409,'Counties and Regions'!$G$3:$J$74,4,FALSE)","v":"Northern"},{"$f":"VLOOKUP(A1409,'Counties and Regions'!$G$3:$J$74,3,FALSE)","v":"Bayfield County"},"Other Facility","F"]
[{"$f":"IF(COUNTIF($A$9:A1409,A1409)<24,A1409,A1409+1)","v":59},{"$f":"VLOOKUP(A1410,'Counties and Regions'!$G$3:$J$74,4,FALSE)","v":"Northern"},{"$f":"VLOOKUP(A1410,'Counties and Regions'!$G$3:$J$74,3,FALSE)","v":"Bayfield County"},"Other Facility","D"]
[{"$f":"IF(COUNTIF($A$9:A1410,A1410)<24,A1410,A1410+1)","v":59},{"$f":"VLOOKUP(A1411,'Counties and Regions'!$G$3:$J$74,4,FALSE)","v":"Northern"},{"$f":"VLOOKUP(A1411,'Counties and Regions'!$G$3:$J$74,3,FALSE)","v":"Bayfield County"},"Other Facility","B"]
[{"$f":"IF(COUNTIF($A$9:A1411,A1411)<24,A1411,A1411+1)","v":59},{"$f":"VLOOKUP(A1412,'Counties and Regions'!$G$3:$J$74,4,FALSE)","v":"Northern"},{"$f":"VLOOKUP(A1412,'Counties and Regions'!$G$3:$J$74,3,FALSE)","v":"Bayfield County"},"Other Facility","O"]
[{"$f":"IF(COUNTIF($A$9:A1412,A1412)<24,A1412,A1412+1)","v":59},{"$f":"VLOOKUP(A1413,'Counties and Regions'!$G$3:$J$74,4,FALSE)","v":"Northern"},{"$f":"VLOOKUP(A1413,'Counties and Regions'!$G$3:$J$74,3,FALSE)","v":"Bayfield County"},"Physician Services","F"]
[{"$f":"IF(COUNTIF($A$9:A1413,A1413)<24,A1413,A1413+1)","v":59},{"$f":"VLOOKUP(A1414,'Counties and Regions'!$G$3:$J$74,4,FALSE)","v":"Northern"},{"$f":"VLOOKUP(A1414,'Counties and Regions'!$G$3:$J$74,3,FALSE)","v":"Bayfield County"},"Physician Services","D"]
[{"$f":"IF(COUNTIF($A$9:A1414,A1414)<24,A1414,A1414+1)","v":59},{"$f":"VLOOKUP(A1415,'Counties and Regions'!$G$3:$J$74,4,FALSE)","v":"Northern"},{"$f":"VLOOKUP(A1415,'Counties and Regions'!$G$3:$J$74,3,FALSE)","v":"Bayfield County"},"Physician Services","B"]
[{"$f":"IF(COUNTIF($A$9:A1415,A1415)<24,A1415,A1415+1)","v":59},{"$f":"VLOOKUP(A1416,'Counties and Regions'!$G$3:$J$74,4,FALSE)","v":"Northern"},{"$f":"VLOOKUP(A1416,'Counties and Regions'!$G$3:$J$74,3,FALSE)","v":"Bayfield County"},"Physician Services","O"]
[{"$f":"IF(COUNTIF($A$9:A1416,A1416)<24,A1416,A1416+1)","v":59},{"$f":"VLOOKUP(A1417,'Counties and Regions'!$G$3:$J$74,4,FALSE)","v":"Northern"},{"$f":"VLOOKUP(A1417,'Counties and Regions'!$G$3:$J$74,3,FALSE)","v":"Bayfield County"},"Other Services","F"]
[{"$f":"IF(COUNTIF($A$9:A1417,A1417)<24,A1417,A1417+1)","v":59},{"$f":"VLOOKUP(A1418,'Counties and Regions'!$G$3:$J$74,4,FALSE)","v":"Northern"},{"$f":"VLOOKUP(A1418,'Counties and Regions'!$G$3:$J$74,3,FALSE)","v":"Bayfield County"},"Other Services","D"]
[{"$f":"IF(COUNTIF($A$9:A1418,A1418)<24,A1418,A1418+1)","v":59},{"$f":"VLOOKUP(A1419,'Counties and Regions'!$G$3:$J$74,4,FALSE)","v":"Northern"},{"$f":"VLOOKUP(A1419,'Counties and Regions'!$G$3:$J$74,3,FALSE)","v":"Bayfield County"},"Other Services","B"]
[{"$f":"IF(COUNTIF($A$9:A1419,A1419)<24,A1419,A1419+1)","v":59},{"$f":"VLOOKUP(A1420,'Counties and Regions'!$G$3:$J$74,4,FALSE)","v":"Northern"},{"$f":"VLOOKUP(A1420,'Counties and Regions'!$G$3:$J$74,3,FALSE)","v":"Bayfield County"},"Other Services","O"]
[{"$f":"IF(COUNTIF($A$9:A1420,A1420)<24,A1420,A1420+1)","v":59},{"$f":"VLOOKUP(A1421,'Counties and Regions'!$G$3:$J$74,4,FALSE)","v":"Northern"},{"$f":"VLOOKUP(A1421,'Counties and Regions'!$G$3:$J$74,3,FALSE)","v":"Bayfield County"},"Additional Services","F"]
[{"$f":"IF(COUNTIF($A$9:A1421,A1421)<24,A1421,A1421+1)","v":59},{"$f":"VLOOKUP(A1422,'Counties and Regions'!$G$3:$J$74,4,FALSE)","v":"Northern"},{"$f":"VLOOKUP(A1422,'Counties and Regions'!$G$3:$J$74,3,FALSE)","v":"Bayfield County"},"Additional Services","D"]
[{"$f":"IF(COUNTIF($A$9:A1422,A1422)<24,A1422,A1422+1)","v":59},{"$f":"VLOOKUP(A1423,'Counties and Regions'!$G$3:$J$74,4,FALSE)","v":"Northern"},{"$f":"VLOOKUP(A1423,'Counties and Regions'!$G$3:$J$74,3,FALSE)","v":"Bayfield County"},"Additional Services","B"]
[{"$f":"IF(COUNTIF($A$9:A1423,A1423)<24,A1423,A1423+1)","v":59},{"$f":"VLOOKUP(A1424,'Counties and Regions'!$G$3:$J$74,4,FALSE)","v":"Northern"},{"$f":"VLOOKUP(A1424,'Counties and Regions'!$G$3:$J$74,3,FALSE)","v":"Bayfield County"},"Additional Services","O"]
[{"$f":"IF(COUNTIF($A$9:A1424,A1424)<24,A1424,A1424+1)","v":60},{"$f":"VLOOKUP(A1425,'Counties and Regions'!$G$3:$J$74,4,FALSE)","v":"Northern"},{"$f":"VLOOKUP(A1425,'Counties and Regions'!$G$3:$J$74,3,FALSE)","v":"Florence County"},"Hospital Inpatient","F"]
[{"$f":"IF(COUNTIF($A$9:A1425,A1425)<24,A1425,A1425+1)","v":60},{"$f":"VLOOKUP(A1426,'Counties and Regions'!$G$3:$J$74,4,FALSE)","v":"Northern"},{"$f":"VLOOKUP(A1426,'Counties and Regions'!$G$3:$J$74,3,FALSE)","v":"Florence County"},"Hospital Inpatient","D"]
[{"$f":"IF(COUNTIF($A$9:A1426,A1426)<24,A1426,A1426+1)","v":60},{"$f":"VLOOKUP(A1427,'Counties and Regions'!$G$3:$J$74,4,FALSE)","v":"Northern"},{"$f":"VLOOKUP(A1427,'Counties and Regions'!$G$3:$J$74,3,FALSE)","v":"Florence County"},"Hospital Inpatient","B"]
[{"$f":"IF(COUNTIF($A$9:A1427,A1427)<24,A1427,A1427+1)","v":60},{"$f":"VLOOKUP(A1428,'Counties and Regions'!$G$3:$J$74,4,FALSE)","v":"Northern"},{"$f":"VLOOKUP(A1428,'Counties and Regions'!$G$3:$J$74,3,FALSE)","v":"Florence County"},"Hospital Inpatient","O"]
[{"$f":"IF(COUNTIF($A$9:A1428,A1428)<24,A1428,A1428+1)","v":60},{"$f":"VLOOKUP(A1429,'Counties and Regions'!$G$3:$J$74,4,FALSE)","v":"Northern"},{"$f":"VLOOKUP(A1429,'Counties and Regions'!$G$3:$J$74,3,FALSE)","v":"Florence County"},"Hospital Outpatient","F"]
[{"$f":"IF(COUNTIF($A$9:A1429,A1429)<24,A1429,A1429+1)","v":60},{"$f":"VLOOKUP(A1430,'Counties and Regions'!$G$3:$J$74,4,FALSE)","v":"Northern"},{"$f":"VLOOKUP(A1430,'Counties and Regions'!$G$3:$J$74,3,FALSE)","v":"Florence County"},"Hospital Outpatient","D"]
[{"$f":"IF(COUNTIF($A$9:A1430,A1430)<24,A1430,A1430+1)","v":60},{"$f":"VLOOKUP(A1431,'Counties and Regions'!$G$3:$J$74,4,FALSE)","v":"Northern"},{"$f":"VLOOKUP(A1431,'Counties and Regions'!$G$3:$J$74,3,FALSE)","v":"Florence County"},"Hospital Outpatient","B"]
[{"$f":"IF(COUNTIF($A$9:A1431,A1431)<24,A1431,A1431+1)","v":60},{"$f":"VLOOKUP(A1432,'Counties and Regions'!$G$3:$J$74,4,FALSE)","v":"Northern"},{"$f":"VLOOKUP(A1432,'Counties and Regions'!$G$3:$J$74,3,FALSE)","v":"Florence County"},"Hospital Outpatient","O"]
[{"$f":"IF(COUNTIF($A$9:A1432,A1432)<24,A1432,A1432+1)","v":60},{"$f":"VLOOKUP(A1433,'Counties and Regions'!$G$3:$J$74,4,FALSE)","v":"Northern"},{"$f":"VLOOKUP(A1433,'Counties and Regions'!$G$3:$J$74,3,FALSE)","v":"Florence County"},"Other Facility","F"]
[{"$f":"IF(COUNTIF($A$9:A1433,A1433)<24,A1433,A1433+1)","v":60},{"$f":"VLOOKUP(A1434,'Counties and Regions'!$G$3:$J$74,4,FALSE)","v":"Northern"},{"$f":"VLOOKUP(A1434,'Counties and Regions'!$G$3:$J$74,3,FALSE)","v":"Florence County"},"Other Facility","D"]
[{"$f":"IF(COUNTIF($A$9:A1434,A1434)<24,A1434,A1434+1)","v":60},{"$f":"VLOOKUP(A1435,'Counties and Regions'!$G$3:$J$74,4,FALSE)","v":"Northern"},{"$f":"VLOOKUP(A1435,'Counties and Regions'!$G$3:$J$74,3,FALSE)","v":"Florence County"},"Other Facility","B"]
[{"$f":"IF(COUNTIF($A$9:A1435,A1435)<24,A1435,A1435+1)","v":60},{"$f":"VLOOKUP(A1436,'Counties and Regions'!$G$3:$J$74,4,FALSE)","v":"Northern"},{"$f":"VLOOKUP(A1436,'Counties and Regions'!$G$3:$J$74,3,FALSE)","v":"Florence County"},"Other Facility","O"]
[{"$f":"IF(COUNTIF($A$9:A1436,A1436)<24,A1436,A1436+1)","v":60},{"$f":"VLOOKUP(A1437,'Counties and Regions'!$G$3:$J$74,4,FALSE)","v":"Northern"},{"$f":"VLOOKUP(A1437,'Counties and Regions'!$G$3:$J$74,3,FALSE)","v":"Florence County"},"Physician Services","F"]
[{"$f":"IF(COUNTIF($A$9:A1437,A1437)<24,A1437,A1437+1)","v":60},{"$f":"VLOOKUP(A1438,'Counties and Regions'!$G$3:$J$74,4,FALSE)","v":"Northern"},{"$f":"VLOOKUP(A1438,'Counties and Regions'!$G$3:$J$74,3,FALSE)","v":"Florence County"},"Physician Services","D"]
[{"$f":"IF(COUNTIF($A$9:A1438,A1438)<24,A1438,A1438+1)","v":60},{"$f":"VLOOKUP(A1439,'Counties and Regions'!$G$3:$J$74,4,FALSE)","v":"Northern"},{"$f":"VLOOKUP(A1439,'Counties and Regions'!$G$3:$J$74,3,FALSE)","v":"Florence County"},"Physician Services","B"]
[{"$f":"IF(COUNTIF($A$9:A1439,A1439)<24,A1439,A1439+1)","v":60},{"$f":"VLOOKUP(A1440,'Counties and Regions'!$G$3:$J$74,4,FALSE)","v":"Northern"},{"$f":"VLOOKUP(A1440,'Counties and Regions'!$G$3:$J$74,3,FALSE)","v":"Florence County"},"Physician Services","O"]
[{"$f":"IF(COUNTIF($A$9:A1440,A1440)<24,A1440,A1440+1)","v":60},{"$f":"VLOOKUP(A1441,'Counties and Regions'!$G$3:$J$74,4,FALSE)","v":"Northern"},{"$f":"VLOOKUP(A1441,'Counties and Regions'!$G$3:$J$74,3,FALSE)","v":"Florence County"},"Other Services","F"]
[{"$f":"IF(COUNTIF($A$9:A1441,A1441)<24,A1441,A1441+1)","v":60},{"$f":"VLOOKUP(A1442,'Counties and Regions'!$G$3:$J$74,4,FALSE)","v":"Northern"},{"$f":"VLOOKUP(A1442,'Counties and Regions'!$G$3:$J$74,3,FALSE)","v":"Florence County"},"Other Services","D"]
[{"$f":"IF(COUNTIF($A$9:A1442,A1442)<24,A1442,A1442+1)","v":60},{"$f":"VLOOKUP(A1443,'Counties and Regions'!$G$3:$J$74,4,FALSE)","v":"Northern"},{"$f":"VLOOKUP(A1443,'Counties and Regions'!$G$3:$J$74,3,FALSE)","v":"Florence County"},"Other Services","B"]
[{"$f":"IF(COUNTIF($A$9:A1443,A1443)<24,A1443,A1443+1)","v":60},{"$f":"VLOOKUP(A1444,'Counties and Regions'!$G$3:$J$74,4,FALSE)","v":"Northern"},{"$f":"VLOOKUP(A1444,'Counties and Regions'!$G$3:$J$74,3,FALSE)","v":"Florence County"},"Other Services","O"]
[{"$f":"IF(COUNTIF($A$9:A1444,A1444)<24,A1444,A1444+1)","v":60},{"$f":"VLOOKUP(A1445,'Counties and Regions'!$G$3:$J$74,4,FALSE)","v":"Northern"},{"$f":"VLOOKUP(A1445,'Counties and Regions'!$G$3:$J$74,3,FALSE)","v":"Florence County"},"Additional Services","F"]
[{"$f":"IF(COUNTIF($A$9:A1445,A1445)<24,A1445,A1445+1)","v":60},{"$f":"VLOOKUP(A1446,'Counties and Regions'!$G$3:$J$74,4,FALSE)","v":"Northern"},{"$f":"VLOOKUP(A1446,'Counties and Regions'!$G$3:$J$74,3,FALSE)","v":"Florence County"},"Additional Services","D"]
[{"$f":"IF(COUNTIF($A$9:A1446,A1446)<24,A1446,A1446+1)","v":60},{"$f":"VLOOKUP(A1447,'Counties and Regions'!$G$3:$J$74,4,FALSE)","v":"Northern"},{"$f":"VLOOKUP(A1447,'Counties and Regions'!$G$3:$J$74,3,FALSE)","v":"Florence County"},"Additional Services","B"]
[{"$f":"IF(COUNTIF($A$9:A1447,A1447)<24,A1447,A1447+1)","v":60},{"$f":"VLOOKUP(A1448,'Counties and Regions'!$G$3:$J$74,4,FALSE)","v":"Northern"},{"$f":"VLOOKUP(A1448,'Counties and Regions'!$G$3:$J$74,3,FALSE)","v":"Florence County"},"Additional Services","O"]
[{"$f":"IF(COUNTIF($A$9:A1448,A1448)<24,A1448,A1448+1)","v":61},{"$f":"VLOOKUP(A1449,'Counties and Regions'!$G$3:$J$74,4,FALSE)","v":"Northern"},{"$f":"VLOOKUP(A1449,'Counties and Regions'!$G$3:$J$74,3,FALSE)","v":"Forest County"},"Hospital Inpatient","F"]
[{"$f":"IF(COUNTIF($A$9:A1449,A1449)<24,A1449,A1449+1)","v":61},{"$f":"VLOOKUP(A1450,'Counties and Regions'!$G$3:$J$74,4,FALSE)","v":"Northern"},{"$f":"VLOOKUP(A1450,'Counties and Regions'!$G$3:$J$74,3,FALSE)","v":"Forest County"},"Hospital Inpatient","D"]
[{"$f":"IF(COUNTIF($A$9:A1450,A1450)<24,A1450,A1450+1)","v":61},{"$f":"VLOOKUP(A1451,'Counties and Regions'!$G$3:$J$74,4,FALSE)","v":"Northern"},{"$f":"VLOOKUP(A1451,'Counties and Regions'!$G$3:$J$74,3,FALSE)","v":"Forest County"},"Hospital Inpatient","B"]
[{"$f":"IF(COUNTIF($A$9:A1451,A1451)<24,A1451,A1451+1)","v":61},{"$f":"VLOOKUP(A1452,'Counties and Regions'!$G$3:$J$74,4,FALSE)","v":"Northern"},{"$f":"VLOOKUP(A1452,'Counties and Regions'!$G$3:$J$74,3,FALSE)","v":"Forest County"},"Hospital Inpatient","O"]
[{"$f":"IF(COUNTIF($A$9:A1452,A1452)<24,A1452,A1452+1)","v":61},{"$f":"VLOOKUP(A1453,'Counties and Regions'!$G$3:$J$74,4,FALSE)","v":"Northern"},{"$f":"VLOOKUP(A1453,'Counties and Regions'!$G$3:$J$74,3,FALSE)","v":"Forest County"},"Hospital Outpatient","F"]
[{"$f":"IF(COUNTIF($A$9:A1453,A1453)<24,A1453,A1453+1)","v":61},{"$f":"VLOOKUP(A1454,'Counties and Regions'!$G$3:$J$74,4,FALSE)","v":"Northern"},{"$f":"VLOOKUP(A1454,'Counties and Regions'!$G$3:$J$74,3,FALSE)","v":"Forest County"},"Hospital Outpatient","D"]
[{"$f":"IF(COUNTIF($A$9:A1454,A1454)<24,A1454,A1454+1)","v":61},{"$f":"VLOOKUP(A1455,'Counties and Regions'!$G$3:$J$74,4,FALSE)","v":"Northern"},{"$f":"VLOOKUP(A1455,'Counties and Regions'!$G$3:$J$74,3,FALSE)","v":"Forest County"},"Hospital Outpatient","B"]
[{"$f":"IF(COUNTIF($A$9:A1455,A1455)<24,A1455,A1455+1)","v":61},{"$f":"VLOOKUP(A1456,'Counties and Regions'!$G$3:$J$74,4,FALSE)","v":"Northern"},{"$f":"VLOOKUP(A1456,'Counties and Regions'!$G$3:$J$74,3,FALSE)","v":"Forest County"},"Hospital Outpatient","O"]
[{"$f":"IF(COUNTIF($A$9:A1456,A1456)<24,A1456,A1456+1)","v":61},{"$f":"VLOOKUP(A1457,'Counties and Regions'!$G$3:$J$74,4,FALSE)","v":"Northern"},{"$f":"VLOOKUP(A1457,'Counties and Regions'!$G$3:$J$74,3,FALSE)","v":"Forest County"},"Other Facility","F"]
[{"$f":"IF(COUNTIF($A$9:A1457,A1457)<24,A1457,A1457+1)","v":61},{"$f":"VLOOKUP(A1458,'Counties and Regions'!$G$3:$J$74,4,FALSE)","v":"Northern"},{"$f":"VLOOKUP(A1458,'Counties and Regions'!$G$3:$J$74,3,FALSE)","v":"Forest County"},"Other Facility","D"]
[{"$f":"IF(COUNTIF($A$9:A1458,A1458)<24,A1458,A1458+1)","v":61},{"$f":"VLOOKUP(A1459,'Counties and Regions'!$G$3:$J$74,4,FALSE)","v":"Northern"},{"$f":"VLOOKUP(A1459,'Counties and Regions'!$G$3:$J$74,3,FALSE)","v":"Forest County"},"Other Facility","B"]
[{"$f":"IF(COUNTIF($A$9:A1459,A1459)<24,A1459,A1459+1)","v":61},{"$f":"VLOOKUP(A1460,'Counties and Regions'!$G$3:$J$74,4,FALSE)","v":"Northern"},{"$f":"VLOOKUP(A1460,'Counties and Regions'!$G$3:$J$74,3,FALSE)","v":"Forest County"},"Other Facility","O"]
[{"$f":"IF(COUNTIF($A$9:A1460,A1460)<24,A1460,A1460+1)","v":61},{"$f":"VLOOKUP(A1461,'Counties and Regions'!$G$3:$J$74,4,FALSE)","v":"Northern"},{"$f":"VLOOKUP(A1461,'Counties and Regions'!$G$3:$J$74,3,FALSE)","v":"Forest County"},"Physician Services","F"]
[{"$f":"IF(COUNTIF($A$9:A1461,A1461)<24,A1461,A1461+1)","v":61},{"$f":"VLOOKUP(A1462,'Counties and Regions'!$G$3:$J$74,4,FALSE)","v":"Northern"},{"$f":"VLOOKUP(A1462,'Counties and Regions'!$G$3:$J$74,3,FALSE)","v":"Forest County"},"Physician Services","D"]
[{"$f":"IF(COUNTIF($A$9:A1462,A1462)<24,A1462,A1462+1)","v":61},{"$f":"VLOOKUP(A1463,'Counties and Regions'!$G$3:$J$74,4,FALSE)","v":"Northern"},{"$f":"VLOOKUP(A1463,'Counties and Regions'!$G$3:$J$74,3,FALSE)","v":"Forest County"},"Physician Services","B"]
[{"$f":"IF(COUNTIF($A$9:A1463,A1463)<24,A1463,A1463+1)","v":61},{"$f":"VLOOKUP(A1464,'Counties and Regions'!$G$3:$J$74,4,FALSE)","v":"Northern"},{"$f":"VLOOKUP(A1464,'Counties and Regions'!$G$3:$J$74,3,FALSE)","v":"Forest County"},"Physician Services","O"]
[{"$f":"IF(COUNTIF($A$9:A1464,A1464)<24,A1464,A1464+1)","v":61},{"$f":"VLOOKUP(A1465,'Counties and Regions'!$G$3:$J$74,4,FALSE)","v":"Northern"},{"$f":"VLOOKUP(A1465,'Counties and Regions'!$G$3:$J$74,3,FALSE)","v":"Forest County"},"Other Services","F"]
[{"$f":"IF(COUNTIF($A$9:A1465,A1465)<24,A1465,A1465+1)","v":61},{"$f":"VLOOKUP(A1466,'Counties and Regions'!$G$3:$J$74,4,FALSE)","v":"Northern"},{"$f":"VLOOKUP(A1466,'Counties and Regions'!$G$3:$J$74,3,FALSE)","v":"Forest County"},"Other Services","D"]
[{"$f":"IF(COUNTIF($A$9:A1466,A1466)<24,A1466,A1466+1)","v":61},{"$f":"VLOOKUP(A1467,'Counties and Regions'!$G$3:$J$74,4,FALSE)","v":"Northern"},{"$f":"VLOOKUP(A1467,'Counties and Regions'!$G$3:$J$74,3,FALSE)","v":"Forest County"},"Other Services","B"]
[{"$f":"IF(COUNTIF($A$9:A1467,A1467)<24,A1467,A1467+1)","v":61},{"$f":"VLOOKUP(A1468,'Counties and Regions'!$G$3:$J$74,4,FALSE)","v":"Northern"},{"$f":"VLOOKUP(A1468,'Counties and Regions'!$G$3:$J$74,3,FALSE)","v":"Forest County"},"Other Services","O"]
[{"$f":"IF(COUNTIF($A$9:A1468,A1468)<24,A1468,A1468+1)","v":61},{"$f":"VLOOKUP(A1469,'Counties and Regions'!$G$3:$J$74,4,FALSE)","v":"Northern"},{"$f":"VLOOKUP(A1469,'Counties and Regions'!$G$3:$J$74,3,FALSE)","v":"Forest County"},"Additional Services","F"]
[{"$f":"IF(COUNTIF($A$9:A1469,A1469)<24,A1469,A1469+1)","v":61},{"$f":"VLOOKUP(A1470,'Counties and Regions'!$G$3:$J$74,4,FALSE)","v":"Northern"},{"$f":"VLOOKUP(A1470,'Counties and Regions'!$G$3:$J$74,3,FALSE)","v":"Forest County"},"Additional Services","D"]
[{"$f":"IF(COUNTIF($A$9:A1470,A1470)<24,A1470,A1470+1)","v":61},{"$f":"VLOOKUP(A1471,'Counties and Regions'!$G$3:$J$74,4,FALSE)","v":"Northern"},{"$f":"VLOOKUP(A1471,'Counties and Regions'!$G$3:$J$74,3,FALSE)","v":"Forest County"},"Additional Services","B"]
[{"$f":"IF(COUNTIF($A$9:A1471,A1471)<24,A1471,A1471+1)","v":61},{"$f":"VLOOKUP(A1472,'Counties and Regions'!$G$3:$J$74,4,FALSE)","v":"Northern"},{"$f":"VLOOKUP(A1472,'Counties and Regions'!$G$3:$J$74,3,FALSE)","v":"Forest County"},"Additional Services","O"]
[{"$f":"IF(COUNTIF($A$9:A1472,A1472)<24,A1472,A1472+1)","v":62},{"$f":"VLOOKUP(A1473,'Counties and Regions'!$G$3:$J$74,4,FALSE)","v":"Northern"},{"$f":"VLOOKUP(A1473,'Counties and Regions'!$G$3:$J$74,3,FALSE)","v":"Iron County"},"Hospital Inpatient","F"]
[{"$f":"IF(COUNTIF($A$9:A1473,A1473)<24,A1473,A1473+1)","v":62},{"$f":"VLOOKUP(A1474,'Counties and Regions'!$G$3:$J$74,4,FALSE)","v":"Northern"},{"$f":"VLOOKUP(A1474,'Counties and Regions'!$G$3:$J$74,3,FALSE)","v":"Iron County"},"Hospital Inpatient","D"]
[{"$f":"IF(COUNTIF($A$9:A1474,A1474)<24,A1474,A1474+1)","v":62},{"$f":"VLOOKUP(A1475,'Counties and Regions'!$G$3:$J$74,4,FALSE)","v":"Northern"},{"$f":"VLOOKUP(A1475,'Counties and Regions'!$G$3:$J$74,3,FALSE)","v":"Iron County"},"Hospital Inpatient","B"]
[{"$f":"IF(COUNTIF($A$9:A1475,A1475)<24,A1475,A1475+1)","v":62},{"$f":"VLOOKUP(A1476,'Counties and Regions'!$G$3:$J$74,4,FALSE)","v":"Northern"},{"$f":"VLOOKUP(A1476,'Counties and Regions'!$G$3:$J$74,3,FALSE)","v":"Iron County"},"Hospital Inpatient","O"]
[{"$f":"IF(COUNTIF($A$9:A1476,A1476)<24,A1476,A1476+1)","v":62},{"$f":"VLOOKUP(A1477,'Counties and Regions'!$G$3:$J$74,4,FALSE)","v":"Northern"},{"$f":"VLOOKUP(A1477,'Counties and Regions'!$G$3:$J$74,3,FALSE)","v":"Iron County"},"Hospital Outpatient","F"]
[{"$f":"IF(COUNTIF($A$9:A1477,A1477)<24,A1477,A1477+1)","v":62},{"$f":"VLOOKUP(A1478,'Counties and Regions'!$G$3:$J$74,4,FALSE)","v":"Northern"},{"$f":"VLOOKUP(A1478,'Counties and Regions'!$G$3:$J$74,3,FALSE)","v":"Iron County"},"Hospital Outpatient","D"]
[{"$f":"IF(COUNTIF($A$9:A1478,A1478)<24,A1478,A1478+1)","v":62},{"$f":"VLOOKUP(A1479,'Counties and Regions'!$G$3:$J$74,4,FALSE)","v":"Northern"},{"$f":"VLOOKUP(A1479,'Counties and Regions'!$G$3:$J$74,3,FALSE)","v":"Iron County"},"Hospital Outpatient","B"]
[{"$f":"IF(COUNTIF($A$9:A1479,A1479)<24,A1479,A1479+1)","v":62},{"$f":"VLOOKUP(A1480,'Counties and Regions'!$G$3:$J$74,4,FALSE)","v":"Northern"},{"$f":"VLOOKUP(A1480,'Counties and Regions'!$G$3:$J$74,3,FALSE)","v":"Iron County"},"Hospital Outpatient","O"]
[{"$f":"IF(COUNTIF($A$9:A1480,A1480)<24,A1480,A1480+1)","v":62},{"$f":"VLOOKUP(A1481,'Counties and Regions'!$G$3:$J$74,4,FALSE)","v":"Northern"},{"$f":"VLOOKUP(A1481,'Counties and Regions'!$G$3:$J$74,3,FALSE)","v":"Iron County"},"Other Facility","F"]
[{"$f":"IF(COUNTIF($A$9:A1481,A1481)<24,A1481,A1481+1)","v":62},{"$f":"VLOOKUP(A1482,'Counties and Regions'!$G$3:$J$74,4,FALSE)","v":"Northern"},{"$f":"VLOOKUP(A1482,'Counties and Regions'!$G$3:$J$74,3,FALSE)","v":"Iron County"},"Other Facility","D"]
[{"$f":"IF(COUNTIF($A$9:A1482,A1482)<24,A1482,A1482+1)","v":62},{"$f":"VLOOKUP(A1483,'Counties and Regions'!$G$3:$J$74,4,FALSE)","v":"Northern"},{"$f":"VLOOKUP(A1483,'Counties and Regions'!$G$3:$J$74,3,FALSE)","v":"Iron County"},"Other Facility","B"]
[{"$f":"IF(COUNTIF($A$9:A1483,A1483)<24,A1483,A1483+1)","v":62},{"$f":"VLOOKUP(A1484,'Counties and Regions'!$G$3:$J$74,4,FALSE)","v":"Northern"},{"$f":"VLOOKUP(A1484,'Counties and Regions'!$G$3:$J$74,3,FALSE)","v":"Iron County"},"Other Facility","O"]
[{"$f":"IF(COUNTIF($A$9:A1484,A1484)<24,A1484,A1484+1)","v":62},{"$f":"VLOOKUP(A1485,'Counties and Regions'!$G$3:$J$74,4,FALSE)","v":"Northern"},{"$f":"VLOOKUP(A1485,'Counties and Regions'!$G$3:$J$74,3,FALSE)","v":"Iron County"},"Physician Services","F"]
[{"$f":"IF(COUNTIF($A$9:A1485,A1485)<24,A1485,A1485+1)","v":62},{"$f":"VLOOKUP(A1486,'Counties and Regions'!$G$3:$J$74,4,FALSE)","v":"Northern"},{"$f":"VLOOKUP(A1486,'Counties and Regions'!$G$3:$J$74,3,FALSE)","v":"Iron County"},"Physician Services","D"]
[{"$f":"IF(COUNTIF($A$9:A1486,A1486)<24,A1486,A1486+1)","v":62},{"$f":"VLOOKUP(A1487,'Counties and Regions'!$G$3:$J$74,4,FALSE)","v":"Northern"},{"$f":"VLOOKUP(A1487,'Counties and Regions'!$G$3:$J$74,3,FALSE)","v":"Iron County"},"Physician Services","B"]
[{"$f":"IF(COUNTIF($A$9:A1487,A1487)<24,A1487,A1487+1)","v":62},{"$f":"VLOOKUP(A1488,'Counties and Regions'!$G$3:$J$74,4,FALSE)","v":"Northern"},{"$f":"VLOOKUP(A1488,'Counties and Regions'!$G$3:$J$74,3,FALSE)","v":"Iron County"},"Physician Services","O"]
[{"$f":"IF(COUNTIF($A$9:A1488,A1488)<24,A1488,A1488+1)","v":62},{"$f":"VLOOKUP(A1489,'Counties and Regions'!$G$3:$J$74,4,FALSE)","v":"Northern"},{"$f":"VLOOKUP(A1489,'Counties and Regions'!$G$3:$J$74,3,FALSE)","v":"Iron County"},"Other Services","F"]
[{"$f":"IF(COUNTIF($A$9:A1489,A1489)<24,A1489,A1489+1)","v":62},{"$f":"VLOOKUP(A1490,'Counties and Regions'!$G$3:$J$74,4,FALSE)","v":"Northern"},{"$f":"VLOOKUP(A1490,'Counties and Regions'!$G$3:$J$74,3,FALSE)","v":"Iron County"},"Other Services","D"]
[{"$f":"IF(COUNTIF($A$9:A1490,A1490)<24,A1490,A1490+1)","v":62},{"$f":"VLOOKUP(A1491,'Counties and Regions'!$G$3:$J$74,4,FALSE)","v":"Northern"},{"$f":"VLOOKUP(A1491,'Counties and Regions'!$G$3:$J$74,3,FALSE)","v":"Iron County"},"Other Services","B"]
[{"$f":"IF(COUNTIF($A$9:A1491,A1491)<24,A1491,A1491+1)","v":62},{"$f":"VLOOKUP(A1492,'Counties and Regions'!$G$3:$J$74,4,FALSE)","v":"Northern"},{"$f":"VLOOKUP(A1492,'Counties and Regions'!$G$3:$J$74,3,FALSE)","v":"Iron County"},"Other Services","O"]
[{"$f":"IF(COUNTIF($A$9:A1492,A1492)<24,A1492,A1492+1)","v":62},{"$f":"VLOOKUP(A1493,'Counties and Regions'!$G$3:$J$74,4,FALSE)","v":"Northern"},{"$f":"VLOOKUP(A1493,'Counties and Regions'!$G$3:$J$74,3,FALSE)","v":"Iron County"},"Additional Services","F"]
[{"$f":"IF(COUNTIF($A$9:A1493,A1493)<24,A1493,A1493+1)","v":62},{"$f":"VLOOKUP(A1494,'Counties and Regions'!$G$3:$J$74,4,FALSE)","v":"Northern"},{"$f":"VLOOKUP(A1494,'Counties and Regions'!$G$3:$J$74,3,FALSE)","v":"Iron County"},"Additional Services","D"]
[{"$f":"IF(COUNTIF($A$9:A1494,A1494)<24,A1494,A1494+1)","v":62},{"$f":"VLOOKUP(A1495,'Counties and Regions'!$G$3:$J$74,4,FALSE)","v":"Northern"},{"$f":"VLOOKUP(A1495,'Counties and Regions'!$G$3:$J$74,3,FALSE)","v":"Iron County"},"Additional Services","B"]
[{"$f":"IF(COUNTIF($A$9:A1495,A1495)<24,A1495,A1495+1)","v":62},{"$f":"VLOOKUP(A1496,'Counties and Regions'!$G$3:$J$74,4,FALSE)","v":"Northern"},{"$f":"VLOOKUP(A1496,'Counties and Regions'!$G$3:$J$74,3,FALSE)","v":"Iron County"},"Additional Services","O"]
[{"$f":"IF(COUNTIF($A$9:A1496,A1496)<24,A1496,A1496+1)","v":63},{"$f":"VLOOKUP(A1497,'Counties and Regions'!$G$3:$J$74,4,FALSE)","v":"Northern"},{"$f":"VLOOKUP(A1497,'Counties and Regions'!$G$3:$J$74,3,FALSE)","v":"Langlade County"},"Hospital Inpatient","F"]
[{"$f":"IF(COUNTIF($A$9:A1497,A1497)<24,A1497,A1497+1)","v":63},{"$f":"VLOOKUP(A1498,'Counties and Regions'!$G$3:$J$74,4,FALSE)","v":"Northern"},{"$f":"VLOOKUP(A1498,'Counties and Regions'!$G$3:$J$74,3,FALSE)","v":"Langlade County"},"Hospital Inpatient","D"]
[{"$f":"IF(COUNTIF($A$9:A1498,A1498)<24,A1498,A1498+1)","v":63},{"$f":"VLOOKUP(A1499,'Counties and Regions'!$G$3:$J$74,4,FALSE)","v":"Northern"},{"$f":"VLOOKUP(A1499,'Counties and Regions'!$G$3:$J$74,3,FALSE)","v":"Langlade County"},"Hospital Inpatient","B"]
[{"$f":"IF(COUNTIF($A$9:A1499,A1499)<24,A1499,A1499+1)","v":63},{"$f":"VLOOKUP(A1500,'Counties and Regions'!$G$3:$J$74,4,FALSE)","v":"Northern"},{"$f":"VLOOKUP(A1500,'Counties and Regions'!$G$3:$J$74,3,FALSE)","v":"Langlade County"},"Hospital Inpatient","O"]
[{"$f":"IF(COUNTIF($A$9:A1500,A1500)<24,A1500,A1500+1)","v":63},{"$f":"VLOOKUP(A1501,'Counties and Regions'!$G$3:$J$74,4,FALSE)","v":"Northern"},{"$f":"VLOOKUP(A1501,'Counties and Regions'!$G$3:$J$74,3,FALSE)","v":"Langlade County"},"Hospital Outpatient","F"]
[{"$f":"IF(COUNTIF($A$9:A1501,A1501)<24,A1501,A1501+1)","v":63},{"$f":"VLOOKUP(A1502,'Counties and Regions'!$G$3:$J$74,4,FALSE)","v":"Northern"},{"$f":"VLOOKUP(A1502,'Counties and Regions'!$G$3:$J$74,3,FALSE)","v":"Langlade County"},"Hospital Outpatient","D"]
[{"$f":"IF(COUNTIF($A$9:A1502,A1502)<24,A1502,A1502+1)","v":63},{"$f":"VLOOKUP(A1503,'Counties and Regions'!$G$3:$J$74,4,FALSE)","v":"Northern"},{"$f":"VLOOKUP(A1503,'Counties and Regions'!$G$3:$J$74,3,FALSE)","v":"Langlade County"},"Hospital Outpatient","B"]
[{"$f":"IF(COUNTIF($A$9:A1503,A1503)<24,A1503,A1503+1)","v":63},{"$f":"VLOOKUP(A1504,'Counties and Regions'!$G$3:$J$74,4,FALSE)","v":"Northern"},{"$f":"VLOOKUP(A1504,'Counties and Regions'!$G$3:$J$74,3,FALSE)","v":"Langlade County"},"Hospital Outpatient","O"]
[{"$f":"IF(COUNTIF($A$9:A1504,A1504)<24,A1504,A1504+1)","v":63},{"$f":"VLOOKUP(A1505,'Counties and Regions'!$G$3:$J$74,4,FALSE)","v":"Northern"},{"$f":"VLOOKUP(A1505,'Counties and Regions'!$G$3:$J$74,3,FALSE)","v":"Langlade County"},"Other Facility","F"]
[{"$f":"IF(COUNTIF($A$9:A1505,A1505)<24,A1505,A1505+1)","v":63},{"$f":"VLOOKUP(A1506,'Counties and Regions'!$G$3:$J$74,4,FALSE)","v":"Northern"},{"$f":"VLOOKUP(A1506,'Counties and Regions'!$G$3:$J$74,3,FALSE)","v":"Langlade County"},"Other Facility","D"]
[{"$f":"IF(COUNTIF($A$9:A1506,A1506)<24,A1506,A1506+1)","v":63},{"$f":"VLOOKUP(A1507,'Counties and Regions'!$G$3:$J$74,4,FALSE)","v":"Northern"},{"$f":"VLOOKUP(A1507,'Counties and Regions'!$G$3:$J$74,3,FALSE)","v":"Langlade County"},"Other Facility","B"]
[{"$f":"IF(COUNTIF($A$9:A1507,A1507)<24,A1507,A1507+1)","v":63},{"$f":"VLOOKUP(A1508,'Counties and Regions'!$G$3:$J$74,4,FALSE)","v":"Northern"},{"$f":"VLOOKUP(A1508,'Counties and Regions'!$G$3:$J$74,3,FALSE)","v":"Langlade County"},"Other Facility","O"]
[{"$f":"IF(COUNTIF($A$9:A1508,A1508)<24,A1508,A1508+1)","v":63},{"$f":"VLOOKUP(A1509,'Counties and Regions'!$G$3:$J$74,4,FALSE)","v":"Northern"},{"$f":"VLOOKUP(A1509,'Counties and Regions'!$G$3:$J$74,3,FALSE)","v":"Langlade County"},"Physician Services","F"]
[{"$f":"IF(COUNTIF($A$9:A1509,A1509)<24,A1509,A1509+1)","v":63},{"$f":"VLOOKUP(A1510,'Counties and Regions'!$G$3:$J$74,4,FALSE)","v":"Northern"},{"$f":"VLOOKUP(A1510,'Counties and Regions'!$G$3:$J$74,3,FALSE)","v":"Langlade County"},"Physician Services","D"]
[{"$f":"IF(COUNTIF($A$9:A1510,A1510)<24,A1510,A1510+1)","v":63},{"$f":"VLOOKUP(A1511,'Counties and Regions'!$G$3:$J$74,4,FALSE)","v":"Northern"},{"$f":"VLOOKUP(A1511,'Counties and Regions'!$G$3:$J$74,3,FALSE)","v":"Langlade County"},"Physician Services","B"]
[{"$f":"IF(COUNTIF($A$9:A1511,A1511)<24,A1511,A1511+1)","v":63},{"$f":"VLOOKUP(A1512,'Counties and Regions'!$G$3:$J$74,4,FALSE)","v":"Northern"},{"$f":"VLOOKUP(A1512,'Counties and Regions'!$G$3:$J$74,3,FALSE)","v":"Langlade County"},"Physician Services","O"]
[{"$f":"IF(COUNTIF($A$9:A1512,A1512)<24,A1512,A1512+1)","v":63},{"$f":"VLOOKUP(A1513,'Counties and Regions'!$G$3:$J$74,4,FALSE)","v":"Northern"},{"$f":"VLOOKUP(A1513,'Counties and Regions'!$G$3:$J$74,3,FALSE)","v":"Langlade County"},"Other Services","F"]
[{"$f":"IF(COUNTIF($A$9:A1513,A1513)<24,A1513,A1513+1)","v":63},{"$f":"VLOOKUP(A1514,'Counties and Regions'!$G$3:$J$74,4,FALSE)","v":"Northern"},{"$f":"VLOOKUP(A1514,'Counties and Regions'!$G$3:$J$74,3,FALSE)","v":"Langlade County"},"Other Services","D"]
[{"$f":"IF(COUNTIF($A$9:A1514,A1514)<24,A1514,A1514+1)","v":63},{"$f":"VLOOKUP(A1515,'Counties and Regions'!$G$3:$J$74,4,FALSE)","v":"Northern"},{"$f":"VLOOKUP(A1515,'Counties and Regions'!$G$3:$J$74,3,FALSE)","v":"Langlade County"},"Other Services","B"]
[{"$f":"IF(COUNTIF($A$9:A1515,A1515)<24,A1515,A1515+1)","v":63},{"$f":"VLOOKUP(A1516,'Counties and Regions'!$G$3:$J$74,4,FALSE)","v":"Northern"},{"$f":"VLOOKUP(A1516,'Counties and Regions'!$G$3:$J$74,3,FALSE)","v":"Langlade County"},"Other Services","O"]
[{"$f":"IF(COUNTIF($A$9:A1516,A1516)<24,A1516,A1516+1)","v":63},{"$f":"VLOOKUP(A1517,'Counties and Regions'!$G$3:$J$74,4,FALSE)","v":"Northern"},{"$f":"VLOOKUP(A1517,'Counties and Regions'!$G$3:$J$74,3,FALSE)","v":"Langlade County"},"Additional Services","F"]
[{"$f":"IF(COUNTIF($A$9:A1517,A1517)<24,A1517,A1517+1)","v":63},{"$f":"VLOOKUP(A1518,'Counties and Regions'!$G$3:$J$74,4,FALSE)","v":"Northern"},{"$f":"VLOOKUP(A1518,'Counties and Regions'!$G$3:$J$74,3,FALSE)","v":"Langlade County"},"Additional Services","D"]
[{"$f":"IF(COUNTIF($A$9:A1518,A1518)<24,A1518,A1518+1)","v":63},{"$f":"VLOOKUP(A1519,'Counties and Regions'!$G$3:$J$74,4,FALSE)","v":"Northern"},{"$f":"VLOOKUP(A1519,'Counties and Regions'!$G$3:$J$74,3,FALSE)","v":"Langlade County"},"Additional Services","B"]
[{"$f":"IF(COUNTIF($A$9:A1519,A1519)<24,A1519,A1519+1)","v":63},{"$f":"VLOOKUP(A1520,'Counties and Regions'!$G$3:$J$74,4,FALSE)","v":"Northern"},{"$f":"VLOOKUP(A1520,'Counties and Regions'!$G$3:$J$74,3,FALSE)","v":"Langlade County"},"Additional Services","O"]
[{"$f":"IF(COUNTIF($A$9:A1520,A1520)<24,A1520,A1520+1)","v":64},{"$f":"VLOOKUP(A1521,'Counties and Regions'!$G$3:$J$74,4,FALSE)","v":"Northern"},{"$f":"VLOOKUP(A1521,'Counties and Regions'!$G$3:$J$74,3,FALSE)","v":"Lincoln County"},"Hospital Inpatient","F"]
[{"$f":"IF(COUNTIF($A$9:A1521,A1521)<24,A1521,A1521+1)","v":64},{"$f":"VLOOKUP(A1522,'Counties and Regions'!$G$3:$J$74,4,FALSE)","v":"Northern"},{"$f":"VLOOKUP(A1522,'Counties and Regions'!$G$3:$J$74,3,FALSE)","v":"Lincoln County"},"Hospital Inpatient","D"]
[{"$f":"IF(COUNTIF($A$9:A1522,A1522)<24,A1522,A1522+1)","v":64},{"$f":"VLOOKUP(A1523,'Counties and Regions'!$G$3:$J$74,4,FALSE)","v":"Northern"},{"$f":"VLOOKUP(A1523,'Counties and Regions'!$G$3:$J$74,3,FALSE)","v":"Lincoln County"},"Hospital Inpatient","B"]
[{"$f":"IF(COUNTIF($A$9:A1523,A1523)<24,A1523,A1523+1)","v":64},{"$f":"VLOOKUP(A1524,'Counties and Regions'!$G$3:$J$74,4,FALSE)","v":"Northern"},{"$f":"VLOOKUP(A1524,'Counties and Regions'!$G$3:$J$74,3,FALSE)","v":"Lincoln County"},"Hospital Inpatient","O"]
[{"$f":"IF(COUNTIF($A$9:A1524,A1524)<24,A1524,A1524+1)","v":64},{"$f":"VLOOKUP(A1525,'Counties and Regions'!$G$3:$J$74,4,FALSE)","v":"Northern"},{"$f":"VLOOKUP(A1525,'Counties and Regions'!$G$3:$J$74,3,FALSE)","v":"Lincoln County"},"Hospital Outpatient","F"]
[{"$f":"IF(COUNTIF($A$9:A1525,A1525)<24,A1525,A1525+1)","v":64},{"$f":"VLOOKUP(A1526,'Counties and Regions'!$G$3:$J$74,4,FALSE)","v":"Northern"},{"$f":"VLOOKUP(A1526,'Counties and Regions'!$G$3:$J$74,3,FALSE)","v":"Lincoln County"},"Hospital Outpatient","D"]
[{"$f":"IF(COUNTIF($A$9:A1526,A1526)<24,A1526,A1526+1)","v":64},{"$f":"VLOOKUP(A1527,'Counties and Regions'!$G$3:$J$74,4,FALSE)","v":"Northern"},{"$f":"VLOOKUP(A1527,'Counties and Regions'!$G$3:$J$74,3,FALSE)","v":"Lincoln County"},"Hospital Outpatient","B"]
[{"$f":"IF(COUNTIF($A$9:A1527,A1527)<24,A1527,A1527+1)","v":64},{"$f":"VLOOKUP(A1528,'Counties and Regions'!$G$3:$J$74,4,FALSE)","v":"Northern"},{"$f":"VLOOKUP(A1528,'Counties and Regions'!$G$3:$J$74,3,FALSE)","v":"Lincoln County"},"Hospital Outpatient","O"]
[{"$f":"IF(COUNTIF($A$9:A1528,A1528)<24,A1528,A1528+1)","v":64},{"$f":"VLOOKUP(A1529,'Counties and Regions'!$G$3:$J$74,4,FALSE)","v":"Northern"},{"$f":"VLOOKUP(A1529,'Counties and Regions'!$G$3:$J$74,3,FALSE)","v":"Lincoln County"},"Other Facility","F"]
[{"$f":"IF(COUNTIF($A$9:A1529,A1529)<24,A1529,A1529+1)","v":64},{"$f":"VLOOKUP(A1530,'Counties and Regions'!$G$3:$J$74,4,FALSE)","v":"Northern"},{"$f":"VLOOKUP(A1530,'Counties and Regions'!$G$3:$J$74,3,FALSE)","v":"Lincoln County"},"Other Facility","D"]
[{"$f":"IF(COUNTIF($A$9:A1530,A1530)<24,A1530,A1530+1)","v":64},{"$f":"VLOOKUP(A1531,'Counties and Regions'!$G$3:$J$74,4,FALSE)","v":"Northern"},{"$f":"VLOOKUP(A1531,'Counties and Regions'!$G$3:$J$74,3,FALSE)","v":"Lincoln County"},"Other Facility","B"]
[{"$f":"IF(COUNTIF($A$9:A1531,A1531)<24,A1531,A1531+1)","v":64},{"$f":"VLOOKUP(A1532,'Counties and Regions'!$G$3:$J$74,4,FALSE)","v":"Northern"},{"$f":"VLOOKUP(A1532,'Counties and Regions'!$G$3:$J$74,3,FALSE)","v":"Lincoln County"},"Other Facility","O"]
[{"$f":"IF(COUNTIF($A$9:A1532,A1532)<24,A1532,A1532+1)","v":64},{"$f":"VLOOKUP(A1533,'Counties and Regions'!$G$3:$J$74,4,FALSE)","v":"Northern"},{"$f":"VLOOKUP(A1533,'Counties and Regions'!$G$3:$J$74,3,FALSE)","v":"Lincoln County"},"Physician Services","F"]
[{"$f":"IF(COUNTIF($A$9:A1533,A1533)<24,A1533,A1533+1)","v":64},{"$f":"VLOOKUP(A1534,'Counties and Regions'!$G$3:$J$74,4,FALSE)","v":"Northern"},{"$f":"VLOOKUP(A1534,'Counties and Regions'!$G$3:$J$74,3,FALSE)","v":"Lincoln County"},"Physician Services","D"]
[{"$f":"IF(COUNTIF($A$9:A1534,A1534)<24,A1534,A1534+1)","v":64},{"$f":"VLOOKUP(A1535,'Counties and Regions'!$G$3:$J$74,4,FALSE)","v":"Northern"},{"$f":"VLOOKUP(A1535,'Counties and Regions'!$G$3:$J$74,3,FALSE)","v":"Lincoln County"},"Physician Services","B"]
[{"$f":"IF(COUNTIF($A$9:A1535,A1535)<24,A1535,A1535+1)","v":64},{"$f":"VLOOKUP(A1536,'Counties and Regions'!$G$3:$J$74,4,FALSE)","v":"Northern"},{"$f":"VLOOKUP(A1536,'Counties and Regions'!$G$3:$J$74,3,FALSE)","v":"Lincoln County"},"Physician Services","O"]
[{"$f":"IF(COUNTIF($A$9:A1536,A1536)<24,A1536,A1536+1)","v":64},{"$f":"VLOOKUP(A1537,'Counties and Regions'!$G$3:$J$74,4,FALSE)","v":"Northern"},{"$f":"VLOOKUP(A1537,'Counties and Regions'!$G$3:$J$74,3,FALSE)","v":"Lincoln County"},"Other Services","F"]
[{"$f":"IF(COUNTIF($A$9:A1537,A1537)<24,A1537,A1537+1)","v":64},{"$f":"VLOOKUP(A1538,'Counties and Regions'!$G$3:$J$74,4,FALSE)","v":"Northern"},{"$f":"VLOOKUP(A1538,'Counties and Regions'!$G$3:$J$74,3,FALSE)","v":"Lincoln County"},"Other Services","D"]
[{"$f":"IF(COUNTIF($A$9:A1538,A1538)<24,A1538,A1538+1)","v":64},{"$f":"VLOOKUP(A1539,'Counties and Regions'!$G$3:$J$74,4,FALSE)","v":"Northern"},{"$f":"VLOOKUP(A1539,'Counties and Regions'!$G$3:$J$74,3,FALSE)","v":"Lincoln County"},"Other Services","B"]
[{"$f":"IF(COUNTIF($A$9:A1539,A1539)<24,A1539,A1539+1)","v":64},{"$f":"VLOOKUP(A1540,'Counties and Regions'!$G$3:$J$74,4,FALSE)","v":"Northern"},{"$f":"VLOOKUP(A1540,'Counties and Regions'!$G$3:$J$74,3,FALSE)","v":"Lincoln County"},"Other Services","O"]
[{"$f":"IF(COUNTIF($A$9:A1540,A1540)<24,A1540,A1540+1)","v":64},{"$f":"VLOOKUP(A1541,'Counties and Regions'!$G$3:$J$74,4,FALSE)","v":"Northern"},{"$f":"VLOOKUP(A1541,'Counties and Regions'!$G$3:$J$74,3,FALSE)","v":"Lincoln County"},"Additional Services","F"]
[{"$f":"IF(COUNTIF($A$9:A1541,A1541)<24,A1541,A1541+1)","v":64},{"$f":"VLOOKUP(A1542,'Counties and Regions'!$G$3:$J$74,4,FALSE)","v":"Northern"},{"$f":"VLOOKUP(A1542,'Counties and Regions'!$G$3:$J$74,3,FALSE)","v":"Lincoln County"},"Additional Services","D"]
[{"$f":"IF(COUNTIF($A$9:A1542,A1542)<24,A1542,A1542+1)","v":64},{"$f":"VLOOKUP(A1543,'Counties and Regions'!$G$3:$J$74,4,FALSE)","v":"Northern"},{"$f":"VLOOKUP(A1543,'Counties and Regions'!$G$3:$J$74,3,FALSE)","v":"Lincoln County"},"Additional Services","B"]
[{"$f":"IF(COUNTIF($A$9:A1543,A1543)<24,A1543,A1543+1)","v":64},{"$f":"VLOOKUP(A1544,'Counties and Regions'!$G$3:$J$74,4,FALSE)","v":"Northern"},{"$f":"VLOOKUP(A1544,'Counties and Regions'!$G$3:$J$74,3,FALSE)","v":"Lincoln County"},"Additional Services","O"]
[{"$f":"IF(COUNTIF($A$9:A1544,A1544)<24,A1544,A1544+1)","v":65},{"$f":"VLOOKUP(A1545,'Counties and Regions'!$G$3:$J$74,4,FALSE)","v":"Northern"},{"$f":"VLOOKUP(A1545,'Counties and Regions'!$G$3:$J$74,3,FALSE)","v":"Marathon County"},"Hospital Inpatient","F"]
[{"$f":"IF(COUNTIF($A$9:A1545,A1545)<24,A1545,A1545+1)","v":65},{"$f":"VLOOKUP(A1546,'Counties and Regions'!$G$3:$J$74,4,FALSE)","v":"Northern"},{"$f":"VLOOKUP(A1546,'Counties and Regions'!$G$3:$J$74,3,FALSE)","v":"Marathon County"},"Hospital Inpatient","D"]
[{"$f":"IF(COUNTIF($A$9:A1546,A1546)<24,A1546,A1546+1)","v":65},{"$f":"VLOOKUP(A1547,'Counties and Regions'!$G$3:$J$74,4,FALSE)","v":"Northern"},{"$f":"VLOOKUP(A1547,'Counties and Regions'!$G$3:$J$74,3,FALSE)","v":"Marathon County"},"Hospital Inpatient","B"]
[{"$f":"IF(COUNTIF($A$9:A1547,A1547)<24,A1547,A1547+1)","v":65},{"$f":"VLOOKUP(A1548,'Counties and Regions'!$G$3:$J$74,4,FALSE)","v":"Northern"},{"$f":"VLOOKUP(A1548,'Counties and Regions'!$G$3:$J$74,3,FALSE)","v":"Marathon County"},"Hospital Inpatient","O"]
[{"$f":"IF(COUNTIF($A$9:A1548,A1548)<24,A1548,A1548+1)","v":65},{"$f":"VLOOKUP(A1549,'Counties and Regions'!$G$3:$J$74,4,FALSE)","v":"Northern"},{"$f":"VLOOKUP(A1549,'Counties and Regions'!$G$3:$J$74,3,FALSE)","v":"Marathon County"},"Hospital Outpatient","F"]
[{"$f":"IF(COUNTIF($A$9:A1549,A1549)<24,A1549,A1549+1)","v":65},{"$f":"VLOOKUP(A1550,'Counties and Regions'!$G$3:$J$74,4,FALSE)","v":"Northern"},{"$f":"VLOOKUP(A1550,'Counties and Regions'!$G$3:$J$74,3,FALSE)","v":"Marathon County"},"Hospital Outpatient","D"]
[{"$f":"IF(COUNTIF($A$9:A1550,A1550)<24,A1550,A1550+1)","v":65},{"$f":"VLOOKUP(A1551,'Counties and Regions'!$G$3:$J$74,4,FALSE)","v":"Northern"},{"$f":"VLOOKUP(A1551,'Counties and Regions'!$G$3:$J$74,3,FALSE)","v":"Marathon County"},"Hospital Outpatient","B"]
[{"$f":"IF(COUNTIF($A$9:A1551,A1551)<24,A1551,A1551+1)","v":65},{"$f":"VLOOKUP(A1552,'Counties and Regions'!$G$3:$J$74,4,FALSE)","v":"Northern"},{"$f":"VLOOKUP(A1552,'Counties and Regions'!$G$3:$J$74,3,FALSE)","v":"Marathon County"},"Hospital Outpatient","O"]
[{"$f":"IF(COUNTIF($A$9:A1552,A1552)<24,A1552,A1552+1)","v":65},{"$f":"VLOOKUP(A1553,'Counties and Regions'!$G$3:$J$74,4,FALSE)","v":"Northern"},{"$f":"VLOOKUP(A1553,'Counties and Regions'!$G$3:$J$74,3,FALSE)","v":"Marathon County"},"Other Facility","F"]
[{"$f":"IF(COUNTIF($A$9:A1553,A1553)<24,A1553,A1553+1)","v":65},{"$f":"VLOOKUP(A1554,'Counties and Regions'!$G$3:$J$74,4,FALSE)","v":"Northern"},{"$f":"VLOOKUP(A1554,'Counties and Regions'!$G$3:$J$74,3,FALSE)","v":"Marathon County"},"Other Facility","D"]
[{"$f":"IF(COUNTIF($A$9:A1554,A1554)<24,A1554,A1554+1)","v":65},{"$f":"VLOOKUP(A1555,'Counties and Regions'!$G$3:$J$74,4,FALSE)","v":"Northern"},{"$f":"VLOOKUP(A1555,'Counties and Regions'!$G$3:$J$74,3,FALSE)","v":"Marathon County"},"Other Facility","B"]
[{"$f":"IF(COUNTIF($A$9:A1555,A1555)<24,A1555,A1555+1)","v":65},{"$f":"VLOOKUP(A1556,'Counties and Regions'!$G$3:$J$74,4,FALSE)","v":"Northern"},{"$f":"VLOOKUP(A1556,'Counties and Regions'!$G$3:$J$74,3,FALSE)","v":"Marathon County"},"Other Facility","O"]
[{"$f":"IF(COUNTIF($A$9:A1556,A1556)<24,A1556,A1556+1)","v":65},{"$f":"VLOOKUP(A1557,'Counties and Regions'!$G$3:$J$74,4,FALSE)","v":"Northern"},{"$f":"VLOOKUP(A1557,'Counties and Regions'!$G$3:$J$74,3,FALSE)","v":"Marathon County"},"Physician Services","F"]
[{"$f":"IF(COUNTIF($A$9:A1557,A1557)<24,A1557,A1557+1)","v":65},{"$f":"VLOOKUP(A1558,'Counties and Regions'!$G$3:$J$74,4,FALSE)","v":"Northern"},{"$f":"VLOOKUP(A1558,'Counties and Regions'!$G$3:$J$74,3,FALSE)","v":"Marathon County"},"Physician Services","D"]
[{"$f":"IF(COUNTIF($A$9:A1558,A1558)<24,A1558,A1558+1)","v":65},{"$f":"VLOOKUP(A1559,'Counties and Regions'!$G$3:$J$74,4,FALSE)","v":"Northern"},{"$f":"VLOOKUP(A1559,'Counties and Regions'!$G$3:$J$74,3,FALSE)","v":"Marathon County"},"Physician Services","B"]
[{"$f":"IF(COUNTIF($A$9:A1559,A1559)<24,A1559,A1559+1)","v":65},{"$f":"VLOOKUP(A1560,'Counties and Regions'!$G$3:$J$74,4,FALSE)","v":"Northern"},{"$f":"VLOOKUP(A1560,'Counties and Regions'!$G$3:$J$74,3,FALSE)","v":"Marathon County"},"Physician Services","O"]
[{"$f":"IF(COUNTIF($A$9:A1560,A1560)<24,A1560,A1560+1)","v":65},{"$f":"VLOOKUP(A1561,'Counties and Regions'!$G$3:$J$74,4,FALSE)","v":"Northern"},{"$f":"VLOOKUP(A1561,'Counties and Regions'!$G$3:$J$74,3,FALSE)","v":"Marathon County"},"Other Services","F"]
[{"$f":"IF(COUNTIF($A$9:A1561,A1561)<24,A1561,A1561+1)","v":65},{"$f":"VLOOKUP(A1562,'Counties and Regions'!$G$3:$J$74,4,FALSE)","v":"Northern"},{"$f":"VLOOKUP(A1562,'Counties and Regions'!$G$3:$J$74,3,FALSE)","v":"Marathon County"},"Other Services","D"]
[{"$f":"IF(COUNTIF($A$9:A1562,A1562)<24,A1562,A1562+1)","v":65},{"$f":"VLOOKUP(A1563,'Counties and Regions'!$G$3:$J$74,4,FALSE)","v":"Northern"},{"$f":"VLOOKUP(A1563,'Counties and Regions'!$G$3:$J$74,3,FALSE)","v":"Marathon County"},"Other Services","B"]
[{"$f":"IF(COUNTIF($A$9:A1563,A1563)<24,A1563,A1563+1)","v":65},{"$f":"VLOOKUP(A1564,'Counties and Regions'!$G$3:$J$74,4,FALSE)","v":"Northern"},{"$f":"VLOOKUP(A1564,'Counties and Regions'!$G$3:$J$74,3,FALSE)","v":"Marathon County"},"Other Services","O"]
[{"$f":"IF(COUNTIF($A$9:A1564,A1564)<24,A1564,A1564+1)","v":65},{"$f":"VLOOKUP(A1565,'Counties and Regions'!$G$3:$J$74,4,FALSE)","v":"Northern"},{"$f":"VLOOKUP(A1565,'Counties and Regions'!$G$3:$J$74,3,FALSE)","v":"Marathon County"},"Additional Services","F"]
[{"$f":"IF(COUNTIF($A$9:A1565,A1565)<24,A1565,A1565+1)","v":65},{"$f":"VLOOKUP(A1566,'Counties and Regions'!$G$3:$J$74,4,FALSE)","v":"Northern"},{"$f":"VLOOKUP(A1566,'Counties and Regions'!$G$3:$J$74,3,FALSE)","v":"Marathon County"},"Additional Services","D"]
[{"$f":"IF(COUNTIF($A$9:A1566,A1566)<24,A1566,A1566+1)","v":65},{"$f":"VLOOKUP(A1567,'Counties and Regions'!$G$3:$J$74,4,FALSE)","v":"Northern"},{"$f":"VLOOKUP(A1567,'Counties and Regions'!$G$3:$J$74,3,FALSE)","v":"Marathon County"},"Additional Services","B"]
[{"$f":"IF(COUNTIF($A$9:A1567,A1567)<24,A1567,A1567+1)","v":65},{"$f":"VLOOKUP(A1568,'Counties and Regions'!$G$3:$J$74,4,FALSE)","v":"Northern"},{"$f":"VLOOKUP(A1568,'Counties and Regions'!$G$3:$J$74,3,FALSE)","v":"Marathon County"},"Additional Services","O"]
[{"$f":"IF(COUNTIF($A$9:A1568,A1568)<24,A1568,A1568+1)","v":66},{"$f":"VLOOKUP(A1569,'Counties and Regions'!$G$3:$J$74,4,FALSE)","v":"Northern"},{"$f":"VLOOKUP(A1569,'Counties and Regions'!$G$3:$J$74,3,FALSE)","v":"Oneida County"},"Hospital Inpatient","F"]
[{"$f":"IF(COUNTIF($A$9:A1569,A1569)<24,A1569,A1569+1)","v":66},{"$f":"VLOOKUP(A1570,'Counties and Regions'!$G$3:$J$74,4,FALSE)","v":"Northern"},{"$f":"VLOOKUP(A1570,'Counties and Regions'!$G$3:$J$74,3,FALSE)","v":"Oneida County"},"Hospital Inpatient","D"]
[{"$f":"IF(COUNTIF($A$9:A1570,A1570)<24,A1570,A1570+1)","v":66},{"$f":"VLOOKUP(A1571,'Counties and Regions'!$G$3:$J$74,4,FALSE)","v":"Northern"},{"$f":"VLOOKUP(A1571,'Counties and Regions'!$G$3:$J$74,3,FALSE)","v":"Oneida County"},"Hospital Inpatient","B"]
[{"$f":"IF(COUNTIF($A$9:A1571,A1571)<24,A1571,A1571+1)","v":66},{"$f":"VLOOKUP(A1572,'Counties and Regions'!$G$3:$J$74,4,FALSE)","v":"Northern"},{"$f":"VLOOKUP(A1572,'Counties and Regions'!$G$3:$J$74,3,FALSE)","v":"Oneida County"},"Hospital Inpatient","O"]
[{"$f":"IF(COUNTIF($A$9:A1572,A1572)<24,A1572,A1572+1)","v":66},{"$f":"VLOOKUP(A1573,'Counties and Regions'!$G$3:$J$74,4,FALSE)","v":"Northern"},{"$f":"VLOOKUP(A1573,'Counties and Regions'!$G$3:$J$74,3,FALSE)","v":"Oneida County"},"Hospital Outpatient","F"]
[{"$f":"IF(COUNTIF($A$9:A1573,A1573)<24,A1573,A1573+1)","v":66},{"$f":"VLOOKUP(A1574,'Counties and Regions'!$G$3:$J$74,4,FALSE)","v":"Northern"},{"$f":"VLOOKUP(A1574,'Counties and Regions'!$G$3:$J$74,3,FALSE)","v":"Oneida County"},"Hospital Outpatient","D"]
[{"$f":"IF(COUNTIF($A$9:A1574,A1574)<24,A1574,A1574+1)","v":66},{"$f":"VLOOKUP(A1575,'Counties and Regions'!$G$3:$J$74,4,FALSE)","v":"Northern"},{"$f":"VLOOKUP(A1575,'Counties and Regions'!$G$3:$J$74,3,FALSE)","v":"Oneida County"},"Hospital Outpatient","B"]
[{"$f":"IF(COUNTIF($A$9:A1575,A1575)<24,A1575,A1575+1)","v":66},{"$f":"VLOOKUP(A1576,'Counties and Regions'!$G$3:$J$74,4,FALSE)","v":"Northern"},{"$f":"VLOOKUP(A1576,'Counties and Regions'!$G$3:$J$74,3,FALSE)","v":"Oneida County"},"Hospital Outpatient","O"]
[{"$f":"IF(COUNTIF($A$9:A1576,A1576)<24,A1576,A1576+1)","v":66},{"$f":"VLOOKUP(A1577,'Counties and Regions'!$G$3:$J$74,4,FALSE)","v":"Northern"},{"$f":"VLOOKUP(A1577,'Counties and Regions'!$G$3:$J$74,3,FALSE)","v":"Oneida County"},"Other Facility","F"]
[{"$f":"IF(COUNTIF($A$9:A1577,A1577)<24,A1577,A1577+1)","v":66},{"$f":"VLOOKUP(A1578,'Counties and Regions'!$G$3:$J$74,4,FALSE)","v":"Northern"},{"$f":"VLOOKUP(A1578,'Counties and Regions'!$G$3:$J$74,3,FALSE)","v":"Oneida County"},"Other Facility","D"]
[{"$f":"IF(COUNTIF($A$9:A1578,A1578)<24,A1578,A1578+1)","v":66},{"$f":"VLOOKUP(A1579,'Counties and Regions'!$G$3:$J$74,4,FALSE)","v":"Northern"},{"$f":"VLOOKUP(A1579,'Counties and Regions'!$G$3:$J$74,3,FALSE)","v":"Oneida County"},"Other Facility","B"]
[{"$f":"IF(COUNTIF($A$9:A1579,A1579)<24,A1579,A1579+1)","v":66},{"$f":"VLOOKUP(A1580,'Counties and Regions'!$G$3:$J$74,4,FALSE)","v":"Northern"},{"$f":"VLOOKUP(A1580,'Counties and Regions'!$G$3:$J$74,3,FALSE)","v":"Oneida County"},"Other Facility","O"]
[{"$f":"IF(COUNTIF($A$9:A1580,A1580)<24,A1580,A1580+1)","v":66},{"$f":"VLOOKUP(A1581,'Counties and Regions'!$G$3:$J$74,4,FALSE)","v":"Northern"},{"$f":"VLOOKUP(A1581,'Counties and Regions'!$G$3:$J$74,3,FALSE)","v":"Oneida County"},"Physician Services","F"]
[{"$f":"IF(COUNTIF($A$9:A1581,A1581)<24,A1581,A1581+1)","v":66},{"$f":"VLOOKUP(A1582,'Counties and Regions'!$G$3:$J$74,4,FALSE)","v":"Northern"},{"$f":"VLOOKUP(A1582,'Counties and Regions'!$G$3:$J$74,3,FALSE)","v":"Oneida County"},"Physician Services","D"]
[{"$f":"IF(COUNTIF($A$9:A1582,A1582)<24,A1582,A1582+1)","v":66},{"$f":"VLOOKUP(A1583,'Counties and Regions'!$G$3:$J$74,4,FALSE)","v":"Northern"},{"$f":"VLOOKUP(A1583,'Counties and Regions'!$G$3:$J$74,3,FALSE)","v":"Oneida County"},"Physician Services","B"]
[{"$f":"IF(COUNTIF($A$9:A1583,A1583)<24,A1583,A1583+1)","v":66},{"$f":"VLOOKUP(A1584,'Counties and Regions'!$G$3:$J$74,4,FALSE)","v":"Northern"},{"$f":"VLOOKUP(A1584,'Counties and Regions'!$G$3:$J$74,3,FALSE)","v":"Oneida County"},"Physician Services","O"]
[{"$f":"IF(COUNTIF($A$9:A1584,A1584)<24,A1584,A1584+1)","v":66},{"$f":"VLOOKUP(A1585,'Counties and Regions'!$G$3:$J$74,4,FALSE)","v":"Northern"},{"$f":"VLOOKUP(A1585,'Counties and Regions'!$G$3:$J$74,3,FALSE)","v":"Oneida County"},"Other Services","F"]
[{"$f":"IF(COUNTIF($A$9:A1585,A1585)<24,A1585,A1585+1)","v":66},{"$f":"VLOOKUP(A1586,'Counties and Regions'!$G$3:$J$74,4,FALSE)","v":"Northern"},{"$f":"VLOOKUP(A1586,'Counties and Regions'!$G$3:$J$74,3,FALSE)","v":"Oneida County"},"Other Services","D"]
[{"$f":"IF(COUNTIF($A$9:A1586,A1586)<24,A1586,A1586+1)","v":66},{"$f":"VLOOKUP(A1587,'Counties and Regions'!$G$3:$J$74,4,FALSE)","v":"Northern"},{"$f":"VLOOKUP(A1587,'Counties and Regions'!$G$3:$J$74,3,FALSE)","v":"Oneida County"},"Other Services","B"]
[{"$f":"IF(COUNTIF($A$9:A1587,A1587)<24,A1587,A1587+1)","v":66},{"$f":"VLOOKUP(A1588,'Counties and Regions'!$G$3:$J$74,4,FALSE)","v":"Northern"},{"$f":"VLOOKUP(A1588,'Counties and Regions'!$G$3:$J$74,3,FALSE)","v":"Oneida County"},"Other Services","O"]
[{"$f":"IF(COUNTIF($A$9:A1588,A1588)<24,A1588,A1588+1)","v":66},{"$f":"VLOOKUP(A1589,'Counties and Regions'!$G$3:$J$74,4,FALSE)","v":"Northern"},{"$f":"VLOOKUP(A1589,'Counties and Regions'!$G$3:$J$74,3,FALSE)","v":"Oneida County"},"Additional Services","F"]
[{"$f":"IF(COUNTIF($A$9:A1589,A1589)<24,A1589,A1589+1)","v":66},{"$f":"VLOOKUP(A1590,'Counties and Regions'!$G$3:$J$74,4,FALSE)","v":"Northern"},{"$f":"VLOOKUP(A1590,'Counties and Regions'!$G$3:$J$74,3,FALSE)","v":"Oneida County"},"Additional Services","D"]
[{"$f":"IF(COUNTIF($A$9:A1590,A1590)<24,A1590,A1590+1)","v":66},{"$f":"VLOOKUP(A1591,'Counties and Regions'!$G$3:$J$74,4,FALSE)","v":"Northern"},{"$f":"VLOOKUP(A1591,'Counties and Regions'!$G$3:$J$74,3,FALSE)","v":"Oneida County"},"Additional Services","B"]
[{"$f":"IF(COUNTIF($A$9:A1591,A1591)<24,A1591,A1591+1)","v":66},{"$f":"VLOOKUP(A1592,'Counties and Regions'!$G$3:$J$74,4,FALSE)","v":"Northern"},{"$f":"VLOOKUP(A1592,'Counties and Regions'!$G$3:$J$74,3,FALSE)","v":"Oneida County"},"Additional Services","O"]
[{"$f":"IF(COUNTIF($A$9:A1592,A1592)<24,A1592,A1592+1)","v":67},{"$f":"VLOOKUP(A1593,'Counties and Regions'!$G$3:$J$74,4,FALSE)","v":"Northern"},{"$f":"VLOOKUP(A1593,'Counties and Regions'!$G$3:$J$74,3,FALSE)","v":"Portage County"},"Hospital Inpatient","F"]
[{"$f":"IF(COUNTIF($A$9:A1593,A1593)<24,A1593,A1593+1)","v":67},{"$f":"VLOOKUP(A1594,'Counties and Regions'!$G$3:$J$74,4,FALSE)","v":"Northern"},{"$f":"VLOOKUP(A1594,'Counties and Regions'!$G$3:$J$74,3,FALSE)","v":"Portage County"},"Hospital Inpatient","D"]
[{"$f":"IF(COUNTIF($A$9:A1594,A1594)<24,A1594,A1594+1)","v":67},{"$f":"VLOOKUP(A1595,'Counties and Regions'!$G$3:$J$74,4,FALSE)","v":"Northern"},{"$f":"VLOOKUP(A1595,'Counties and Regions'!$G$3:$J$74,3,FALSE)","v":"Portage County"},"Hospital Inpatient","B"]
[{"$f":"IF(COUNTIF($A$9:A1595,A1595)<24,A1595,A1595+1)","v":67},{"$f":"VLOOKUP(A1596,'Counties and Regions'!$G$3:$J$74,4,FALSE)","v":"Northern"},{"$f":"VLOOKUP(A1596,'Counties and Regions'!$G$3:$J$74,3,FALSE)","v":"Portage County"},"Hospital Inpatient","O"]
[{"$f":"IF(COUNTIF($A$9:A1596,A1596)<24,A1596,A1596+1)","v":67},{"$f":"VLOOKUP(A1597,'Counties and Regions'!$G$3:$J$74,4,FALSE)","v":"Northern"},{"$f":"VLOOKUP(A1597,'Counties and Regions'!$G$3:$J$74,3,FALSE)","v":"Portage County"},"Hospital Outpatient","F"]
[{"$f":"IF(COUNTIF($A$9:A1597,A1597)<24,A1597,A1597+1)","v":67},{"$f":"VLOOKUP(A1598,'Counties and Regions'!$G$3:$J$74,4,FALSE)","v":"Northern"},{"$f":"VLOOKUP(A1598,'Counties and Regions'!$G$3:$J$74,3,FALSE)","v":"Portage County"},"Hospital Outpatient","D"]
[{"$f":"IF(COUNTIF($A$9:A1598,A1598)<24,A1598,A1598+1)","v":67},{"$f":"VLOOKUP(A1599,'Counties and Regions'!$G$3:$J$74,4,FALSE)","v":"Northern"},{"$f":"VLOOKUP(A1599,'Counties and Regions'!$G$3:$J$74,3,FALSE)","v":"Portage County"},"Hospital Outpatient","B"]
[{"$f":"IF(COUNTIF($A$9:A1599,A1599)<24,A1599,A1599+1)","v":67},{"$f":"VLOOKUP(A1600,'Counties and Regions'!$G$3:$J$74,4,FALSE)","v":"Northern"},{"$f":"VLOOKUP(A1600,'Counties and Regions'!$G$3:$J$74,3,FALSE)","v":"Portage County"},"Hospital Outpatient","O"]
[{"$f":"IF(COUNTIF($A$9:A1600,A1600)<24,A1600,A1600+1)","v":67},{"$f":"VLOOKUP(A1601,'Counties and Regions'!$G$3:$J$74,4,FALSE)","v":"Northern"},{"$f":"VLOOKUP(A1601,'Counties and Regions'!$G$3:$J$74,3,FALSE)","v":"Portage County"},"Other Facility","F"]
[{"$f":"IF(COUNTIF($A$9:A1601,A1601)<24,A1601,A1601+1)","v":67},{"$f":"VLOOKUP(A1602,'Counties and Regions'!$G$3:$J$74,4,FALSE)","v":"Northern"},{"$f":"VLOOKUP(A1602,'Counties and Regions'!$G$3:$J$74,3,FALSE)","v":"Portage County"},"Other Facility","D"]
[{"$f":"IF(COUNTIF($A$9:A1602,A1602)<24,A1602,A1602+1)","v":67},{"$f":"VLOOKUP(A1603,'Counties and Regions'!$G$3:$J$74,4,FALSE)","v":"Northern"},{"$f":"VLOOKUP(A1603,'Counties and Regions'!$G$3:$J$74,3,FALSE)","v":"Portage County"},"Other Facility","B"]
[{"$f":"IF(COUNTIF($A$9:A1603,A1603)<24,A1603,A1603+1)","v":67},{"$f":"VLOOKUP(A1604,'Counties and Regions'!$G$3:$J$74,4,FALSE)","v":"Northern"},{"$f":"VLOOKUP(A1604,'Counties and Regions'!$G$3:$J$74,3,FALSE)","v":"Portage County"},"Other Facility","O"]
[{"$f":"IF(COUNTIF($A$9:A1604,A1604)<24,A1604,A1604+1)","v":67},{"$f":"VLOOKUP(A1605,'Counties and Regions'!$G$3:$J$74,4,FALSE)","v":"Northern"},{"$f":"VLOOKUP(A1605,'Counties and Regions'!$G$3:$J$74,3,FALSE)","v":"Portage County"},"Physician Services","F"]
[{"$f":"IF(COUNTIF($A$9:A1605,A1605)<24,A1605,A1605+1)","v":67},{"$f":"VLOOKUP(A1606,'Counties and Regions'!$G$3:$J$74,4,FALSE)","v":"Northern"},{"$f":"VLOOKUP(A1606,'Counties and Regions'!$G$3:$J$74,3,FALSE)","v":"Portage County"},"Physician Services","D"]
[{"$f":"IF(COUNTIF($A$9:A1606,A1606)<24,A1606,A1606+1)","v":67},{"$f":"VLOOKUP(A1607,'Counties and Regions'!$G$3:$J$74,4,FALSE)","v":"Northern"},{"$f":"VLOOKUP(A1607,'Counties and Regions'!$G$3:$J$74,3,FALSE)","v":"Portage County"},"Physician Services","B"]
[{"$f":"IF(COUNTIF($A$9:A1607,A1607)<24,A1607,A1607+1)","v":67},{"$f":"VLOOKUP(A1608,'Counties and Regions'!$G$3:$J$74,4,FALSE)","v":"Northern"},{"$f":"VLOOKUP(A1608,'Counties and Regions'!$G$3:$J$74,3,FALSE)","v":"Portage County"},"Physician Services","O"]
[{"$f":"IF(COUNTIF($A$9:A1608,A1608)<24,A1608,A1608+1)","v":67},{"$f":"VLOOKUP(A1609,'Counties and Regions'!$G$3:$J$74,4,FALSE)","v":"Northern"},{"$f":"VLOOKUP(A1609,'Counties and Regions'!$G$3:$J$74,3,FALSE)","v":"Portage County"},"Other Services","F"]
[{"$f":"IF(COUNTIF($A$9:A1609,A1609)<24,A1609,A1609+1)","v":67},{"$f":"VLOOKUP(A1610,'Counties and Regions'!$G$3:$J$74,4,FALSE)","v":"Northern"},{"$f":"VLOOKUP(A1610,'Counties and Regions'!$G$3:$J$74,3,FALSE)","v":"Portage County"},"Other Services","D"]
[{"$f":"IF(COUNTIF($A$9:A1610,A1610)<24,A1610,A1610+1)","v":67},{"$f":"VLOOKUP(A1611,'Counties and Regions'!$G$3:$J$74,4,FALSE)","v":"Northern"},{"$f":"VLOOKUP(A1611,'Counties and Regions'!$G$3:$J$74,3,FALSE)","v":"Portage County"},"Other Services","B"]
[{"$f":"IF(COUNTIF($A$9:A1611,A1611)<24,A1611,A1611+1)","v":67},{"$f":"VLOOKUP(A1612,'Counties and Regions'!$G$3:$J$74,4,FALSE)","v":"Northern"},{"$f":"VLOOKUP(A1612,'Counties and Regions'!$G$3:$J$74,3,FALSE)","v":"Portage County"},"Other Services","O"]
[{"$f":"IF(COUNTIF($A$9:A1612,A1612)<24,A1612,A1612+1)","v":67},{"$f":"VLOOKUP(A1613,'Counties and Regions'!$G$3:$J$74,4,FALSE)","v":"Northern"},{"$f":"VLOOKUP(A1613,'Counties and Regions'!$G$3:$J$74,3,FALSE)","v":"Portage County"},"Additional Services","F"]
[{"$f":"IF(COUNTIF($A$9:A1613,A1613)<24,A1613,A1613+1)","v":67},{"$f":"VLOOKUP(A1614,'Counties and Regions'!$G$3:$J$74,4,FALSE)","v":"Northern"},{"$f":"VLOOKUP(A1614,'Counties and Regions'!$G$3:$J$74,3,FALSE)","v":"Portage County"},"Additional Services","D"]
[{"$f":"IF(COUNTIF($A$9:A1614,A1614)<24,A1614,A1614+1)","v":67},{"$f":"VLOOKUP(A1615,'Counties and Regions'!$G$3:$J$74,4,FALSE)","v":"Northern"},{"$f":"VLOOKUP(A1615,'Counties and Regions'!$G$3:$J$74,3,FALSE)","v":"Portage County"},"Additional Services","B"]
[{"$f":"IF(COUNTIF($A$9:A1615,A1615)<24,A1615,A1615+1)","v":67},{"$f":"VLOOKUP(A1616,'Counties and Regions'!$G$3:$J$74,4,FALSE)","v":"Northern"},{"$f":"VLOOKUP(A1616,'Counties and Regions'!$G$3:$J$74,3,FALSE)","v":"Portage County"},"Additional Services","O"]
[{"$f":"IF(COUNTIF($A$9:A1616,A1616)<24,A1616,A1616+1)","v":68},{"$f":"VLOOKUP(A1617,'Counties and Regions'!$G$3:$J$74,4,FALSE)","v":"Northern"},{"$f":"VLOOKUP(A1617,'Counties and Regions'!$G$3:$J$74,3,FALSE)","v":"Price County"},"Hospital Inpatient","F"]
[{"$f":"IF(COUNTIF($A$9:A1617,A1617)<24,A1617,A1617+1)","v":68},{"$f":"VLOOKUP(A1618,'Counties and Regions'!$G$3:$J$74,4,FALSE)","v":"Northern"},{"$f":"VLOOKUP(A1618,'Counties and Regions'!$G$3:$J$74,3,FALSE)","v":"Price County"},"Hospital Inpatient","D"]
[{"$f":"IF(COUNTIF($A$9:A1618,A1618)<24,A1618,A1618+1)","v":68},{"$f":"VLOOKUP(A1619,'Counties and Regions'!$G$3:$J$74,4,FALSE)","v":"Northern"},{"$f":"VLOOKUP(A1619,'Counties and Regions'!$G$3:$J$74,3,FALSE)","v":"Price County"},"Hospital Inpatient","B"]
[{"$f":"IF(COUNTIF($A$9:A1619,A1619)<24,A1619,A1619+1)","v":68},{"$f":"VLOOKUP(A1620,'Counties and Regions'!$G$3:$J$74,4,FALSE)","v":"Northern"},{"$f":"VLOOKUP(A1620,'Counties and Regions'!$G$3:$J$74,3,FALSE)","v":"Price County"},"Hospital Inpatient","O"]
[{"$f":"IF(COUNTIF($A$9:A1620,A1620)<24,A1620,A1620+1)","v":68},{"$f":"VLOOKUP(A1621,'Counties and Regions'!$G$3:$J$74,4,FALSE)","v":"Northern"},{"$f":"VLOOKUP(A1621,'Counties and Regions'!$G$3:$J$74,3,FALSE)","v":"Price County"},"Hospital Outpatient","F"]
[{"$f":"IF(COUNTIF($A$9:A1621,A1621)<24,A1621,A1621+1)","v":68},{"$f":"VLOOKUP(A1622,'Counties and Regions'!$G$3:$J$74,4,FALSE)","v":"Northern"},{"$f":"VLOOKUP(A1622,'Counties and Regions'!$G$3:$J$74,3,FALSE)","v":"Price County"},"Hospital Outpatient","D"]
[{"$f":"IF(COUNTIF($A$9:A1622,A1622)<24,A1622,A1622+1)","v":68},{"$f":"VLOOKUP(A1623,'Counties and Regions'!$G$3:$J$74,4,FALSE)","v":"Northern"},{"$f":"VLOOKUP(A1623,'Counties and Regions'!$G$3:$J$74,3,FALSE)","v":"Price County"},"Hospital Outpatient","B"]
[{"$f":"IF(COUNTIF($A$9:A1623,A1623)<24,A1623,A1623+1)","v":68},{"$f":"VLOOKUP(A1624,'Counties and Regions'!$G$3:$J$74,4,FALSE)","v":"Northern"},{"$f":"VLOOKUP(A1624,'Counties and Regions'!$G$3:$J$74,3,FALSE)","v":"Price County"},"Hospital Outpatient","O"]
[{"$f":"IF(COUNTIF($A$9:A1624,A1624)<24,A1624,A1624+1)","v":68},{"$f":"VLOOKUP(A1625,'Counties and Regions'!$G$3:$J$74,4,FALSE)","v":"Northern"},{"$f":"VLOOKUP(A1625,'Counties and Regions'!$G$3:$J$74,3,FALSE)","v":"Price County"},"Other Facility","F"]
[{"$f":"IF(COUNTIF($A$9:A1625,A1625)<24,A1625,A1625+1)","v":68},{"$f":"VLOOKUP(A1626,'Counties and Regions'!$G$3:$J$74,4,FALSE)","v":"Northern"},{"$f":"VLOOKUP(A1626,'Counties and Regions'!$G$3:$J$74,3,FALSE)","v":"Price County"},"Other Facility","D"]
[{"$f":"IF(COUNTIF($A$9:A1626,A1626)<24,A1626,A1626+1)","v":68},{"$f":"VLOOKUP(A1627,'Counties and Regions'!$G$3:$J$74,4,FALSE)","v":"Northern"},{"$f":"VLOOKUP(A1627,'Counties and Regions'!$G$3:$J$74,3,FALSE)","v":"Price County"},"Other Facility","B"]
[{"$f":"IF(COUNTIF($A$9:A1627,A1627)<24,A1627,A1627+1)","v":68},{"$f":"VLOOKUP(A1628,'Counties and Regions'!$G$3:$J$74,4,FALSE)","v":"Northern"},{"$f":"VLOOKUP(A1628,'Counties and Regions'!$G$3:$J$74,3,FALSE)","v":"Price County"},"Other Facility","O"]
[{"$f":"IF(COUNTIF($A$9:A1628,A1628)<24,A1628,A1628+1)","v":68},{"$f":"VLOOKUP(A1629,'Counties and Regions'!$G$3:$J$74,4,FALSE)","v":"Northern"},{"$f":"VLOOKUP(A1629,'Counties and Regions'!$G$3:$J$74,3,FALSE)","v":"Price County"},"Physician Services","F"]
[{"$f":"IF(COUNTIF($A$9:A1629,A1629)<24,A1629,A1629+1)","v":68},{"$f":"VLOOKUP(A1630,'Counties and Regions'!$G$3:$J$74,4,FALSE)","v":"Northern"},{"$f":"VLOOKUP(A1630,'Counties and Regions'!$G$3:$J$74,3,FALSE)","v":"Price County"},"Physician Services","D"]
[{"$f":"IF(COUNTIF($A$9:A1630,A1630)<24,A1630,A1630+1)","v":68},{"$f":"VLOOKUP(A1631,'Counties and Regions'!$G$3:$J$74,4,FALSE)","v":"Northern"},{"$f":"VLOOKUP(A1631,'Counties and Regions'!$G$3:$J$74,3,FALSE)","v":"Price County"},"Physician Services","B"]
[{"$f":"IF(COUNTIF($A$9:A1631,A1631)<24,A1631,A1631+1)","v":68},{"$f":"VLOOKUP(A1632,'Counties and Regions'!$G$3:$J$74,4,FALSE)","v":"Northern"},{"$f":"VLOOKUP(A1632,'Counties and Regions'!$G$3:$J$74,3,FALSE)","v":"Price County"},"Physician Services","O"]
[{"$f":"IF(COUNTIF($A$9:A1632,A1632)<24,A1632,A1632+1)","v":68},{"$f":"VLOOKUP(A1633,'Counties and Regions'!$G$3:$J$74,4,FALSE)","v":"Northern"},{"$f":"VLOOKUP(A1633,'Counties and Regions'!$G$3:$J$74,3,FALSE)","v":"Price County"},"Other Services","F"]
[{"$f":"IF(COUNTIF($A$9:A1633,A1633)<24,A1633,A1633+1)","v":68},{"$f":"VLOOKUP(A1634,'Counties and Regions'!$G$3:$J$74,4,FALSE)","v":"Northern"},{"$f":"VLOOKUP(A1634,'Counties and Regions'!$G$3:$J$74,3,FALSE)","v":"Price County"},"Other Services","D"]
[{"$f":"IF(COUNTIF($A$9:A1634,A1634)<24,A1634,A1634+1)","v":68},{"$f":"VLOOKUP(A1635,'Counties and Regions'!$G$3:$J$74,4,FALSE)","v":"Northern"},{"$f":"VLOOKUP(A1635,'Counties and Regions'!$G$3:$J$74,3,FALSE)","v":"Price County"},"Other Services","B"]
[{"$f":"IF(COUNTIF($A$9:A1635,A1635)<24,A1635,A1635+1)","v":68},{"$f":"VLOOKUP(A1636,'Counties and Regions'!$G$3:$J$74,4,FALSE)","v":"Northern"},{"$f":"VLOOKUP(A1636,'Counties and Regions'!$G$3:$J$74,3,FALSE)","v":"Price County"},"Other Services","O"]
[{"$f":"IF(COUNTIF($A$9:A1636,A1636)<24,A1636,A1636+1)","v":68},{"$f":"VLOOKUP(A1637,'Counties and Regions'!$G$3:$J$74,4,FALSE)","v":"Northern"},{"$f":"VLOOKUP(A1637,'Counties and Regions'!$G$3:$J$74,3,FALSE)","v":"Price County"},"Additional Services","F"]
[{"$f":"IF(COUNTIF($A$9:A1637,A1637)<24,A1637,A1637+1)","v":68},{"$f":"VLOOKUP(A1638,'Counties and Regions'!$G$3:$J$74,4,FALSE)","v":"Northern"},{"$f":"VLOOKUP(A1638,'Counties and Regions'!$G$3:$J$74,3,FALSE)","v":"Price County"},"Additional Services","D"]
[{"$f":"IF(COUNTIF($A$9:A1638,A1638)<24,A1638,A1638+1)","v":68},{"$f":"VLOOKUP(A1639,'Counties and Regions'!$G$3:$J$74,4,FALSE)","v":"Northern"},{"$f":"VLOOKUP(A1639,'Counties and Regions'!$G$3:$J$74,3,FALSE)","v":"Price County"},"Additional Services","B"]
[{"$f":"IF(COUNTIF($A$9:A1639,A1639)<24,A1639,A1639+1)","v":68},{"$f":"VLOOKUP(A1640,'Counties and Regions'!$G$3:$J$74,4,FALSE)","v":"Northern"},{"$f":"VLOOKUP(A1640,'Counties and Regions'!$G$3:$J$74,3,FALSE)","v":"Price County"},"Additional Services","O"]
[{"$f":"IF(COUNTIF($A$9:A1640,A1640)<24,A1640,A1640+1)","v":69},{"$f":"VLOOKUP(A1641,'Counties and Regions'!$G$3:$J$74,4,FALSE)","v":"Northern"},{"$f":"VLOOKUP(A1641,'Counties and Regions'!$G$3:$J$74,3,FALSE)","v":"Sawyer County"},"Hospital Inpatient","F"]
[{"$f":"IF(COUNTIF($A$9:A1641,A1641)<24,A1641,A1641+1)","v":69},{"$f":"VLOOKUP(A1642,'Counties and Regions'!$G$3:$J$74,4,FALSE)","v":"Northern"},{"$f":"VLOOKUP(A1642,'Counties and Regions'!$G$3:$J$74,3,FALSE)","v":"Sawyer County"},"Hospital Inpatient","D"]
[{"$f":"IF(COUNTIF($A$9:A1642,A1642)<24,A1642,A1642+1)","v":69},{"$f":"VLOOKUP(A1643,'Counties and Regions'!$G$3:$J$74,4,FALSE)","v":"Northern"},{"$f":"VLOOKUP(A1643,'Counties and Regions'!$G$3:$J$74,3,FALSE)","v":"Sawyer County"},"Hospital Inpatient","B"]
[{"$f":"IF(COUNTIF($A$9:A1643,A1643)<24,A1643,A1643+1)","v":69},{"$f":"VLOOKUP(A1644,'Counties and Regions'!$G$3:$J$74,4,FALSE)","v":"Northern"},{"$f":"VLOOKUP(A1644,'Counties and Regions'!$G$3:$J$74,3,FALSE)","v":"Sawyer County"},"Hospital Inpatient","O"]
[{"$f":"IF(COUNTIF($A$9:A1644,A1644)<24,A1644,A1644+1)","v":69},{"$f":"VLOOKUP(A1645,'Counties and Regions'!$G$3:$J$74,4,FALSE)","v":"Northern"},{"$f":"VLOOKUP(A1645,'Counties and Regions'!$G$3:$J$74,3,FALSE)","v":"Sawyer County"},"Hospital Outpatient","F"]
[{"$f":"IF(COUNTIF($A$9:A1645,A1645)<24,A1645,A1645+1)","v":69},{"$f":"VLOOKUP(A1646,'Counties and Regions'!$G$3:$J$74,4,FALSE)","v":"Northern"},{"$f":"VLOOKUP(A1646,'Counties and Regions'!$G$3:$J$74,3,FALSE)","v":"Sawyer County"},"Hospital Outpatient","D"]
[{"$f":"IF(COUNTIF($A$9:A1646,A1646)<24,A1646,A1646+1)","v":69},{"$f":"VLOOKUP(A1647,'Counties and Regions'!$G$3:$J$74,4,FALSE)","v":"Northern"},{"$f":"VLOOKUP(A1647,'Counties and Regions'!$G$3:$J$74,3,FALSE)","v":"Sawyer County"},"Hospital Outpatient","B"]
[{"$f":"IF(COUNTIF($A$9:A1647,A1647)<24,A1647,A1647+1)","v":69},{"$f":"VLOOKUP(A1648,'Counties and Regions'!$G$3:$J$74,4,FALSE)","v":"Northern"},{"$f":"VLOOKUP(A1648,'Counties and Regions'!$G$3:$J$74,3,FALSE)","v":"Sawyer County"},"Hospital Outpatient","O"]
[{"$f":"IF(COUNTIF($A$9:A1648,A1648)<24,A1648,A1648+1)","v":69},{"$f":"VLOOKUP(A1649,'Counties and Regions'!$G$3:$J$74,4,FALSE)","v":"Northern"},{"$f":"VLOOKUP(A1649,'Counties and Regions'!$G$3:$J$74,3,FALSE)","v":"Sawyer County"},"Other Facility","F"]
[{"$f":"IF(COUNTIF($A$9:A1649,A1649)<24,A1649,A1649+1)","v":69},{"$f":"VLOOKUP(A1650,'Counties and Regions'!$G$3:$J$74,4,FALSE)","v":"Northern"},{"$f":"VLOOKUP(A1650,'Counties and Regions'!$G$3:$J$74,3,FALSE)","v":"Sawyer County"},"Other Facility","D"]
[{"$f":"IF(COUNTIF($A$9:A1650,A1650)<24,A1650,A1650+1)","v":69},{"$f":"VLOOKUP(A1651,'Counties and Regions'!$G$3:$J$74,4,FALSE)","v":"Northern"},{"$f":"VLOOKUP(A1651,'Counties and Regions'!$G$3:$J$74,3,FALSE)","v":"Sawyer County"},"Other Facility","B"]
[{"$f":"IF(COUNTIF($A$9:A1651,A1651)<24,A1651,A1651+1)","v":69},{"$f":"VLOOKUP(A1652,'Counties and Regions'!$G$3:$J$74,4,FALSE)","v":"Northern"},{"$f":"VLOOKUP(A1652,'Counties and Regions'!$G$3:$J$74,3,FALSE)","v":"Sawyer County"},"Other Facility","O"]
[{"$f":"IF(COUNTIF($A$9:A1652,A1652)<24,A1652,A1652+1)","v":69},{"$f":"VLOOKUP(A1653,'Counties and Regions'!$G$3:$J$74,4,FALSE)","v":"Northern"},{"$f":"VLOOKUP(A1653,'Counties and Regions'!$G$3:$J$74,3,FALSE)","v":"Sawyer County"},"Physician Services","F"]
[{"$f":"IF(COUNTIF($A$9:A1653,A1653)<24,A1653,A1653+1)","v":69},{"$f":"VLOOKUP(A1654,'Counties and Regions'!$G$3:$J$74,4,FALSE)","v":"Northern"},{"$f":"VLOOKUP(A1654,'Counties and Regions'!$G$3:$J$74,3,FALSE)","v":"Sawyer County"},"Physician Services","D"]
[{"$f":"IF(COUNTIF($A$9:A1654,A1654)<24,A1654,A1654+1)","v":69},{"$f":"VLOOKUP(A1655,'Counties and Regions'!$G$3:$J$74,4,FALSE)","v":"Northern"},{"$f":"VLOOKUP(A1655,'Counties and Regions'!$G$3:$J$74,3,FALSE)","v":"Sawyer County"},"Physician Services","B"]
[{"$f":"IF(COUNTIF($A$9:A1655,A1655)<24,A1655,A1655+1)","v":69},{"$f":"VLOOKUP(A1656,'Counties and Regions'!$G$3:$J$74,4,FALSE)","v":"Northern"},{"$f":"VLOOKUP(A1656,'Counties and Regions'!$G$3:$J$74,3,FALSE)","v":"Sawyer County"},"Physician Services","O"]
[{"$f":"IF(COUNTIF($A$9:A1656,A1656)<24,A1656,A1656+1)","v":69},{"$f":"VLOOKUP(A1657,'Counties and Regions'!$G$3:$J$74,4,FALSE)","v":"Northern"},{"$f":"VLOOKUP(A1657,'Counties and Regions'!$G$3:$J$74,3,FALSE)","v":"Sawyer County"},"Other Services","F"]
[{"$f":"IF(COUNTIF($A$9:A1657,A1657)<24,A1657,A1657+1)","v":69},{"$f":"VLOOKUP(A1658,'Counties and Regions'!$G$3:$J$74,4,FALSE)","v":"Northern"},{"$f":"VLOOKUP(A1658,'Counties and Regions'!$G$3:$J$74,3,FALSE)","v":"Sawyer County"},"Other Services","D"]
[{"$f":"IF(COUNTIF($A$9:A1658,A1658)<24,A1658,A1658+1)","v":69},{"$f":"VLOOKUP(A1659,'Counties and Regions'!$G$3:$J$74,4,FALSE)","v":"Northern"},{"$f":"VLOOKUP(A1659,'Counties and Regions'!$G$3:$J$74,3,FALSE)","v":"Sawyer County"},"Other Services","B"]
[{"$f":"IF(COUNTIF($A$9:A1659,A1659)<24,A1659,A1659+1)","v":69},{"$f":"VLOOKUP(A1660,'Counties and Regions'!$G$3:$J$74,4,FALSE)","v":"Northern"},{"$f":"VLOOKUP(A1660,'Counties and Regions'!$G$3:$J$74,3,FALSE)","v":"Sawyer County"},"Other Services","O"]
[{"$f":"IF(COUNTIF($A$9:A1660,A1660)<24,A1660,A1660+1)","v":69},{"$f":"VLOOKUP(A1661,'Counties and Regions'!$G$3:$J$74,4,FALSE)","v":"Northern"},{"$f":"VLOOKUP(A1661,'Counties and Regions'!$G$3:$J$74,3,FALSE)","v":"Sawyer County"},"Additional Services","F"]
[{"$f":"IF(COUNTIF($A$9:A1661,A1661)<24,A1661,A1661+1)","v":69},{"$f":"VLOOKUP(A1662,'Counties and Regions'!$G$3:$J$74,4,FALSE)","v":"Northern"},{"$f":"VLOOKUP(A1662,'Counties and Regions'!$G$3:$J$74,3,FALSE)","v":"Sawyer County"},"Additional Services","D"]
[{"$f":"IF(COUNTIF($A$9:A1662,A1662)<24,A1662,A1662+1)","v":69},{"$f":"VLOOKUP(A1663,'Counties and Regions'!$G$3:$J$74,4,FALSE)","v":"Northern"},{"$f":"VLOOKUP(A1663,'Counties and Regions'!$G$3:$J$74,3,FALSE)","v":"Sawyer County"},"Additional Services","B"]
[{"$f":"IF(COUNTIF($A$9:A1663,A1663)<24,A1663,A1663+1)","v":69},{"$f":"VLOOKUP(A1664,'Counties and Regions'!$G$3:$J$74,4,FALSE)","v":"Northern"},{"$f":"VLOOKUP(A1664,'Counties and Regions'!$G$3:$J$74,3,FALSE)","v":"Sawyer County"},"Additional Services","O"]
[{"$f":"IF(COUNTIF($A$9:A1664,A1664)<24,A1664,A1664+1)","v":70},{"$f":"VLOOKUP(A1665,'Counties and Regions'!$G$3:$J$74,4,FALSE)","v":"Northern"},{"$f":"VLOOKUP(A1665,'Counties and Regions'!$G$3:$J$74,3,FALSE)","v":"Taylor County"},"Hospital Inpatient","F"]
[{"$f":"IF(COUNTIF($A$9:A1665,A1665)<24,A1665,A1665+1)","v":70},{"$f":"VLOOKUP(A1666,'Counties and Regions'!$G$3:$J$74,4,FALSE)","v":"Northern"},{"$f":"VLOOKUP(A1666,'Counties and Regions'!$G$3:$J$74,3,FALSE)","v":"Taylor County"},"Hospital Inpatient","D"]
[{"$f":"IF(COUNTIF($A$9:A1666,A1666)<24,A1666,A1666+1)","v":70},{"$f":"VLOOKUP(A1667,'Counties and Regions'!$G$3:$J$74,4,FALSE)","v":"Northern"},{"$f":"VLOOKUP(A1667,'Counties and Regions'!$G$3:$J$74,3,FALSE)","v":"Taylor County"},"Hospital Inpatient","B"]
[{"$f":"IF(COUNTIF($A$9:A1667,A1667)<24,A1667,A1667+1)","v":70},{"$f":"VLOOKUP(A1668,'Counties and Regions'!$G$3:$J$74,4,FALSE)","v":"Northern"},{"$f":"VLOOKUP(A1668,'Counties and Regions'!$G$3:$J$74,3,FALSE)","v":"Taylor County"},"Hospital Inpatient","O"]
[{"$f":"IF(COUNTIF($A$9:A1668,A1668)<24,A1668,A1668+1)","v":70},{"$f":"VLOOKUP(A1669,'Counties and Regions'!$G$3:$J$74,4,FALSE)","v":"Northern"},{"$f":"VLOOKUP(A1669,'Counties and Regions'!$G$3:$J$74,3,FALSE)","v":"Taylor County"},"Hospital Outpatient","F"]
[{"$f":"IF(COUNTIF($A$9:A1669,A1669)<24,A1669,A1669+1)","v":70},{"$f":"VLOOKUP(A1670,'Counties and Regions'!$G$3:$J$74,4,FALSE)","v":"Northern"},{"$f":"VLOOKUP(A1670,'Counties and Regions'!$G$3:$J$74,3,FALSE)","v":"Taylor County"},"Hospital Outpatient","D"]
[{"$f":"IF(COUNTIF($A$9:A1670,A1670)<24,A1670,A1670+1)","v":70},{"$f":"VLOOKUP(A1671,'Counties and Regions'!$G$3:$J$74,4,FALSE)","v":"Northern"},{"$f":"VLOOKUP(A1671,'Counties and Regions'!$G$3:$J$74,3,FALSE)","v":"Taylor County"},"Hospital Outpatient","B"]
[{"$f":"IF(COUNTIF($A$9:A1671,A1671)<24,A1671,A1671+1)","v":70},{"$f":"VLOOKUP(A1672,'Counties and Regions'!$G$3:$J$74,4,FALSE)","v":"Northern"},{"$f":"VLOOKUP(A1672,'Counties and Regions'!$G$3:$J$74,3,FALSE)","v":"Taylor County"},"Hospital Outpatient","O"]
[{"$f":"IF(COUNTIF($A$9:A1672,A1672)<24,A1672,A1672+1)","v":70},{"$f":"VLOOKUP(A1673,'Counties and Regions'!$G$3:$J$74,4,FALSE)","v":"Northern"},{"$f":"VLOOKUP(A1673,'Counties and Regions'!$G$3:$J$74,3,FALSE)","v":"Taylor County"},"Other Facility","F"]
[{"$f":"IF(COUNTIF($A$9:A1673,A1673)<24,A1673,A1673+1)","v":70},{"$f":"VLOOKUP(A1674,'Counties and Regions'!$G$3:$J$74,4,FALSE)","v":"Northern"},{"$f":"VLOOKUP(A1674,'Counties and Regions'!$G$3:$J$74,3,FALSE)","v":"Taylor County"},"Other Facility","D"]
[{"$f":"IF(COUNTIF($A$9:A1674,A1674)<24,A1674,A1674+1)","v":70},{"$f":"VLOOKUP(A1675,'Counties and Regions'!$G$3:$J$74,4,FALSE)","v":"Northern"},{"$f":"VLOOKUP(A1675,'Counties and Regions'!$G$3:$J$74,3,FALSE)","v":"Taylor County"},"Other Facility","B"]
[{"$f":"IF(COUNTIF($A$9:A1675,A1675)<24,A1675,A1675+1)","v":70},{"$f":"VLOOKUP(A1676,'Counties and Regions'!$G$3:$J$74,4,FALSE)","v":"Northern"},{"$f":"VLOOKUP(A1676,'Counties and Regions'!$G$3:$J$74,3,FALSE)","v":"Taylor County"},"Other Facility","O"]
[{"$f":"IF(COUNTIF($A$9:A1676,A1676)<24,A1676,A1676+1)","v":70},{"$f":"VLOOKUP(A1677,'Counties and Regions'!$G$3:$J$74,4,FALSE)","v":"Northern"},{"$f":"VLOOKUP(A1677,'Counties and Regions'!$G$3:$J$74,3,FALSE)","v":"Taylor County"},"Physician Services","F"]
[{"$f":"IF(COUNTIF($A$9:A1677,A1677)<24,A1677,A1677+1)","v":70},{"$f":"VLOOKUP(A1678,'Counties and Regions'!$G$3:$J$74,4,FALSE)","v":"Northern"},{"$f":"VLOOKUP(A1678,'Counties and Regions'!$G$3:$J$74,3,FALSE)","v":"Taylor County"},"Physician Services","D"]
[{"$f":"IF(COUNTIF($A$9:A1678,A1678)<24,A1678,A1678+1)","v":70},{"$f":"VLOOKUP(A1679,'Counties and Regions'!$G$3:$J$74,4,FALSE)","v":"Northern"},{"$f":"VLOOKUP(A1679,'Counties and Regions'!$G$3:$J$74,3,FALSE)","v":"Taylor County"},"Physician Services","B"]
[{"$f":"IF(COUNTIF($A$9:A1679,A1679)<24,A1679,A1679+1)","v":70},{"$f":"VLOOKUP(A1680,'Counties and Regions'!$G$3:$J$74,4,FALSE)","v":"Northern"},{"$f":"VLOOKUP(A1680,'Counties and Regions'!$G$3:$J$74,3,FALSE)","v":"Taylor County"},"Physician Services","O"]
[{"$f":"IF(COUNTIF($A$9:A1680,A1680)<24,A1680,A1680+1)","v":70},{"$f":"VLOOKUP(A1681,'Counties and Regions'!$G$3:$J$74,4,FALSE)","v":"Northern"},{"$f":"VLOOKUP(A1681,'Counties and Regions'!$G$3:$J$74,3,FALSE)","v":"Taylor County"},"Other Services","F"]
[{"$f":"IF(COUNTIF($A$9:A1681,A1681)<24,A1681,A1681+1)","v":70},{"$f":"VLOOKUP(A1682,'Counties and Regions'!$G$3:$J$74,4,FALSE)","v":"Northern"},{"$f":"VLOOKUP(A1682,'Counties and Regions'!$G$3:$J$74,3,FALSE)","v":"Taylor County"},"Other Services","D"]
[{"$f":"IF(COUNTIF($A$9:A1682,A1682)<24,A1682,A1682+1)","v":70},{"$f":"VLOOKUP(A1683,'Counties and Regions'!$G$3:$J$74,4,FALSE)","v":"Northern"},{"$f":"VLOOKUP(A1683,'Counties and Regions'!$G$3:$J$74,3,FALSE)","v":"Taylor County"},"Other Services","B"]
[{"$f":"IF(COUNTIF($A$9:A1683,A1683)<24,A1683,A1683+1)","v":70},{"$f":"VLOOKUP(A1684,'Counties and Regions'!$G$3:$J$74,4,FALSE)","v":"Northern"},{"$f":"VLOOKUP(A1684,'Counties and Regions'!$G$3:$J$74,3,FALSE)","v":"Taylor County"},"Other Services","O"]
[{"$f":"IF(COUNTIF($A$9:A1684,A1684)<24,A1684,A1684+1)","v":70},{"$f":"VLOOKUP(A1685,'Counties and Regions'!$G$3:$J$74,4,FALSE)","v":"Northern"},{"$f":"VLOOKUP(A1685,'Counties and Regions'!$G$3:$J$74,3,FALSE)","v":"Taylor County"},"Additional Services","F"]
[{"$f":"IF(COUNTIF($A$9:A1685,A1685)<24,A1685,A1685+1)","v":70},{"$f":"VLOOKUP(A1686,'Counties and Regions'!$G$3:$J$74,4,FALSE)","v":"Northern"},{"$f":"VLOOKUP(A1686,'Counties and Regions'!$G$3:$J$74,3,FALSE)","v":"Taylor County"},"Additional Services","D"]
[{"$f":"IF(COUNTIF($A$9:A1686,A1686)<24,A1686,A1686+1)","v":70},{"$f":"VLOOKUP(A1687,'Counties and Regions'!$G$3:$J$74,4,FALSE)","v":"Northern"},{"$f":"VLOOKUP(A1687,'Counties and Regions'!$G$3:$J$74,3,FALSE)","v":"Taylor County"},"Additional Services","B"]
[{"$f":"IF(COUNTIF($A$9:A1687,A1687)<24,A1687,A1687+1)","v":70},{"$f":"VLOOKUP(A1688,'Counties and Regions'!$G$3:$J$74,4,FALSE)","v":"Northern"},{"$f":"VLOOKUP(A1688,'Counties and Regions'!$G$3:$J$74,3,FALSE)","v":"Taylor County"},"Additional Services","O"]
[{"$f":"IF(COUNTIF($A$9:A1688,A1688)<24,A1688,A1688+1)","v":71},{"$f":"VLOOKUP(A1689,'Counties and Regions'!$G$3:$J$74,4,FALSE)","v":"Northern"},{"$f":"VLOOKUP(A1689,'Counties and Regions'!$G$3:$J$74,3,FALSE)","v":"Vilas County"},"Hospital Inpatient","F"]
[{"$f":"IF(COUNTIF($A$9:A1689,A1689)<24,A1689,A1689+1)","v":71},{"$f":"VLOOKUP(A1690,'Counties and Regions'!$G$3:$J$74,4,FALSE)","v":"Northern"},{"$f":"VLOOKUP(A1690,'Counties and Regions'!$G$3:$J$74,3,FALSE)","v":"Vilas County"},"Hospital Inpatient","D"]
[{"$f":"IF(COUNTIF($A$9:A1690,A1690)<24,A1690,A1690+1)","v":71},{"$f":"VLOOKUP(A1691,'Counties and Regions'!$G$3:$J$74,4,FALSE)","v":"Northern"},{"$f":"VLOOKUP(A1691,'Counties and Regions'!$G$3:$J$74,3,FALSE)","v":"Vilas County"},"Hospital Inpatient","B"]
[{"$f":"IF(COUNTIF($A$9:A1691,A1691)<24,A1691,A1691+1)","v":71},{"$f":"VLOOKUP(A1692,'Counties and Regions'!$G$3:$J$74,4,FALSE)","v":"Northern"},{"$f":"VLOOKUP(A1692,'Counties and Regions'!$G$3:$J$74,3,FALSE)","v":"Vilas County"},"Hospital Inpatient","O"]
[{"$f":"IF(COUNTIF($A$9:A1692,A1692)<24,A1692,A1692+1)","v":71},{"$f":"VLOOKUP(A1693,'Counties and Regions'!$G$3:$J$74,4,FALSE)","v":"Northern"},{"$f":"VLOOKUP(A1693,'Counties and Regions'!$G$3:$J$74,3,FALSE)","v":"Vilas County"},"Hospital Outpatient","F"]
[{"$f":"IF(COUNTIF($A$9:A1693,A1693)<24,A1693,A1693+1)","v":71},{"$f":"VLOOKUP(A1694,'Counties and Regions'!$G$3:$J$74,4,FALSE)","v":"Northern"},{"$f":"VLOOKUP(A1694,'Counties and Regions'!$G$3:$J$74,3,FALSE)","v":"Vilas County"},"Hospital Outpatient","D"]
[{"$f":"IF(COUNTIF($A$9:A1694,A1694)<24,A1694,A1694+1)","v":71},{"$f":"VLOOKUP(A1695,'Counties and Regions'!$G$3:$J$74,4,FALSE)","v":"Northern"},{"$f":"VLOOKUP(A1695,'Counties and Regions'!$G$3:$J$74,3,FALSE)","v":"Vilas County"},"Hospital Outpatient","B"]
[{"$f":"IF(COUNTIF($A$9:A1695,A1695)<24,A1695,A1695+1)","v":71},{"$f":"VLOOKUP(A1696,'Counties and Regions'!$G$3:$J$74,4,FALSE)","v":"Northern"},{"$f":"VLOOKUP(A1696,'Counties and Regions'!$G$3:$J$74,3,FALSE)","v":"Vilas County"},"Hospital Outpatient","O"]
[{"$f":"IF(COUNTIF($A$9:A1696,A1696)<24,A1696,A1696+1)","v":71},{"$f":"VLOOKUP(A1697,'Counties and Regions'!$G$3:$J$74,4,FALSE)","v":"Northern"},{"$f":"VLOOKUP(A1697,'Counties and Regions'!$G$3:$J$74,3,FALSE)","v":"Vilas County"},"Other Facility","F"]
[{"$f":"IF(COUNTIF($A$9:A1697,A1697)<24,A1697,A1697+1)","v":71},{"$f":"VLOOKUP(A1698,'Counties and Regions'!$G$3:$J$74,4,FALSE)","v":"Northern"},{"$f":"VLOOKUP(A1698,'Counties and Regions'!$G$3:$J$74,3,FALSE)","v":"Vilas County"},"Other Facility","D"]
[{"$f":"IF(COUNTIF($A$9:A1698,A1698)<24,A1698,A1698+1)","v":71},{"$f":"VLOOKUP(A1699,'Counties and Regions'!$G$3:$J$74,4,FALSE)","v":"Northern"},{"$f":"VLOOKUP(A1699,'Counties and Regions'!$G$3:$J$74,3,FALSE)","v":"Vilas County"},"Other Facility","B"]
[{"$f":"IF(COUNTIF($A$9:A1699,A1699)<24,A1699,A1699+1)","v":71},{"$f":"VLOOKUP(A1700,'Counties and Regions'!$G$3:$J$74,4,FALSE)","v":"Northern"},{"$f":"VLOOKUP(A1700,'Counties and Regions'!$G$3:$J$74,3,FALSE)","v":"Vilas County"},"Other Facility","O"]
[{"$f":"IF(COUNTIF($A$9:A1700,A1700)<24,A1700,A1700+1)","v":71},{"$f":"VLOOKUP(A1701,'Counties and Regions'!$G$3:$J$74,4,FALSE)","v":"Northern"},{"$f":"VLOOKUP(A1701,'Counties and Regions'!$G$3:$J$74,3,FALSE)","v":"Vilas County"},"Physician Services","F"]
[{"$f":"IF(COUNTIF($A$9:A1701,A1701)<24,A1701,A1701+1)","v":71},{"$f":"VLOOKUP(A1702,'Counties and Regions'!$G$3:$J$74,4,FALSE)","v":"Northern"},{"$f":"VLOOKUP(A1702,'Counties and Regions'!$G$3:$J$74,3,FALSE)","v":"Vilas County"},"Physician Services","D"]
[{"$f":"IF(COUNTIF($A$9:A1702,A1702)<24,A1702,A1702+1)","v":71},{"$f":"VLOOKUP(A1703,'Counties and Regions'!$G$3:$J$74,4,FALSE)","v":"Northern"},{"$f":"VLOOKUP(A1703,'Counties and Regions'!$G$3:$J$74,3,FALSE)","v":"Vilas County"},"Physician Services","B"]
[{"$f":"IF(COUNTIF($A$9:A1703,A1703)<24,A1703,A1703+1)","v":71},{"$f":"VLOOKUP(A1704,'Counties and Regions'!$G$3:$J$74,4,FALSE)","v":"Northern"},{"$f":"VLOOKUP(A1704,'Counties and Regions'!$G$3:$J$74,3,FALSE)","v":"Vilas County"},"Physician Services","O"]
[{"$f":"IF(COUNTIF($A$9:A1704,A1704)<24,A1704,A1704+1)","v":71},{"$f":"VLOOKUP(A1705,'Counties and Regions'!$G$3:$J$74,4,FALSE)","v":"Northern"},{"$f":"VLOOKUP(A1705,'Counties and Regions'!$G$3:$J$74,3,FALSE)","v":"Vilas County"},"Other Services","F"]
[{"$f":"IF(COUNTIF($A$9:A1705,A1705)<24,A1705,A1705+1)","v":71},{"$f":"VLOOKUP(A1706,'Counties and Regions'!$G$3:$J$74,4,FALSE)","v":"Northern"},{"$f":"VLOOKUP(A1706,'Counties and Regions'!$G$3:$J$74,3,FALSE)","v":"Vilas County"},"Other Services","D"]
[{"$f":"IF(COUNTIF($A$9:A1706,A1706)<24,A1706,A1706+1)","v":71},{"$f":"VLOOKUP(A1707,'Counties and Regions'!$G$3:$J$74,4,FALSE)","v":"Northern"},{"$f":"VLOOKUP(A1707,'Counties and Regions'!$G$3:$J$74,3,FALSE)","v":"Vilas County"},"Other Services","B"]
[{"$f":"IF(COUNTIF($A$9:A1707,A1707)<24,A1707,A1707+1)","v":71},{"$f":"VLOOKUP(A1708,'Counties and Regions'!$G$3:$J$74,4,FALSE)","v":"Northern"},{"$f":"VLOOKUP(A1708,'Counties and Regions'!$G$3:$J$74,3,FALSE)","v":"Vilas County"},"Other Services","O"]
[{"$f":"IF(COUNTIF($A$9:A1708,A1708)<24,A1708,A1708+1)","v":71},{"$f":"VLOOKUP(A1709,'Counties and Regions'!$G$3:$J$74,4,FALSE)","v":"Northern"},{"$f":"VLOOKUP(A1709,'Counties and Regions'!$G$3:$J$74,3,FALSE)","v":"Vilas County"},"Additional Services","F"]
[{"$f":"IF(COUNTIF($A$9:A1709,A1709)<24,A1709,A1709+1)","v":71},{"$f":"VLOOKUP(A1710,'Counties and Regions'!$G$3:$J$74,4,FALSE)","v":"Northern"},{"$f":"VLOOKUP(A1710,'Counties and Regions'!$G$3:$J$74,3,FALSE)","v":"Vilas County"},"Additional Services","D"]
[{"$f":"IF(COUNTIF($A$9:A1710,A1710)<24,A1710,A1710+1)","v":71},{"$f":"VLOOKUP(A1711,'Counties and Regions'!$G$3:$J$74,4,FALSE)","v":"Northern"},{"$f":"VLOOKUP(A1711,'Counties and Regions'!$G$3:$J$74,3,FALSE)","v":"Vilas County"},"Additional Services","B"]
[{"$f":"IF(COUNTIF($A$9:A1711,A1711)<24,A1711,A1711+1)","v":71},{"$f":"VLOOKUP(A1712,'Counties and Regions'!$G$3:$J$74,4,FALSE)","v":"Northern"},{"$f":"VLOOKUP(A1712,'Counties and Regions'!$G$3:$J$74,3,FALSE)","v":"Vilas County"},"Additional Services","O"]
[{"$f":"IF(COUNTIF($A$9:A1712,A1712)<24,A1712,A1712+1)","v":72},{"$f":"VLOOKUP(A1713,'Counties and Regions'!$G$3:$J$74,4,FALSE)","v":"Northern"},{"$f":"VLOOKUP(A1713,'Counties and Regions'!$G$3:$J$74,3,FALSE)","v":"Wood County"},"Hospital Inpatient","F"]
[{"$f":"IF(COUNTIF($A$9:A1713,A1713)<24,A1713,A1713+1)","v":72},{"$f":"VLOOKUP(A1714,'Counties and Regions'!$G$3:$J$74,4,FALSE)","v":"Northern"},{"$f":"VLOOKUP(A1714,'Counties and Regions'!$G$3:$J$74,3,FALSE)","v":"Wood County"},"Hospital Inpatient","D"]
[{"$f":"IF(COUNTIF($A$9:A1714,A1714)<24,A1714,A1714+1)","v":72},{"$f":"VLOOKUP(A1715,'Counties and Regions'!$G$3:$J$74,4,FALSE)","v":"Northern"},{"$f":"VLOOKUP(A1715,'Counties and Regions'!$G$3:$J$74,3,FALSE)","v":"Wood County"},"Hospital Inpatient","B"]
[{"$f":"IF(COUNTIF($A$9:A1715,A1715)<24,A1715,A1715+1)","v":72},{"$f":"VLOOKUP(A1716,'Counties and Regions'!$G$3:$J$74,4,FALSE)","v":"Northern"},{"$f":"VLOOKUP(A1716,'Counties and Regions'!$G$3:$J$74,3,FALSE)","v":"Wood County"},"Hospital Inpatient","O"]
[{"$f":"IF(COUNTIF($A$9:A1716,A1716)<24,A1716,A1716+1)","v":72},{"$f":"VLOOKUP(A1717,'Counties and Regions'!$G$3:$J$74,4,FALSE)","v":"Northern"},{"$f":"VLOOKUP(A1717,'Counties and Regions'!$G$3:$J$74,3,FALSE)","v":"Wood County"},"Hospital Outpatient","F"]
[{"$f":"IF(COUNTIF($A$9:A1717,A1717)<24,A1717,A1717+1)","v":72},{"$f":"VLOOKUP(A1718,'Counties and Regions'!$G$3:$J$74,4,FALSE)","v":"Northern"},{"$f":"VLOOKUP(A1718,'Counties and Regions'!$G$3:$J$74,3,FALSE)","v":"Wood County"},"Hospital Outpatient","D"]
[{"$f":"IF(COUNTIF($A$9:A1718,A1718)<24,A1718,A1718+1)","v":72},{"$f":"VLOOKUP(A1719,'Counties and Regions'!$G$3:$J$74,4,FALSE)","v":"Northern"},{"$f":"VLOOKUP(A1719,'Counties and Regions'!$G$3:$J$74,3,FALSE)","v":"Wood County"},"Hospital Outpatient","B"]
[{"$f":"IF(COUNTIF($A$9:A1719,A1719)<24,A1719,A1719+1)","v":72},{"$f":"VLOOKUP(A1720,'Counties and Regions'!$G$3:$J$74,4,FALSE)","v":"Northern"},{"$f":"VLOOKUP(A1720,'Counties and Regions'!$G$3:$J$74,3,FALSE)","v":"Wood County"},"Hospital Outpatient","O"]
[{"$f":"IF(COUNTIF($A$9:A1720,A1720)<24,A1720,A1720+1)","v":72},{"$f":"VLOOKUP(A1721,'Counties and Regions'!$G$3:$J$74,4,FALSE)","v":"Northern"},{"$f":"VLOOKUP(A1721,'Counties and Regions'!$G$3:$J$74,3,FALSE)","v":"Wood County"},"Other Facility","F"]
[{"$f":"IF(COUNTIF($A$9:A1721,A1721)<24,A1721,A1721+1)","v":72},{"$f":"VLOOKUP(A1722,'Counties and Regions'!$G$3:$J$74,4,FALSE)","v":"Northern"},{"$f":"VLOOKUP(A1722,'Counties and Regions'!$G$3:$J$74,3,FALSE)","v":"Wood County"},"Other Facility","D"]
[{"$f":"IF(COUNTIF($A$9:A1722,A1722)<24,A1722,A1722+1)","v":72},{"$f":"VLOOKUP(A1723,'Counties and Regions'!$G$3:$J$74,4,FALSE)","v":"Northern"},{"$f":"VLOOKUP(A1723,'Counties and Regions'!$G$3:$J$74,3,FALSE)","v":"Wood County"},"Other Facility","B"]
[{"$f":"IF(COUNTIF($A$9:A1723,A1723)<24,A1723,A1723+1)","v":72},{"$f":"VLOOKUP(A1724,'Counties and Regions'!$G$3:$J$74,4,FALSE)","v":"Northern"},{"$f":"VLOOKUP(A1724,'Counties and Regions'!$G$3:$J$74,3,FALSE)","v":"Wood County"},"Other Facility","O"]
[{"$f":"IF(COUNTIF($A$9:A1724,A1724)<24,A1724,A1724+1)","v":72},{"$f":"VLOOKUP(A1725,'Counties and Regions'!$G$3:$J$74,4,FALSE)","v":"Northern"},{"$f":"VLOOKUP(A1725,'Counties and Regions'!$G$3:$J$74,3,FALSE)","v":"Wood County"},"Physician Services","F"]
[{"$f":"IF(COUNTIF($A$9:A1725,A1725)<24,A1725,A1725+1)","v":72},{"$f":"VLOOKUP(A1726,'Counties and Regions'!$G$3:$J$74,4,FALSE)","v":"Northern"},{"$f":"VLOOKUP(A1726,'Counties and Regions'!$G$3:$J$74,3,FALSE)","v":"Wood County"},"Physician Services","D"]
[{"$f":"IF(COUNTIF($A$9:A1726,A1726)<24,A1726,A1726+1)","v":72},{"$f":"VLOOKUP(A1727,'Counties and Regions'!$G$3:$J$74,4,FALSE)","v":"Northern"},{"$f":"VLOOKUP(A1727,'Counties and Regions'!$G$3:$J$74,3,FALSE)","v":"Wood County"},"Physician Services","B"]
[{"$f":"IF(COUNTIF($A$9:A1727,A1727)<24,A1727,A1727+1)","v":72},{"$f":"VLOOKUP(A1728,'Counties and Regions'!$G$3:$J$74,4,FALSE)","v":"Northern"},{"$f":"VLOOKUP(A1728,'Counties and Regions'!$G$3:$J$74,3,FALSE)","v":"Wood County"},"Physician Services","O"]
[{"$f":"IF(COUNTIF($A$9:A1728,A1728)<24,A1728,A1728+1)","v":72},{"$f":"VLOOKUP(A1729,'Counties and Regions'!$G$3:$J$74,4,FALSE)","v":"Northern"},{"$f":"VLOOKUP(A1729,'Counties and Regions'!$G$3:$J$74,3,FALSE)","v":"Wood County"},"Other Services","F"]
[{"$f":"IF(COUNTIF($A$9:A1729,A1729)<24,A1729,A1729+1)","v":72},{"$f":"VLOOKUP(A1730,'Counties and Regions'!$G$3:$J$74,4,FALSE)","v":"Northern"},{"$f":"VLOOKUP(A1730,'Counties and Regions'!$G$3:$J$74,3,FALSE)","v":"Wood County"},"Other Services","D"]
[{"$f":"IF(COUNTIF($A$9:A1730,A1730)<24,A1730,A1730+1)","v":72},{"$f":"VLOOKUP(A1731,'Counties and Regions'!$G$3:$J$74,4,FALSE)","v":"Northern"},{"$f":"VLOOKUP(A1731,'Counties and Regions'!$G$3:$J$74,3,FALSE)","v":"Wood County"},"Other Services","B"]
[{"$f":"IF(COUNTIF($A$9:A1731,A1731)<24,A1731,A1731+1)","v":72},{"$f":"VLOOKUP(A1732,'Counties and Regions'!$G$3:$J$74,4,FALSE)","v":"Northern"},{"$f":"VLOOKUP(A1732,'Counties and Regions'!$G$3:$J$74,3,FALSE)","v":"Wood County"},"Other Services","O"]
[{"$f":"IF(COUNTIF($A$9:A1732,A1732)<24,A1732,A1732+1)","v":72},{"$f":"VLOOKUP(A1733,'Counties and Regions'!$G$3:$J$74,4,FALSE)","v":"Northern"},{"$f":"VLOOKUP(A1733,'Counties and Regions'!$G$3:$J$74,3,FALSE)","v":"Wood County"},"Additional Services","F"]
[{"$f":"IF(COUNTIF($A$9:A1733,A1733)<24,A1733,A1733+1)","v":72},{"$f":"VLOOKUP(A1734,'Counties and Regions'!$G$3:$J$74,4,FALSE)","v":"Northern"},{"$f":"VLOOKUP(A1734,'Counties and Regions'!$G$3:$J$74,3,FALSE)","v":"Wood County"},"Additional Services","D"]
[{"$f":"IF(COUNTIF($A$9:A1734,A1734)<24,A1734,A1734+1)","v":72},{"$f":"VLOOKUP(A1735,'Counties and Regions'!$G$3:$J$74,4,FALSE)","v":"Northern"},{"$f":"VLOOKUP(A1735,'Counties and Regions'!$G$3:$J$74,3,FALSE)","v":"Wood County"},"Additional Services","B"]
[{"$f":"IF(COUNTIF($A$9:A1735,A1735)<24,A1735,A1735+1)","v":72},{"$f":"VLOOKUP(A1736,'Counties and Regions'!$G$3:$J$74,4,FALSE)","v":"Northern"},{"$f":"VLOOKUP(A1736,'Counties and Regions'!$G$3:$J$74,3,FALSE)","v":"Wood County"},"Additional Services","O"]