{"text_format":"1","workbook":"xlsx","n_sheets":8,"sheets":["Hide from Carriers>>","Urban & Non-Urban Counties","Counties and Regions","Check Tab Number & County","Region_Map","Region, by Zip","Show to Carriers>>>","Table"],"not_rendered":{"charts":0,"images":0,"macros":1,"external_links":1,"defined_names":1,"comments":0,"pivot_tables":3},"unopened":[],"bounds":{"document_bytes":16777216,"sheet_cells":100000,"rows_first":2000,"rows_last":500,"rows_between":2000,"halvings":0,"cell_chars":16384,"cell_head_chars":4096},"cells_cut":0,"cells_raw":0,"read":"whole","date_system":"1900"}

{"sheet":"Hide from Carriers>>","index":0,"n_rows":0,"n_cols":0,"rows_kept":0,"cut":false,"hidden":true,"merged":[]}

{"sheet":"Urban & Non-Urban Counties","index":1,"n_rows":76,"n_cols":8,"rows_kept":76,"cut":false,"hidden":true,"merged":[]}
["Classification (Urban/Non-Urban)","Urban",null,"Classification (Urban/Non-Urban)","Non-Urban",null,"Classification (Urban/Non-Urban)","(All)"]
[]
["Row Labels",null,null,"Row Labels",null,null,"Row Labels"]
["Brown County",null,null,"Adams County",null,null,"Adams County"]
["Dane County",null,null,"Ashland County",null,null,"Ashland County"]
["Kenosha County",null,null,"Barron County",null,null,"Barron County"]
["Milwaukee County",null,null,"Bayfield County",null,null,"Bayfield County"]
["Ozaukee County",null,null,"Buffalo County",null,null,"Brown County"]
["Racine County",null,null,"Burnett County",null,null,"Buffalo County"]
["Washington County",null,null,"Calumet County",null,null,"Burnett County"]
["Waukesha County",null,null,"Chippewa County",null,null,"Calumet County"]
["Grand Total",null,null,"Clark County",null,null,"Chippewa County"]
[null,null,null,"Columbia County",null,null,"Clark County"]
[null,null,null,"Crawford County",null,null,"Columbia County"]
[null,null,null,"Dodge County",null,null,"Crawford County"]
[null,null,null,"Door County",null,null,"Dane County"]
[null,null,null,"Douglas County",null,null,"Dodge County"]
[null,null,null,"Dunn County",null,null,"Door County"]
[null,null,null,"Eau Claire County",null,null,"Douglas County"]
[null,null,null,"Florence County",null,null,"Dunn County"]
[null,null,null,"Fond Du Lac County",null,null,"Eau Claire County"]
[null,null,null,"Forest County",null,null,"Florence County"]
[null,null,null,"Grant County",null,null,"Fond Du Lac County"]
[null,null,null,"Green County",null,null,"Forest County"]
[null,null,null,"Green Lake County",null,null,"Grant County"]
[null,null,null,"Iowa County",null,null,"Green County"]
[null,null,null,"Iron County",null,null,"Green Lake County"]
[null,null,null,"Jackson County",null,null,"Iowa County"]
[null,null,null,"Jefferson County",null,null,"Iron County"]
[null,null,null,"Juneau County",null,null,"Jackson County"]
{"$rows_left_out":47}
{"sheet":"Counties and Regions","index":2,"n_rows":74,"n_cols":13,"rows_kept":74,"cut":false,"hidden":true,"merged":[]}
[]
[null,"Southern","Eastern","Western","Northern",null,"Number","Text","County","Region","Urban/Non-Urban",null,"Check"]
[null,"Adams County","Kenosha County","Barron County","Ashland County",null,1,{"$f":"TEXT(G3,\"##\")","v":"1"},{"$f":"B3","v":"Adams County"},{"$f":"$B$2","v":"Southern"},{"$f":"IF(ISNA(VLOOKUP(I3,'[1]Urban & Non-Urban Counties'!$A$4:$A$11,1,FALSE)),\"Non-Urban\",\"Urban\")","v":"Non-Urban"},{"$f":"VLOOKUP(I3,[1]Region_Map!$A$4:$C$75,3,FALSE)","v":"Southern"},{"$f":"IF(L3=J3,\"OK\",\"error\")","v":"OK"}]
[null,"Columbia County","Milwaukee County","Buffalo County","Bayfield County",null,{"$f":"G3+1","v":2},{"$f":"TEXT(G4,\"##\")","v":"2"},{"$f":"B4","v":"Columbia County"},{"$f":"$B$2","v":"Southern"},{"$f":"IF(ISNA(VLOOKUP(I4,'[1]Urban & Non-Urban Counties'!$A$4:$A$11,1,FALSE)),\"Non-Urban\",\"Urban\")","v":"Non-Urban"},{"$f":"VLOOKUP(I4,[1]Region_Map!$A$4:$C$75,3,FALSE)","v":"Southern"},{"$f":"IF(L4=J4,\"OK\",\"error\")","v":"OK"}]
[null,"Crawford County","Ozaukee County","Burnett County","Florence County",null,{"$f":"G4+1","v":3},"3","Crawford County","Southern",{"$f":"IF(ISNA(VLOOKUP(I5,'[1]Urban & Non-Urban Counties'!$A$4:$A$11,1,FALSE)),\"Non-Urban\",\"Urban\")","v":"Non-Urban"},{"$f":"VLOOKUP(I5,[1]Region_Map!$A$4:$C$75,3,FALSE)","v":"Southern"},"OK"]
[null,"Dane County","Racine County","Chippewa County","Forest County",null,4,"4","Dane County","Southern",{"$f":"IF(ISNA(VLOOKUP(I6,'[1]Urban & Non-Urban Counties'!$A$4:$A$11,1,FALSE)),\"Non-Urban\",\"Urban\")","v":"Urban"},{"$f":"VLOOKUP(I6,[1]Region_Map!$A$4:$C$75,3,FALSE)","v":"Southern"},"OK"]
[null,"Dodge County","Washington County","Clark County","Iron County",null,5,"5","Dodge County","Southern",{"$f":"IF(ISNA(VLOOKUP(I7,'[1]Urban & Non-Urban Counties'!$A$4:$A$11,1,FALSE)),\"Non-Urban\",\"Urban\")","v":"Non-Urban"},{"$f":"VLOOKUP(I7,[1]Region_Map!$A$4:$C$75,3,FALSE)","v":"Southern"},"OK"]
[null,"Grant County","Waukesha County","Douglas County","Langlade County",null,6,"6","Grant County","Southern",{"$f":"IF(ISNA(VLOOKUP(I8,'[1]Urban & Non-Urban Counties'!$A$4:$A$11,1,FALSE)),\"Non-Urban\",\"Urban\")","v":"Non-Urban"},{"$f":"VLOOKUP(I8,[1]Region_Map!$A$4:$C$75,3,FALSE)","v":"Southern"},"OK"]
[null,"Green County","Brown County","Dunn County","Lincoln County",null,7,"7","Green County","Southern",{"$f":"IF(ISNA(VLOOKUP(I9,'[1]Urban & Non-Urban Counties'!$A$4:$A$11,1,FALSE)),\"Non-Urban\",\"Urban\")","v":"Non-Urban"},{"$f":"VLOOKUP(I9,[1]Region_Map!$A$4:$C$75,3,FALSE)","v":"Southern"},"OK"]
[null,"Iowa County","Calumet County","Eau Claire County","Marathon County",null,8,"8","Iowa County","Southern",{"$f":"IF(ISNA(VLOOKUP(I10,'[1]Urban & Non-Urban Counties'!$A$4:$A$11,1,FALSE)),\"Non-Urban\",\"Urban\")","v":"Non-Urban"},{"$f":"VLOOKUP(I10,[1]Region_Map!$A$4:$C$75,3,FALSE)","v":"Southern"},"OK"]
[null,"Jefferson County","Door County","Jackson County","Oneida County",null,9,"9","Jefferson County","Southern",{"$f":"IF(ISNA(VLOOKUP(I11,'[1]Urban & Non-Urban Counties'!$A$4:$A$11,1,FALSE)),\"Non-Urban\",\"Urban\")","v":"Non-Urban"},{"$f":"VLOOKUP(I11,[1]Region_Map!$A$4:$C$75,3,FALSE)","v":"Southern"},"OK"]
[null,"Juneau County","Fond du Lac County","Pepin County","Portage County",null,10,"10","Juneau County","Southern",{"$f":"IF(ISNA(VLOOKUP(I12,'[1]Urban & Non-Urban Counties'!$A$4:$A$11,1,FALSE)),\"Non-Urban\",\"Urban\")","v":"Non-Urban"},{"$f":"VLOOKUP(I12,[1]Region_Map!$A$4:$C$75,3,FALSE)","v":"Southern"},"OK"]
[null,"Lafayette County","Green Lake County","Pierce County","Price County",null,11,"11","Lafayette County","Southern",{"$f":"IF(ISNA(VLOOKUP(I13,'[1]Urban & Non-Urban Counties'!$A$4:$A$11,1,FALSE)),\"Non-Urban\",\"Urban\")","v":"Non-Urban"},{"$f":"VLOOKUP(I13,[1]Region_Map!$A$4:$C$75,3,FALSE)","v":"Southern"},"OK"]
[null,"La Crosse County","Kewaunee County","Polk County","Sawyer County",null,12,"12","La Crosse County","Southern",{"$f":"IF(ISNA(VLOOKUP(I14,'[1]Urban & Non-Urban Counties'!$A$4:$A$11,1,FALSE)),\"Non-Urban\",\"Urban\")","v":"Non-Urban"},{"$f":"VLOOKUP(I14,[1]Region_Map!$A$4:$C$75,3,FALSE)","v":"Southern"},"OK"]
[null,"Monroe County","Manitowoc County","Rusk County","Taylor County",null,13,"13","Monroe County","Southern",{"$f":"IF(ISNA(VLOOKUP(I15,'[1]Urban & Non-Urban Counties'!$A$4:$A$11,1,FALSE)),\"Non-Urban\",\"Urban\")","v":"Non-Urban"},{"$f":"VLOOKUP(I15,[1]Region_Map!$A$4:$C$75,3,FALSE)","v":"Southern"},"OK"]
[null,"Richland County","Marinette County","St. Croix County","Vilas County",null,14,"14","Richland County","Southern",{"$f":"IF(ISNA(VLOOKUP(I16,'[1]Urban & Non-Urban Counties'!$A$4:$A$11,1,FALSE)),\"Non-Urban\",\"Urban\")","v":"Non-Urban"},{"$f":"VLOOKUP(I16,[1]Region_Map!$A$4:$C$75,3,FALSE)","v":"Southern"},"OK"]
[null,"Rock County","Marquette County","Trempealeau County","Wood County",null,15,"15","Rock County","Southern",{"$f":"IF(ISNA(VLOOKUP(I17,'[1]Urban & Non-Urban Counties'!$A$4:$A$11,1,FALSE)),\"Non-Urban\",\"Urban\")","v":"Non-Urban"},{"$f":"VLOOKUP(I17,[1]Region_Map!$A$4:$C$75,3,FALSE)","v":"Southern"},"OK"]
[null,"Sauk County","Menominee County","Washburn County",null,null,16,"16","Sauk County","Southern",{"$f":"IF(ISNA(VLOOKUP(I18,'[1]Urban & Non-Urban Counties'!$A$4:$A$11,1,FALSE)),\"Non-Urban\",\"Urban\")","v":"Non-Urban"},{"$f":"VLOOKUP(I18,[1]Region_Map!$A$4:$C$75,3,FALSE)","v":"Southern"},"OK"]
[null,"Vernon County","Oconto County",null,null,null,17,"17","Vernon County","Southern",{"$f":"IF(ISNA(VLOOKUP(I19,'[1]Urban & Non-Urban Counties'!$A$4:$A$11,1,FALSE)),\"Non-Urban\",\"Urban\")","v":"Non-Urban"},{"$f":"VLOOKUP(I19,[1]Region_Map!$A$4:$C$75,3,FALSE)","v":"Southern"},"OK"]
[null,"Walworth County","Outagamie County",null,null,null,18,"18","Walworth County","Southern",{"$f":"IF(ISNA(VLOOKUP(I20,'[1]Urban & Non-Urban Counties'!$A$4:$A$11,1,FALSE)),\"Non-Urban\",\"Urban\")","v":"Non-Urban"},{"$f":"VLOOKUP(I20,[1]Region_Map!$A$4:$C$75,3,FALSE)","v":"Southern"},"OK"]
[null,null,"Shawano County",null,null,null,19,"19",{"$f":"C3","v":"Kenosha County"},{"$f":"$C$2","v":"Eastern"},{"$f":"IF(ISNA(VLOOKUP(I21,'[1]Urban & Non-Urban Counties'!$A$4:$A$11,1,FALSE)),\"Non-Urban\",\"Urban\")","v":"Urban"},{"$f":"VLOOKUP(I21,[1]Region_Map!$A$4:$C$75,3,FALSE)","v":"Eastern"},"OK"]
[null,null,"Sheboygan County",null,null,null,20,"20",{"$f":"C4","v":"Milwaukee County"},"Eastern",{"$f":"IF(ISNA(VLOOKUP(I22,'[1]Urban & Non-Urban Counties'!$A$4:$A$11,1,FALSE)),\"Non-Urban\",\"Urban\")","v":"Urban"},{"$f":"VLOOKUP(I22,[1]Region_Map!$A$4:$C$75,3,FALSE)","v":"Eastern"},"OK"]
[null,null,"Waupaca County",null,null,null,21,"21","Ozaukee County","Eastern",{"$f":"IF(ISNA(VLOOKUP(I23,'[1]Urban & Non-Urban Counties'!$A$4:$A$11,1,FALSE)),\"Non-Urban\",\"Urban\")","v":"Urban"},{"$f":"VLOOKUP(I23,[1]Region_Map!$A$4:$C$75,3,FALSE)","v":"Eastern"},"OK"]
[null,null,"Waushara County",null,null,null,22,"22","Racine County","Eastern",{"$f":"IF(ISNA(VLOOKUP(I24,'[1]Urban & Non-Urban Counties'!$A$4:$A$11,1,FALSE)),\"Non-Urban\",\"Urban\")","v":"Urban"},{"$f":"VLOOKUP(I24,[1]Region_Map!$A$4:$C$75,3,FALSE)","v":"Eastern"},"OK"]
[null,null,"Winnebago County",null,null,null,23,"23","Washington County","Eastern",{"$f":"IF(ISNA(VLOOKUP(I25,'[1]Urban & Non-Urban Counties'!$A$4:$A$11,1,FALSE)),\"Non-Urban\",\"Urban\")","v":"Urban"},{"$f":"VLOOKUP(I25,[1]Region_Map!$A$4:$C$75,3,FALSE)","v":"Eastern"},"OK"]
[null,null,null,null,null,null,24,"24","Waukesha County","Eastern",{"$f":"IF(ISNA(VLOOKUP(I26,'[1]Urban & Non-Urban Counties'!$A$4:$A$11,1,FALSE)),\"Non-Urban\",\"Urban\")","v":"Urban"},{"$f":"VLOOKUP(I26,[1]Region_Map!$A$4:$C$75,3,FALSE)","v":"Eastern"},"OK"]
[null,null,null,null,null,null,25,"25","Brown County","Eastern",{"$f":"IF(ISNA(VLOOKUP(I27,'[1]Urban & Non-Urban Counties'!$A$4:$A$11,1,FALSE)),\"Non-Urban\",\"Urban\")","v":"Urban"},{"$f":"VLOOKUP(I27,[1]Region_Map!$A$4:$C$75,3,FALSE)","v":"Eastern"},"OK"]
[null,null,null,null,null,null,26,"26","Calumet County","Eastern",{"$f":"IF(ISNA(VLOOKUP(I28,'[1]Urban & Non-Urban Counties'!$A$4:$A$11,1,FALSE)),\"Non-Urban\",\"Urban\")","v":"Non-Urban"},{"$f":"VLOOKUP(I28,[1]Region_Map!$A$4:$C$75,3,FALSE)","v":"Eastern"},"OK"]
[null,null,null,null,null,null,27,"27","Door County","Eastern",{"$f":"IF(ISNA(VLOOKUP(I29,'[1]Urban & Non-Urban Counties'!$A$4:$A$11,1,FALSE)),\"Non-Urban\",\"Urban\")","v":"Non-Urban"},{"$f":"VLOOKUP(I29,[1]Region_Map!$A$4:$C$75,3,FALSE)","v":"Eastern"},"OK"]
[null,null,null,null,null,null,28,"28","Fond du Lac County","Eastern",{"$f":"IF(ISNA(VLOOKUP(I30,'[1]Urban & Non-Urban Counties'!$A$4:$A$11,1,FALSE)),\"Non-Urban\",\"Urban\")","v":"Non-Urban"},{"$f":"VLOOKUP(I30,[1]Region_Map!$A$4:$C$75,3,FALSE)","v":"Eastern"},"OK"]
{"$rows_left_out":45}
{"sheet":"Check Tab Number & County","index":3,"n_rows":74,"n_cols":9,"rows_kept":74,"cut":false,"hidden":true,"merged":[]}
[]
[null,"Tab #","County","Region"]
[null,{"$f":"'Counties and Regions'!G3","v":1},{"$f":"IFERROR(INDIRECT(\"'\"&$B3&\"'!B1\"),\"\")","v":""},{"$f":"IFERROR(INDIRECT(\"'\"&$B3&\"'!B2\"),\"\")","v":""},null,null,null,null,"DO NOT EDIT THIS TAB"]
[null,{"$f":"B3+1","v":2},{"$f":"IFERROR(INDIRECT(\"'\"&$B4&\"'!B1\"),\"\")","v":""},{"$f":"IFERROR(INDIRECT(\"'\"&$B4&\"'!B2\"),\"\")","v":""}]
[null,{"$f":"B4+1","v":3},"","",null,null,null,null,"EDIT IN TAB \"Counties and Regions\""]
[null,4,"",""]
[null,5,"",""]
[null,6,"",""]
[null,7,"",""]
[null,8,"",""]
[null,9,"",""]
[null,10,"",""]
[null,11,"",""]
[null,12,"",""]
[null,13,"",""]
[null,14,"",""]
[null,15,"",""]
[null,16,"",""]
[null,17,"",""]
[null,18,"",""]
[null,19,"",""]
[null,20,"",""]
[null,21,"",""]
[null,22,"",""]
[null,23,"",""]
[null,24,"",""]
[null,25,"",""]
[null,26,"",""]
[null,27,"",""]
[null,28,"",""]
{"$rows_left_out":45}
{"sheet":"Region_Map","index":4,"n_rows":75,"n_cols":7,"rows_kept":75,"cut":false,"hidden":true,"merged":[]}
[null,null,null,"Mediciad"]
["County","Current","Proposed","Rates"]
[null,null,null,null,null,null,"Source:"]
["Green Lake County","Northeastern","Eastern","Central",null,null,"P:\\Wisconsin\\2016\\Self-Insured RFP\\[Region Mapping - GeoAccess - Urban vs Other.xlsx]Region_Map"]
["Marquette County","Northeastern","Eastern","Central"]
["Waushara County","Northeastern","Eastern","Central"]
["Brown County","Northeastern","Eastern","Northeastern"]
["Calumet County","Northeastern","Eastern","Northeastern"]
["Door County","Northeastern","Eastern","Northeastern"]
["Fond Du Lac County","Northeastern","Eastern","Northeastern"]
["Kewaunee County","Northeastern","Eastern","Northeastern"]
["Manitowoc County","Northeastern","Eastern","Northeastern"]
["Marinette County","Northeastern","Eastern","Northeastern"]
["Menominee County","Northeastern","Eastern","Northeastern"]
["Oconto County","Northeastern","Eastern","Northeastern"]
["Outagamie County","Northeastern","Eastern","Northeastern"]
["Sheboygan County","Northeastern","Eastern","Northeastern"]
["Waupaca County","Northeastern","Eastern","Northeastern"]
["Winnebago County","Northeastern","Eastern","Northeastern"]
["Shawano County","Northeastern","Eastern","Northern"]
["Portage County","Northern","Northern","Central"]
["Wood County","Northern","Northern","Central"]
["Florence County","Northern","Northern","Northeastern"]
["Ashland County","Northern","Northern","Northern"]
["Bayfield County","Northern","Northern","Northern"]
["Forest County","Northern","Northern","Northern"]
["Iron County","Northern","Northern","Northern"]
["Langlade County","Northern","Northern","Northern"]
["Lincoln County","Northern","Northern","Northern"]
["Marathon County","Northern","Northern","Northern"]
{"$rows_left_out":46}
{"sheet":"Region, by Zip","index":5,"n_rows":899,"n_cols":9,"rows_kept":899,"cut":false,"hidden":true,"merged":[]}
["ZIP Code","Type","Common Cities","County","Classification (Urban/Non-Urban)","Region"]
[53910,"Standard","Adams","Adams County","Non-Urban",{"$f":"VLOOKUP(D2,Region_Map!$A$4:$C$75,3,FALSE)","v":"Southern"}]
[53927,"PO Box","Dellwood","Adams County","Non-Urban",{"$f":"VLOOKUP(D3,Region_Map!$A$4:$C$75,3,FALSE)","v":"Southern"},null,null,"Source:"]
[53934,"Standard","Friendship","Adams County","Non-Urban",{"$f":"VLOOKUP(D4,Region_Map!$A$4:$C$75,3,FALSE)","v":"Southern"},null,null,"P:\\Wisconsin\\2016\\Self-Insured RFP\\RFI\\[GeoAccess - Urban vs Other.xlsx]Region, by Zip"]
[53936,"Standard","Grand Marsh","Adams County","Non-Urban",{"$f":"VLOOKUP(D5,Region_Map!$A$4:$C$75,3,FALSE)","v":"Southern"}]
[53952,"Standard","Oxford, Brooks","Adams County","Non-Urban",{"$f":"VLOOKUP(D6,Region_Map!$A$4:$C$75,3,FALSE)","v":"Southern"}]
[54457,"Standard","Nekoosa","Adams County","Non-Urban",{"$f":"VLOOKUP(D7,Region_Map!$A$4:$C$75,3,FALSE)","v":"Southern"}]
[54613,"Standard","Arkdale","Adams County","Non-Urban",{"$f":"VLOOKUP(D8,Region_Map!$A$4:$C$75,3,FALSE)","v":"Southern"}]
[54514,"Standard","Butternut","Ashland County","Non-Urban",{"$f":"VLOOKUP(D9,Region_Map!$A$4:$C$75,3,FALSE)","v":"Northern"}]
[54517,"Standard","Clam Lake","Ashland County","Non-Urban",{"$f":"VLOOKUP(D10,Region_Map!$A$4:$C$75,3,FALSE)","v":"Northern"}]
[54527,"Standard","Glidden","Ashland County","Non-Urban",{"$f":"VLOOKUP(D11,Region_Map!$A$4:$C$75,3,FALSE)","v":"Northern"}]
[54546,"Standard","Mellen","Ashland County","Non-Urban",{"$f":"VLOOKUP(D12,Region_Map!$A$4:$C$75,3,FALSE)","v":"Northern"}]
[54806,"Standard","Ashland, Moquah, Sanborn","Ashland County","Non-Urban",{"$f":"VLOOKUP(D13,Region_Map!$A$4:$C$75,3,FALSE)","v":"Northern"}]
[54846,"Standard","High Bridge, Highbridge, Marengo","Ashland County","Non-Urban",{"$f":"VLOOKUP(D14,Region_Map!$A$4:$C$75,3,FALSE)","v":"Northern"}]
[54850,"PO Box","La Pointe","Ashland County","Non-Urban",{"$f":"VLOOKUP(D15,Region_Map!$A$4:$C$75,3,FALSE)","v":"Northern"}]
[54855,"Standard","Marengo","Ashland County","Non-Urban",{"$f":"VLOOKUP(D16,Region_Map!$A$4:$C$75,3,FALSE)","v":"Northern"}]
[54861,"PO Box","Odanah","Ashland County","Non-Urban",{"$f":"VLOOKUP(D17,Region_Map!$A$4:$C$75,3,FALSE)","v":"Northern"}]
[54004,"Standard","Clayton","Barron County","Non-Urban",{"$f":"VLOOKUP(D18,Region_Map!$A$4:$C$75,3,FALSE)","v":"Western"}]
[54728,"Standard","Chetek","Barron County","Non-Urban",{"$f":"VLOOKUP(D19,Region_Map!$A$4:$C$75,3,FALSE)","v":"Western"}]
[54733,"Standard","Dallas, Hillsdale","Barron County","Non-Urban",{"$f":"VLOOKUP(D20,Region_Map!$A$4:$C$75,3,FALSE)","v":"Western"}]
[54762,"Standard","Prairie Farm","Barron County","Non-Urban",{"$f":"VLOOKUP(D21,Region_Map!$A$4:$C$75,3,FALSE)","v":"Western"}]
[54805,"Standard","Almena","Barron County","Non-Urban",{"$f":"VLOOKUP(D22,Region_Map!$A$4:$C$75,3,FALSE)","v":"Western"}]
[54812,"Standard","Barron, Poskin","Barron County","Non-Urban",{"$f":"VLOOKUP(D23,Region_Map!$A$4:$C$75,3,FALSE)","v":"Western"}]
[54818,"PO Box","Brill","Barron County","Non-Urban",{"$f":"VLOOKUP(D24,Region_Map!$A$4:$C$75,3,FALSE)","v":"Western"}]
[54822,"Standard","Cameron","Barron County","Non-Urban",{"$f":"VLOOKUP(D25,Region_Map!$A$4:$C$75,3,FALSE)","v":"Western"}]
[54826,"Standard","Comstock","Barron County","Non-Urban",{"$f":"VLOOKUP(D26,Region_Map!$A$4:$C$75,3,FALSE)","v":"Western"}]
[54829,"Standard","Cumberland","Barron County","Non-Urban",{"$f":"VLOOKUP(D27,Region_Map!$A$4:$C$75,3,FALSE)","v":"Western"}]
[54841,"Standard","Haugen","Barron County","Non-Urban",{"$f":"VLOOKUP(D28,Region_Map!$A$4:$C$75,3,FALSE)","v":"Western"}]
[54857,"PO Box","Mikana","Barron County","Non-Urban",{"$f":"VLOOKUP(D29,Region_Map!$A$4:$C$75,3,FALSE)","v":"Western"}]
[54868,"Standard","Rice Lake, Canton","Barron County","Non-Urban",{"$f":"VLOOKUP(D30,Region_Map!$A$4:$C$75,3,FALSE)","v":"Western"}]
{"$rows_left_out":870}
{"sheet":"Show to Carriers>>>","index":6,"n_rows":0,"n_cols":0,"rows_kept":0,"cut":false,"hidden":true,"merged":[]}

{"sheet":"Table","index":7,"n_rows":1736,"n_cols":28,"rows_kept":1736,"cut":false,"hidden":false,"merged":[[1,2,1,10],[2,2,2,10],[6,10,6,15],[6,16,6,21],[6,22,6,27],[6,5,6,9]]}
[]
[null,"Proposer:"]
[null,"Network:"]
[]
[null,"Contract Type ->   F = Fee Schedule, D = Discount off submitted charges, B = Bundled payment, O = Other contract arrangement"]
[]
[null,null,null,null,null,"Total",null,null,null,null,"In-Network",null,null,null,null,null,"Intent",null,null,null,null,null,"Out-of-Network"]
[null,"Region","County","Major Service Category","Contract Type","# of Claims","# of Services","# of Admissions","# of Days","Billed","# of Claims","# of Services","# of Admissions","# of Days","Billed","Allowed","# of Claims","# of Services","# of Admissions","# of Days","Billed","Allowed","# of Claims","# of Services","# of Admissions","# of Days","Billed","Allowed"]
[1,{"$f":"VLOOKUP(A9,'Counties and Regions'!$G$3:$J$74,4,FALSE)","v":"Southern"},{"$f":"VLOOKUP(A9,'Counties and Regions'!$G$3:$J$74,3,FALSE)","v":"Adams County"},"Hospital Inpatient","F"]
[{"$f":"IF(COUNTIF($A$9:A9,A9)<24,A9,A9+1)","v":1},{"$f":"VLOOKUP(A10,'Counties and Regions'!$G$3:$J$74,4,FALSE)","v":"Southern"},{"$f":"VLOOKUP(A10,'Counties and Regions'!$G$3:$J$74,3,FALSE)","v":"Adams County"},"Hospital Inpatient","D"]
[{"$f":"IF(COUNTIF($A$9:A10,A10)<24,A10,A10+1)","v":1},{"$f":"VLOOKUP(A11,'Counties and Regions'!$G$3:$J$74,4,FALSE)","v":"Southern"},{"$f":"VLOOKUP(A11,'Counties and Regions'!$G$3:$J$74,3,FALSE)","v":"Adams County"},"Hospital Inpatient","B"]
[{"$f":"IF(COUNTIF($A$9:A11,A11)<24,A11,A11+1)","v":1},{"$f":"VLOOKUP(A12,'Counties and Regions'!$G$3:$J$74,4,FALSE)","v":"Southern"},{"$f":"VLOOKUP(A12,'Counties and Regions'!$G$3:$J$74,3,FALSE)","v":"Adams County"},"Hospital Inpatient","O"]
[{"$f":"IF(COUNTIF($A$9:A12,A12)<24,A12,A12+1)","v":1},{"$f":"VLOOKUP(A13,'Counties and Regions'!$G$3:$J$74,4,FALSE)","v":"Southern"},{"$f":"VLOOKUP(A13,'Counties and Regions'!$G$3:$J$74,3,FALSE)","v":"Adams County"},"Hospital Outpatient","F"]
[{"$f":"IF(COUNTIF($A$9:A13,A13)<24,A13,A13+1)","v":1},{"$f":"VLOOKUP(A14,'Counties and Regions'!$G$3:$J$74,4,FALSE)","v":"Southern"},{"$f":"VLOOKUP(A14,'Counties and Regions'!$G$3:$J$74,3,FALSE)","v":"Adams County"},"Hospital Outpatient","D"]
[{"$f":"IF(COUNTIF($A$9:A14,A14)<24,A14,A14+1)","v":1},{"$f":"VLOOKUP(A15,'Counties and Regions'!$G$3:$J$74,4,FALSE)","v":"Southern"},{"$f":"VLOOKUP(A15,'Counties and Regions'!$G$3:$J$74,3,FALSE)","v":"Adams County"},"Hospital Outpatient","B"]
[{"$f":"IF(COUNTIF($A$9:A15,A15)<24,A15,A15+1)","v":1},{"$f":"VLOOKUP(A16,'Counties and Regions'!$G$3:$J$74,4,FALSE)","v":"Southern"},{"$f":"VLOOKUP(A16,'Counties and Regions'!$G$3:$J$74,3,FALSE)","v":"Adams County"},"Hospital Outpatient","O"]
[{"$f":"IF(COUNTIF($A$9:A16,A16)<24,A16,A16+1)","v":1},{"$f":"VLOOKUP(A17,'Counties and Regions'!$G$3:$J$74,4,FALSE)","v":"Southern"},{"$f":"VLOOKUP(A17,'Counties and Regions'!$G$3:$J$74,3,FALSE)","v":"Adams County"},"Other Facility","F"]
[{"$f":"IF(COUNTIF($A$9:A17,A17)<24,A17,A17+1)","v":1},{"$f":"VLOOKUP(A18,'Counties and Regions'!$G$3:$J$74,4,FALSE)","v":"Southern"},{"$f":"VLOOKUP(A18,'Counties and Regions'!$G$3:$J$74,3,FALSE)","v":"Adams County"},"Other Facility","D"]
[{"$f":"IF(COUNTIF($A$9:A18,A18)<24,A18,A18+1)","v":1},{"$f":"VLOOKUP(A19,'Counties and Regions'!$G$3:$J$74,4,FALSE)","v":"Southern"},{"$f":"VLOOKUP(A19,'Counties and Regions'!$G$3:$J$74,3,FALSE)","v":"Adams County"},"Other Facility","B"]
[{"$f":"IF(COUNTIF($A$9:A19,A19)<24,A19,A19+1)","v":1},{"$f":"VLOOKUP(A20,'Counties and Regions'!$G$3:$J$74,4,FALSE)","v":"Southern"},{"$f":"VLOOKUP(A20,'Counties and Regions'!$G$3:$J$74,3,FALSE)","v":"Adams County"},"Other Facility","O"]
[{"$f":"IF(COUNTIF($A$9:A20,A20)<24,A20,A20+1)","v":1},{"$f":"VLOOKUP(A21,'Counties and Regions'!$G$3:$J$74,4,FALSE)","v":"Southern"},{"$f":"VLOOKUP(A21,'Counties and Regions'!$G$3:$J$74,3,FALSE)","v":"Adams County"},"Physician Services","F"]
[{"$f":"IF(COUNTIF($A$9:A21,A21)<24,A21,A21+1)","v":1},{"$f":"VLOOKUP(A22,'Counties and Regions'!$G$3:$J$74,4,FALSE)","v":"Southern"},{"$f":"VLOOKUP(A22,'Counties and Regions'!$G$3:$J$74,3,FALSE)","v":"Adams County"},"Physician Services","D"]
[{"$f":"IF(COUNTIF($A$9:A22,A22)<24,A22,A22+1)","v":1},{"$f":"VLOOKUP(A23,'Counties and Regions'!$G$3:$J$74,4,FALSE)","v":"Southern"},{"$f":"VLOOKUP(A23,'Counties and Regions'!$G$3:$J$74,3,FALSE)","v":"Adams County"},"Physician Services","B"]
[{"$f":"IF(COUNTIF($A$9:A23,A23)<24,A23,A23+1)","v":1},{"$f":"VLOOKUP(A24,'Counties and Regions'!$G$3:$J$74,4,FALSE)","v":"Southern"},{"$f":"VLOOKUP(A24,'Counties and Regions'!$G$3:$J$74,3,FALSE)","v":"Adams County"},"Physician Services","O"]
[{"$f":"IF(COUNTIF($A$9:A24,A24)<24,A24,A24+1)","v":1},{"$f":"VLOOKUP(A25,'Counties and Regions'!$G$3:$J$74,4,FALSE)","v":"Southern"},{"$f":"VLOOKUP(A25,'Counties and Regions'!$G$3:$J$74,3,FALSE)","v":"Adams County"},"Other Services","F"]
[{"$f":"IF(COUNTIF($A$9:A25,A25)<24,A25,A25+1)","v":1},{"$f":"VLOOKUP(A26,'Counties and Regions'!$G$3:$J$74,4,FALSE)","v":"Southern"},{"$f":"VLOOKUP(A26,'Counties and Regions'!$G$3:$J$74,3,FALSE)","v":"Adams County"},"Other Services","D"]
[{"$f":"IF(COUNTIF($A$9:A26,A26)<24,A26,A26+1)","v":1},{"$f":"VLOOKUP(A27,'Counties and Regions'!$G$3:$J$74,4,FALSE)","v":"Southern"},{"$f":"VLOOKUP(A27,'Counties and Regions'!$G$3:$J$74,3,FALSE)","v":"Adams County"},"Other Services","B"]
[{"$f":"IF(COUNTIF($A$9:A27,A27)<24,A27,A27+1)","v":1},{"$f":"VLOOKUP(A28,'Counties and Regions'!$G$3:$J$74,4,FALSE)","v":"Southern"},{"$f":"VLOOKUP(A28,'Counties and Regions'!$G$3:$J$74,3,FALSE)","v":"Adams County"},"Other Services","O"]
[{"$f":"IF(COUNTIF($A$9:A28,A28)<24,A28,A28+1)","v":1},{"$f":"VLOOKUP(A29,'Counties and Regions'!$G$3:$J$74,4,FALSE)","v":"Southern"},{"$f":"VLOOKUP(A29,'Counties and Regions'!$G$3:$J$74,3,FALSE)","v":"Adams County"},"Additional Services","F"]
[{"$f":"IF(COUNTIF($A$9:A29,A29)<24,A29,A29+1)","v":1},{"$f":"VLOOKUP(A30,'Counties and Regions'!$G$3:$J$74,4,FALSE)","v":"Southern"},{"$f":"VLOOKUP(A30,'Counties and Regions'!$G$3:$J$74,3,FALSE)","v":"Adams County"},"Additional Services","D"]
{"$rows_left_out":1706}